nixbot

builds

Mic92/nixbot build #454 failed

branch main · PR #255 · commit 4ef42f5f9a · · took 9m 8s · eval 27s

2 failed
failed attributes
status attribute duration
failed checks.aarch64-linux.nixbot-tests 36s
python3.14-nixbot-tests: msg = f"{settings.command[0]} failed with exit code {returncode}:\n{tail}" > raise EvalError(msg) E nix …
python3.14-nixbot-tests:
            msg = f"{settings.command[0]} failed with exit code {returncode}:\n{tail}"
>           raise EvalError(msg)
E           nixbot.nix_eval.EvalError: nix-eval-jobs failed with exit code 1:
E           error: while starting worker, evaluation worker crashed with signal 7 (Bus error); enable coredumps for a backtrace
nixbot/nix_eval.py:702: EvalError
=========================== short test summary info ============================
FAILED nixbot/tests/test_nix_eval.py::test_eval_runner_filters_configured_eval_systems[eval_systems1-expected_attrs1]
================== 1 failed, 850 passed, 13 skipped in 29.01s ==================
failed checks.x86_64-linux.nixbot-tests 38s
python3.14-nixbot-tests: E E - skipped_local E + succeeded nixbot/tests/test_pipeline.py:200: AssertionError ========================== …
python3.14-nixbot-tests:
E         
E         - skipped_local
E         + succeeded
nixbot/tests/test_pipeline.py:200: AssertionError
=========================== short test summary info ============================
FAILED nixbot/tests/test_pipeline.py::test_full_pipeline - nixbot.nix_eval.Ev...
FAILED nixbot/tests/test_pipeline.py::test_cached_skip_on_second_run - Assert...
================== 2 failed, 849 passed, 13 skipped in 29.64s ==================
13 succeeded
succeeded attributes
status attribute duration
loading…
15 already built
skipped attributes
status attribute duration
loading…