failed attributes
| status |
attribute |
duration |
| failed |
checks.aarch64-darwin.tincd-test
|
1m 37s |
tincd-test-0.1.0:
---- argv::help_commands_aligned stdout ----
thread 'argv::help_commands_aligned' (67524603) panicked at crates/tinc-tools/tests/tinc_cli/argv …
tincd-test-0.1.0:
---- argv::help_commands_aligned stdout ----
thread 'argv::help_commands_aligned' (67524603) panicked at crates/tinc-tools/tests/tinc_cli/argv.rs:94:36:
no column separator in " invite [-e KEY=VAL] [--replace] NODE Generate an invitation for NODE."
note: run with `RUST_BACKTRACE=1` environment variable to display a backtrace
failures:
argv::help_commands_aligned
test result: FAILED. 70 passed; 1 failed; 0 ignored; 0 measured; 0 filtered out; finished in 0.25s
error: test failed, to rerun pass `-p tinc-tools --test tinc_cli`
|
| failed |
checks.aarch64-linux.tincd-test
|
1m 14s |
tincd-test-0.1.0:
---- argv::help_commands_aligned stdout ----
thread 'argv::help_commands_aligned' (9462) panicked at crates/tinc-tools/tests/tinc_cli/argv.rs: …
tincd-test-0.1.0:
---- argv::help_commands_aligned stdout ----
thread 'argv::help_commands_aligned' (9462) panicked at crates/tinc-tools/tests/tinc_cli/argv.rs:94:36:
no column separator in " invite [-e KEY=VAL] [--replace] NODE Generate an invitation for NODE."
note: run with `RUST_BACKTRACE=1` environment variable to display a backtrace
failures:
argv::help_commands_aligned
test result: FAILED. 70 passed; 1 failed; 0 ignored; 0 measured; 0 filtered out; finished in 0.16s
error: test failed, to rerun pass `-p tinc-tools --test tinc_cli`
|
| failed |
checks.x86_64-linux.tincd-test
|
1m 1s |
tincd-test-0.1.0:
---- argv::help_commands_aligned stdout ----
thread 'argv::help_commands_aligned' (9372) panicked at crates/tinc-tools/tests/tinc_cli/argv.rs: …
tincd-test-0.1.0:
---- argv::help_commands_aligned stdout ----
thread 'argv::help_commands_aligned' (9372) panicked at crates/tinc-tools/tests/tinc_cli/argv.rs:94:36:
no column separator in " invite [-e KEY=VAL] [--replace] NODE Generate an invitation for NODE."
note: run with `RUST_BACKTRACE=1` environment variable to display a backtrace
failures:
argv::help_commands_aligned
test result: FAILED. 70 passed; 1 failed; 0 ignored; 0 measured; 0 filtered out; finished in 0.12s
error: test failed, to rerun pass `-p tinc-tools --test tinc_cli`
|