this derivation will be built: /nix/store/mnsnrw8cvb7c0ppprf0v0salym66nqzp-tincd-test-0.1.0.drv error: build of '/nix/store/mnsnrw8cvb7c0ppprf0v0salym66nqzp-tincd-test-0.1.0.drv' on 'ssh-ng://customer@mac02' failed: Cannot build '/nix/store/mnsnrw8cvb7c0ppprf0v0salym66nqzp-tincd-test-0.1.0.drv'. Reason: builder failed with exit code 101. Output paths: /nix/store/1vdda42i20iybqddsxisiln9365mrwgx-tincd-test-0.1.0 Last 25 log lines: > test cli_flags::mlock_flag_locks_or_fails_loudly ... ok > test control::tinc_up_runs_in_confbase ... FAILED > > failures: > > ---- control::tinc_up_runs_in_confbase stdout ---- > > thread 'control::tinc_up_runs_in_confbase' (67639604) panicked at crates/tincd/tests/stop/control.rs:220:5: > tinc-up did not run: > [INFO tincd] tincd 0.1.0 starting, debug level 0 > [INFO tincd] tincd starting, name=testnode > [INFO tincd] Device mode: Tun, interface: dummy > [INFO tincd::net] Listening on 0.0.0.0:50909 > [INFO tincd] Ready > [INFO tincd::script] Executing script tinc-up > > note: run with `RUST_BACKTRACE=1` environment variable to display a backtrace > > > failures: > control::tinc_up_runs_in_confbase > > test result: FAILED. 35 passed; 1 failed; 0 ignored; 0 measured; 0 filtered out; finished in 7.96s > > error: test failed, to rerun pass `-p tincd --test stop` For full logs, run: nix log /nix/store/mnsnrw8cvb7c0ppprf0v0salym66nqzp-tincd-test-0.1.0.drv error: Cannot build '/nix/store/mnsnrw8cvb7c0ppprf0v0salym66nqzp-tincd-test-0.1.0.drv'. Reason: builder failed with exit code 1. Output paths: /nix/store/1vdda42i20iybqddsxisiln9365mrwgx-tincd-test-0.1.0