these 2 derivations will be built: /nix/store/w5c3xanj0gnrx59yfklzlvmgza2k8ln5-tincd-deps-0.1.0.drv /nix/store/smw8apjzm62v7z1w04hsglz0yaphi69p-tincd-test-0.1.0.drv Failed to find a machine for remote build! derivation: smw8apjzm62v7z1w04hsglz0yaphi69p-tincd-test-0.1.0.drv required (system, features): (aarch64-linux, []) 1 available machines: (systems, maxjobs, supportedFeatures, mandatoryFeatures) ([aarch64-darwin, x86_64-darwin], 8, [big-parallel, recursive-nix], []) error: Cannot build '/nix/store/smw8apjzm62v7z1w04hsglz0yaphi69p-tincd-test-0.1.0.drv'. Reason: builder failed with exit code 101. Output paths: /nix/store/l2d75crz7frhabgybrybzil52yq4fk6m-tincd-test-0.1.0 Last 25 log lines: > test discovery::probe::tests::testnet_port_probe_roundtrip ... ok > test discovery::tests::testnet_first_publish_waits_for_dialable ... ok > test portmap::igd::tests::http_roundtrip_bounded ... ok > test discovery::tests::testnet_persist_roundtrip ... ok > test discovery::tests::testnet_publish_resolve_roundtrip_secret ... ok > test discovery::tests::testnet_publish_resolve_roundtrip_nosecret ... ok > test discovery::tests::testnet_period_rollover_fallback ... ok > test discovery::tests::testnet_dirty_preserved_while_publish_gated ... FAILED > test discovery::tests::testnet_background_resolve_roundtrip ... ok > > failures: > > ---- discovery::tests::testnet_dirty_preserved_while_publish_gated stdout ---- > > thread 'discovery::tests::testnet_dirty_preserved_while_publish_gated' (13521) panicked at crates/tincd/src/discovery/mod.rs:879:50: > republish after gate opens > note: run with `RUST_BACKTRACE=1` environment variable to display a backtrace > > > failures: > discovery::tests::testnet_dirty_preserved_while_publish_gated > > test result: FAILED. 665 passed; 1 failed; 0 ignored; 0 measured; 0 filtered out; finished in 10.05s > > error: test failed, to rerun pass `-p tincd --lib` For full logs, run: nix log /nix/store/smw8apjzm62v7z1w04hsglz0yaphi69p-tincd-test-0.1.0.drv