nixbot

builds

failed tincd-test-0.1.0 checks.aarch64-linux.tincd-test · build #31 · raw

1tribuchet: building on eliza
unpackPhase
2unpacking source archive /nix/store/xgahrq7iy8gq16jnhsiklgl4756j0i9f-source3source root is source
patchPhase
4Executing configureCargoCommonVars5decompressing cargo artifacts from /nix/store/2pg0ihf1vvsq9rpj7lir808i98nz7883-tincd-deps-0.1.0/target.tar.zst to target
configurePhase
6will append /build/source/.cargo-home/config.toml with contents of /nix/store/bd94ryyhxddiwm2gdw9khw379p6mkj1w-vendor-cargo-deps/config.toml7default configurePhase, nothing to do
buildPhase
8+++ command cargo --version9cargo 1.97.0 (c980f4866 2026-06-30)
checkPhase
10+++ command cargo test --release --workspace11 Compiling bitflags v2.11.012 Compiling rustix v1.1.413 Compiling linux-raw-sys v0.12.114 Compiling fastrand v2.4.015 Compiling getrandom v0.3.416 Compiling zerocopy v0.8.4817 Compiling num-traits v0.2.1918 Compiling tinc-proto v0.0.0 (/build/source/crates/tinc-proto)19 Compiling tincd v0.1.0 (/build/source/crates/tincd)20 Compiling wait-timeout v0.2.121 Compiling bit-vec v0.8.022 Compiling quick-error v1.2.323 Compiling fnv v1.0.724 Compiling unarray v0.1.425 Compiling regex-syntax v0.8.1026 Compiling generic-array v0.14.727 Compiling tinc-ffi v0.0.0 (/build/source/crates/tinc-ffi)28 Compiling hex v0.4.329 Compiling nix v0.31.330 Compiling netlink-packet-route v0.29.031 Compiling bit-set v0.8.032 Compiling rand_core v0.9.533 Compiling mainline v6.0.134 Compiling rand_xorshift v0.4.035 Compiling rand v0.9.236 Compiling inout v0.1.437 Compiling crypto-common v0.1.738 Compiling cipher v0.4.439 Compiling chacha20 v0.9.140 Compiling module-lattice v0.2.341 Compiling crypto-bigint v0.7.542 Compiling ml-kem v0.3.243 Compiling tempfile v3.27.044 Compiling rusty-fork v0.3.145 Compiling tinc-crypto v0.0.0 (/build/source/crates/tinc-crypto)46 Compiling tinc-sptps v0.0.0 (/build/source/crates/tinc-sptps)47 Compiling tinc-conf v0.0.0 (/build/source/crates/tinc-conf)48 Compiling tinc-device v0.0.0 (/build/source/crates/tinc-device)49 Compiling crypto-primes v0.7.250 Compiling ppv-lite86 v0.2.2151 Compiling rand_chacha v0.9.052 Compiling netdev v0.42.053 Compiling proptest v1.11.054 Compiling rsa v0.10.0-rc.1855 Compiling rand_chacha v0.10.056 Compiling tinc-tools v0.0.0 (/build/source/crates/tinc-tools)57 Finished `release` profile [optimized] target(s) in 1m 25s58 Running unittests src/lib.rs (target/release/deps/tinc_conf-7549c7fc9fb143c6)5960running 55 tests61test name::tests::host_truncates_at_dot_and_squashes ... ok62test name::tests::host_env_beats_gethostname ... ok63test name::tests::underscore_preserved ... ok64test name::tests::empty_after_truncate_errors ... ok65test name::tests::envvar_same_semantics_as_host ... ok66test name::tests::literal_not_squashed ... ok67test parse::tests::entry_int ... ok68test parse::tests::entry_bool ... ok69test parse::tests::file_skips_pem ... ok70test parse::tests::line_empty_value_errors ... ok71test parse::tests::line_blank_skips ... ok72test parse::tests::line_empty_variable_passes ... ok73test parse::tests::file_comments_and_blanks ... ok74test parse::tests::line_equals_terminates_variable ... ok75test parse::tests::line_separator_forms ... ok76test parse::tests::file_pem_unterminated ... ok77test parse::tests::file_crlf ... ok78test parse::tests::line_value_with_spaces ... ok79test parse::tests::line_trailing_strip ... ok80test parse::tests::lookup_case_insensitive ... ok81test parse::tests::lookup_cmdline_first ... ok82test parse::tests::lookup_file_tiebreak ... ok83test parse::tests::lookup_line_before_file ... ok84test parse::tests::lookup_multi_ordered_by_line ... ok85test pem::tests::read_bad_b64 ... ok86test pem::tests::read_crlf ... ok87test pem::tests::read_ignores_chunking ... ok88test pem::tests::read_not_found ... ok89test pem::tests::read_empty_body_line ... ok90test pem::tests::read_size_long ... ok91test pem::tests::read_type_prefix ... ok92test pem::tests::roundtrip_sizes ... ok93test pem::tests::read_size_short ... ok94test pem::tests::read_end_type_unchecked ... ok95test pem::tests::write_chunking ... ok96test pem::tests::read_skips_preamble ... ok97test parse::tests::server_confd_empty ... ok98test pem::tests::public_key_file_shape ... ok99test vars::tests::every_entry_is_server_or_host ... ok100test parse::tests::server_confd_head_bug_not_ported ... ok101test pem::tests::write_chunking_uneven ... ok102test pem::tests::signing_key_roundtrip ... ok103test parse::tests::server_no_tincconf ... ok104test vars::tests::lookup_unknown ... ok105test vars::tests::flags_contains ... ok106test vars::tests::lookup_case_insensitive ... ok107test vars::tests::no_duplicate_names ... ok108test parse::tests::server_confd_is_file ... ok109test vars::tests::safe_not_obsolete ... ok110test vars::tests::spot_check ... ok111test parse::tests::server_no_confd ... ok112test vars::tests::unsafe_paths_not_safe ... ok113test parse::tests::server_confd_filter ... ok114test parse::tests::server_confd_one_bad ... ok115test parse::tests::server_confd_merged ... ok116117test result: ok. 55 passed; 0 failed; 0 ignored; 0 measured; 0 filtered out; finished in 0.00s118119 Running tests/bugs.rs (target/release/deps/bugs-c7af36fbdbf89b8e)120121running 2 tests122test bom_on_first_line_stripped ... ok123test non_utf8_bytes_tolerated ... ok124125test result: ok. 2 passed; 0 failed; 0 ignored; 0 measured; 0 filtered out; finished in 0.00s126127 Running tests/roundtrip.rs (target/release/deps/roundtrip-aebb3afbba7ddfd0)128129running 3 tests130test pem_roundtrip ... ok131test line_roundtrip ... ok132test pem_skips_preamble ... ok133134test result: ok. 3 passed; 0 failed; 0 ignored; 0 measured; 0 filtered out; finished in 0.02s135136 Running unittests src/lib.rs (target/release/deps/tinc_crypto-70702b3d6d9203ed)137138running 12 tests139test invite::tests::cookie_affects_filename ... ok140test invite::tests::key_affects_slug_prefix_only ... ok141test invite::tests::filename_from_cookie ... ok142test invite::tests::key_hash_via_fingerprint ... ok143test aead::tests::config_str_roundtrip ... ok144test aead::tests::default_label_suffix_empty ... ok145test invite::tests::parse_short ... ok146test invite::tests::parse_bad_alphabet ... ok147test invite::tests::parse_multibyte_no_panic ... ok148test invite::tests::slug_roundtrip ... ok149test hybrid::tests::mlkem768_round_trip ... ok150test aead::tests::aes_open_into_err_leaves_out_unchanged ... ok151152test result: ok. 12 passed; 0 failed; 0 ignored; 0 measured; 0 filtered out; finished in 0.00s153154 Running tests/aesgcm.rs (target/release/deps/aesgcm-70385036ec54e501)155156running 1 test157test aes256gcm_known_answer ... ok158159test result: ok. 1 passed; 0 failed; 0 ignored; 0 measured; 0 filtered out; finished in 0.00s160161 Running tests/kat.rs (target/release/deps/kat-4aab3776b157f888)162163running 8 tests164test b64_decode_accepts_mixed_alphabet ... ok165test b64_encode_matches_c ... ok166test prf_matches_c ... ok167test invitation_crypto_kernel_matches_c ... ok168test sign_matches_c ... ok169test ecdh_from_seed_matches_c ... ok170test chapoly_open_rejects_tampered ... ok171test chapoly_seal_matches_c ... ok172173test result: ok. 8 passed; 0 failed; 0 ignored; 0 measured; 0 filtered out; finished in 0.00s174175 Running unittests src/lib.rs (target/release/deps/tinc_device-2da6e72cc71384d3)176177running 62 tests178test arena::tests::slot_accessors ... ok179test arena::tests::arena_is_page_aligned ... ok180test arena::tests::slots_within_contiguous ... ok181test bsd::tests::nibble_then_prefix_roundtrip ... ok182test bsd::tests::prefix_ipv6_is_libc_af_inet6_be ... ok183test bsd::tests::prefix_ipv4_is_af_inet_be ... ok184test bsd::tests::prefix_unknown ... ok185test bsd::tests::read_eof_via_seqpacket ... ok186test bsd::tests::read_unknown_nibble_errors ... ok187test bsd::tests::tap_read_ether_via_seqpacket ... ok188test arena::tests::set_len_rejects_overflow - should panic ... ok189test arena::tests::slot_oob_panics - should panic ... ok190test bsd::tests::tap_write_ether_via_seqpacket ... ok191test bsd::tests::tun_read_ipv4_via_pipe ... ok192test bsd::tests::tun_write_strips_ether ... ok193test bsd::tests::tun_utun_write_short_buf_errors ... ok194test bsd::tests::utun_read_ignores_prefix ... ok195test bsd::tests::utun_write_synthesizes_prefix ... ok196test bsd::tests::utun_write_synthesizes_ipv6_prefix ... ok197test bsd::tests::utun_write_unknown_ethertype_errors ... ok198test bsd::tests::utun_read_runt_errors ... ok199test ether::tests::set_etherheader_cases ... ok200test ether::tests::nibble_cases ... ok201test fd::tests::read_eof_via_pipe ... ok202test fd::tests::read_ip_via_pipe ... ok203test fd::tests::scm_rights_round_trip ... ok204test fd::tests::read_unknown_version_via_pipe ... ok205test linux::tests::open_mq_validation ... ok206test fd::tests::write_strips_ether_via_pipe ... ok207test linux::tests::open_non_root_err ... ok208test linux::tests::open_too_long_iface_err_before_open ... ok209test linux::tests::pack_ifr_name_exactly_16_err ... ok210test raw::tests::open_bad_iface_errors ... ok211test linux::tests::pack_ifr_name_ok ... ok212test raw::tests::read_eof_via_seqpacket ... ok213test raw::tests::read_ether_via_seqpacket ... ok214test raw::tests::write_ether_via_seqpacket ... ok215test tests::drain_clamps_cap_to_arena ... ok216test tests::drain_frames_until_eagain ... ok217test tests::drain_dummy_is_empty ... ok218test tests::drain_immediate_eagain_is_empty ... ok219test tests::drain_respects_cap ... ok220test tso::tests::checksum_chains ... ok221test tests::drain_propagates_real_error ... ok222test tso::tests::checksum_odd_tail ... ok223test tso::tests::checksum_rfc1071_reference ... ok224test tso::tests::gro_flush_on_mismatch ... ok225test tso::tests::gro_coalesce_three_v4 ... ok226test tso::tests::gro_reassembles_tso_split_output ... ok227test tso::tests::gro_psh_terminates ... ok228test tso::tests::gro_hits_64k_cap ... ok229test tso::tests::gro_short_tail_terminates ... ok230test tso::tests::gro_single_packet_zero_vnet_hdr ... ok231test tso::tests::gro_rejects ... ok232test tso::tests::gso_none_completes_partial_csum ... ok233test tso::tests::split_errors ... ok234test tso::tests::split_seq_wraps ... ok235test tso::tests::split_v4_even ... ok236test tso::tests::split_v4_short_tail ... ok237test tso::tests::split_v4_single_chunk ... ok238test tso::tests::split_v6_even ... ok239test tso::tests::vnet_hdr_decode ... ok240241test result: ok. 62 passed; 0 failed; 0 ignored; 0 measured; 0 filtered out; finished in 0.00s242243 Running tests/mq.rs (target/release/deps/mq-798b3b55c0085b6f)244245running 2 tests246test mq_vnet_hdr_on_queue0 ... ok247test mq_one_queue_is_plain_open ... ok248249test result: ok. 2 passed; 0 failed; 0 ignored; 0 measured; 0 filtered out; finished in 0.03s250251 Running tests/utun_batch.rs (target/release/deps/utun_batch-06405dfb1974c1a6)252253running 0 tests254255test result: ok. 0 passed; 0 failed; 0 ignored; 0 measured; 0 filtered out; finished in 0.00s256257 Running unittests src/lib.rs (target/release/deps/tinc_ffi-40d4ac55d615fd09)258259running 0 tests260261test result: ok. 0 passed; 0 failed; 0 ignored; 0 measured; 0 filtered out; finished in 0.00s262263 Running tests/handshake.rs (target/release/deps/handshake-4dc70b2a3c5daee2)264265running 6 tests266test handshake_is_deterministic_under_same_seeds ... ok267test handshake_fails_on_wrong_peer_key ... ok268test datagram_handshake_c_to_c ... ok269test stream_handshake_c_to_c ... ok270test rekey_uses_ack_state ... ok271test stream_handshake_survives_byte_dribble ... ok272273test result: ok. 6 passed; 0 failed; 0 ignored; 0 measured; 0 filtered out; finished in 0.01s274275 Running unittests src/lib.rs (target/release/deps/tinc_proto-af66c38dd4b6d5a2)276277running 59 tests278test addr::tests::accepts ... ok279test msg::edge::tests::add_edge_negative_weight_clamped ... ok280test msg::edge::tests::add_edge_bad_name_rejected ... ok281test msg::edge::tests::add_edge_self_loop_rejected ... ok282test addr::tests::rejects ... ok283test msg::edge::tests::add_edge_seven_tokens_rejected ... ok284test msg::edge::tests::add_edge_kat ... ok285test msg::edge::tests::add_edge_unknown_addr ... ok286test msg::key::tests::ans_key_eight_fields_rejected ... ok287test msg::edge::tests::add_edge_v6 ... ok288test msg::key::tests::ans_key_sptps_placeholder_fields ... ok289test msg::key::tests::ans_key ... ok290test msg::edge::tests::add_edge_with_local ... ok291test msg::key::tests::ans_key_with_relay_addr ... ok292test msg::edge::tests::del_edge_kat ... ok293test msg::key::tests::req_key_ext_no_payload ... ok294test msg::key::tests::req_key_ext_with_payload ... ok295test msg::key::tests::req_key_legacy ... ok296test msg::key::tests::key_changed ... ok297test msg::key::tests::req_key_punch_roundtrip ... ok298test msg::key::tests::req_key_reflexive_append ... ok299test msg::key::tests::req_key_unknown_reqno ... ok300test msg::misc::tests::mtu_info ... ok301test msg::misc::tests::sptps_packet ... ok302test msg::misc::tests::tcp_packet ... ok303test msg::misc::tests::udp_info ... ok304test msg::subnet::tests::kat_format ... ok305test msg::subnet::tests::kat_parse ... ok306test msg::subnet::tests::rejects ... ok307test msg::subnet::tests::roundtrip ... ok308test msg::subnet::tests::trailing_garbage_ok ... ok309test request::tests::id_roundtrip ... ok310test request::tests::peek ... ok311test subnet::tests::kat_reject ... ok312test subnet::tests::kat_roundtrip ... ok313test subnet::tests::mac_shadows_v6 ... ok314test subnet::tests::maskcheck_basics ... ok315test subnet::tests::maskcmp_byte_aligned ... ok316test subnet::tests::maskcmp_mask_equivalence ... ok317test subnet::tests::maskcmp_partial_byte ... ok318test subnet::tests::maskcmp_slash_zero ... ok319test subnet::tests::maskcmp_v6 ... ok320test subnet::tests::matches_address_mode_v4 ... ok321test subnet::tests::matches_address_mode_v6 ... ok322test subnet::tests::matches_exact_mode_v4 ... ok323test subnet::tests::matches_ignores_weight ... ok324test subnet::tests::matches_mac ... ok325test tests::check_id_basics ... ok326test subnet::tests::matches_type_mismatch ... ok327test tok::tests::hex_lowercase_only ... ok328test tok::tests::basic ... ok329test tok::tests::ld_type ... ok330test tok::tests::limits ... ok331test tok::tests::lit_match ... ok332test tok::tests::lit_mismatch ... ok333test tok::tests::lu_accepts_negative_glibc_style ... ok334test tok::tests::opt ... ok335test tok::tests::skip ... ok336test tok::tests::typed ... ok337338test result: ok. 59 passed; 0 failed; 0 ignored; 0 measured; 0 filtered out; finished in 0.00s339340 Running tests/adversarial.rs (target/release/deps/adversarial-575f15720884ccab)341342running 10 tests343test check_id_garbage ... ok344test add_edge_adversarial ... ok345test del_edge_adversarial ... ok346test misc_msgs_adversarial ... ok347test key_msgs_adversarial ... ok348test request_peek_garbage ... ok349test subnet_msg_adversarial ... ok350test subnet_adversarial ... ok351test arbitrary_bytes_never_panic ... ok352test arbitrary_tokens_never_panic ... ok353354test result: ok. 10 passed; 0 failed; 0 ignored; 0 measured; 0 filtered out; finished in 0.14s355356 Running tests/roundtrip.rs (target/release/deps/roundtrip-79fab8035265d337)357358running 11 tests359test mac_never_parses_as_v6 ... ok360test v6_display_never_macish ... ok361test subnet_roundtrip ... ok362test subnet_fits_buffer ... ok363test subnet_canonical ... ok364test mtu_info ... ok365test del_edge ... ok366test req_key ... ok367test udp_info ... ok368test add_edge ... ok369test ans_key ... ok370371test result: ok. 11 passed; 0 failed; 0 ignored; 0 measured; 0 filtered out; finished in 0.05s372373 Running unittests src/lib.rs (target/release/deps/tinc_sptps-c74f23aab827abc4)374375running 1 test376test state::tests::output_debug_redacts_payload_bytes ... ok377378test result: ok. 1 passed; 0 failed; 0 ignored; 0 measured; 0 filtered out; finished in 0.00s379380 Running tests/aead.rs (target/release/deps/aead-a6938a18cbd97060)381382running 3 tests383test aead_mismatch_fails_handshake_cleanly ... ok384test aes_gcm_roundtrip_datagram ... ok385test aes_and_chacha_produce_different_records ... ok386387test result: ok. 3 passed; 0 failed; 0 ignored; 0 measured; 0 filtered out; finished in 0.00s388389 Running tests/bugs/main.rs (target/release/deps/bugs-afcb3f18fe9774b0)390391running 21 tests392test adversarial_framing::stream_double_kex_is_err ... ok393test adversarial_framing::stream_huge_reclen_short_body ... ok394test adversarial_framing::stream_empty_input ... ok395test adversarial_framing::stream_plaintext_bad_record_types ... ok396test adversarial_framing::datagram_short_and_malformed ... ok397test open_data_into_err_buffer::truncates_on_badrecord ... ok398test adversarial_framing::datagram_encrypted_garbage ... ok399test open_data_into_err_buffer::rejects_garbage ... ok400test seqno_wrap_nonce_reuse::alloc_seqnos_refuses_before_nonce_wrap ... ok401test seqno_wrap_nonce_reuse::rekey_due_at_soft_threshold ... ok402test open_data_into_err_buffer::truncates_on_badseqno ... ok403test fastpath_replay_window::badrecord_does_not_advance_window ... ok404test send_record_oversized::datagram_has_no_length_cap ... ok405test send_record_oversized::stream_gates_at_u16_boundary ... ok406test confirm_state_send::send_record_refused_before_confirm_ack ... ok407test hybrid_stream::hybrid_stream_handshake_completes ... ok408test confirm_state_send::no_app_record_before_handshake_done ... ok409test hybrid_stream::hybrid_datagram_force_kex_roundtrip ... ok410test c_interop::datagram_rekey_c_to_rust_post_rekey_traffic ... ok411test seqno_wrap_nonce_reuse::inband_datagram_rekey_rebases_key_counter ... ok412test c_interop::datagram_rekey_rust_to_c_post_rekey_traffic ... ok413414test result: ok. 21 passed; 0 failed; 0 ignored; 0 measured; 0 filtered out; finished in 0.01s415416 Running tests/fastpath.rs (target/release/deps/fastpath-de2ded26b0fa766f)417418running 5 tests419test u64_truncate_is_u32_wrap ... ok420test open_data_into_pre_handshake ... ok421test seal_into_open_into_roundtrip ... ok422test handle_based_seal_byte_identical ... ok423test alloc_seqnos_seal_with_seqno_byte_identical ... ok424425test result: ok. 5 passed; 0 failed; 0 ignored; 0 measured; 0 filtered out; finished in 0.00s426427 Running tests/hybrid_kex.rs (target/release/deps/hybrid_kex-d7dc016be3b95b04)428429running 8 tests430test hybrid_record_sizes_fit_transport ... ok431test default_kex_byte_identical ... ok432test hybrid_mismatch_clean_error ... ok433test hybrid_kdf_kat ... ok434test hybrid_round_trip ... ok435test tampered_ct_no_handshake_done ... ok436test hybrid_rekey ... ok437test handshake_latency_report ... ok438439test result: ok. 8 passed; 0 failed; 0 ignored; 0 measured; 0 filtered out; finished in 0.03s440441 Running tests/preauth_reclen.rs (target/release/deps/preauth_reclen-005db66483fadbf8)442443running 2 tests444test preauth_reclen_boundary ... ok445test hybrid_stream_handshake_passes_clamp ... ok446447test result: ok. 2 passed; 0 failed; 0 ignored; 0 measured; 0 filtered out; finished in 0.00s448449 Running tests/rekey_after_bad_handshake.rs (target/release/deps/rekey_after_bad_handshake-bcdedfd8837dd92e)450451running 1 test452test peer_rekey_survives_prior_malformed_handshake ... ok453454test result: ok. 1 passed; 0 failed; 0 ignored; 0 measured; 0 filtered out; finished in 0.00s455456 Running tests/replay_window.rs (target/release/deps/replay_window-7f67f005c74d44f8)457458running 1 test459test in_window_reorder_is_lossless ... ok460461test result: ok. 1 passed; 0 failed; 0 ignored; 0 measured; 0 filtered out; finished in 0.15s462463 Running tests/small_order_replay.rs (target/release/deps/small_order_replay-6fa0ebed21fea332)464465running 2 tests466test small_order_ecdh_replayed_sig_no_panic_classical ... ok467test small_order_ecdh_replayed_sig_no_panic_hybrid ... ok468469test result: ok. 2 passed; 0 failed; 0 ignored; 0 measured; 0 filtered out; finished in 0.00s470471 Running tests/stream_reassembly.rs (target/release/deps/stream_reassembly-2fbab0a2f6787431)472473running 2 tests474test fragmentation_transparent_initiator ... ok475test fragmentation_transparent_responder ... ok476477test result: ok. 2 passed; 0 failed; 0 ignored; 0 measured; 0 filtered out; finished in 0.16s478479 Running tests/vs_c.rs (target/release/deps/vs_c-f126d6159cd14b12)480481running 5 tests482test c_initiator_rust_responder ... ok483test byte_identical_wire_output ... ok484test rust_initiator_c_responder ... ok485test rust_initiator_c_responder_datagram ... ok486test rust_vs_c_rekey ... ok487488test result: ok. 5 passed; 0 failed; 0 ignored; 0 measured; 0 filtered out; finished in 0.01s489490 Running unittests src/lib.rs (target/release/deps/tinc_tools-3ba1a781e29a9d4b)491492running 305 tests493test cmd::config::tests::every_nonserver_var_is_host ... ok494test cmd::config::tests::parse_var_expr_err ... ok495test cmd::config::tests::parse_var_expr_ok ... ok496test cmd::config::tests::add_dedup_case_insensitive ... ok497test cmd::config::tests::del_filtered ... ok498test cmd::config::tests::add_appends ... ok499test cmd::config::tests::add_dedup_noop ... ok500test cmd::config::tests::del_filter_no_match_fails ... ok501test cmd::config::tests::del_removes_all ... ok502test cmd::config::tests::del_nothing_fails ... ok503test cmd::config::tests::edit_adds_newline_before_append ... ok504test cmd::config::tests::edit_file_missing ... ok505test cmd::config::tests::get_table ... ok506test cmd::config::tests::intent_dual_tagged_goes_to_tinc_conf ... ok507test cmd::config::tests::intent_action_coercion ... ok508test cmd::config::tests::get_port_with_value_skips_pidfile ... ok509test cmd::config::tests::intent_obsolete_var_fails ... ok510test cmd::config::tests::split_line_pem_passthrough ... ok511test cmd::config::tests::edit_preserves_pem ... ok512test cmd::config::tests::split_line_table ... ok513test cmd::config::tests::get_file_missing ... ok514test cmd::config::tests::intent_errors ... ok515test cmd::config::tests::edit_preserves_comments ... ok516test cmd::ctl_simple::tests::disconnect_bad_name_preflight ... ok517test cmd::config::tests::intent_obsolete_var_get_ok ... ok518test cmd::config::tests::intent_port_is_host_only ... ok519test cmd::ctl_simple::tests::debug_returns_prev_level ... ok520test cmd::ctl_simple::tests::disconnect_not_found ... ok521test cmd::ctl_simple::tests::pid_from_greeting ... ok522test cmd::ctl_simple::tests::reload_daemon_fail ... ok523test cmd::dump::tests::conn_fmt_plain_contract ... ok524test cmd::config::tests::intent_unknown_var_force_proceeds ... ok525test cmd::dump::tests::edge_dot_weight_calc ... ok526test cmd::dump::tests::conn_parse_golden ... ok527test cmd::config::tests::intent_routing ... ok528test cmd::dump::tests::edge_parse_golden ... ok529test cmd::dump::tests::edge_dot_dedup_table ... ok530test cmd::dump::tests::edge_parse_unspec_local ... ok531test cmd::config::tests::intent_unknown_var_get_proceeds ... ok532test cmd::ctl_simple::tests::stop_drains ... ok533test cmd::dump::tests::edge_fmt_plain ... ok534test cmd::dump::tests::kind_err ... ok535test cmd::dump::tests::kind_needs_daemon ... ok536test cmd::config::tests::run_full_add_subnet_to_host_file ... ok537test cmd::dump::tests::kind_ok ... ok538test cmd::config::tests::run_full_get ... ok539test cmd::config::tests::run_full_get_not_found ... ok540test cmd::dump::tests::node_parse_golden ... ok541test cmd::dump::tests::node_dot_color_cascade ... ok542test cmd::config::tests::run_full_explicit_node ... ok543test cmd::dump::tests::node_parse_host_variants ... ok544test cmd::dump::tests::node_parse_short ... ok545test cmd::dump::tests::node_fmt_plain_contract ... ok546test cmd::dump::tests::subnet_fmt_table ... ok547test cmd::dump::tests::strip_weight_table ... ok548test cmd::dump::tests::subnet_parse_table ... ok549test cmd::edit::tests::resolve_err ... ok550test cmd::edit::tests::resolve_ok ... ok551test cmd::config::tests::run_get_port_fallback_to_config ... ok552test cmd::config::tests::run_get_port_explicit_node_skips_pidfile ... ok553test cmd::config::tests::run_get_port_from_pidfile ... ok554test cmd::config::tests::set_appends_when_absent ... ok555test cmd::config::tests::run_get_with_value_is_set ... ok556test cmd::config::tests::set_canonicalizes_key_case ... ok557test cmd::config::tests::set_collapses_duplicates ... ok558test cmd::config::tests::set_replaces_in_place ... ok559test cmd::config::tests::set_warnonremove ... ok560test cmd::config::tests::tmpfile_cleaned_up_on_del_failure ... ok561test cmd::exchange::tests::name_line_filter ... ok562test cmd::config::tests::warnonremove_case_insensitive ... ok563test cmd::dump::tests::inv_dir_perms ... ok564test cmd::dump::tests::inv_file_perms_skip ... ok565test cmd::dump::tests::inv_multiple ... ok566test cmd::dump::tests::inv_mixed ... ok567test cmd::dump::tests::inv_roundtrip_with_invite ... ok568test cmd::exchange::tests::export_injects_name_strips_name ... ok569test cmd::exchange::tests::export_all_separator_between ... ok570test cmd::exchange::tests::get_my_name_missing_tinc_conf ... ok571test cmd::exchange::tests::export_preserves_pem ... ok572test cmd::fsck::tests::display_exhaustive ... ok573test cmd::exchange::tests::get_my_name_no_name_key ... ok574test cmd::exchange::tests::export_all_skips_non_id_dirents ... ok575test cmd::exchange::tests::import_bad_name_is_error ... ok576test cmd::exchange::tests::get_my_name_reads_config ... ok577test cmd::exchange::tests::import_basic ... ok578test cmd::exchange::tests::import_junk_before_name_is_ignored ... ok579test cmd::exchange::tests::import_multi_with_separator ... ok580test cmd::exchange::tests::import_name_format_is_exact ... ok581test cmd::exchange::tests::import_no_name_at_all ... ok582test cmd::dump::tests::inv_empty_cases ... ok583test cmd::exchange::tests::import_skip_existing_unless_force ... ok584test cmd::fsck::tests::bad_b64_is_no_pubkey ... ok585test cmd::fsck::tests::checks_all_hosts ... ok586test cmd::fsck::tests::all_known_scripts ... ok587test cmd::fsck::tests::clean_init_passes ... ok588test cmd::fsck::tests::duplicate_non_multiple ... ok589test cmd::fsck::tests::duplicate_multiple_ok ... ok590test cmd::fsck::tests::confd_checked ... ok591test cmd::fsck::tests::severity_buckets ... ok592test cmd::fsck::tests::no_name ... ok593test cmd::fsck::tests::host_var_in_server ... ok594test cmd::fsck::tests::host_scripts_any_prefix ... ok595test cmd::fsck::tests::no_tincconf ... ok596test cmd::fsck::tests::hosts_non_id_skipped ... ok597test cmd::fsck::tests::host_file_deleted ... ok598test cmd::exchange::tests::roundtrip ... ok599test cmd::fsck::tests::key_mismatch ... ok600test cmd::fsck::tests::no_private_key ... ok601test cmd::fsck::tests::no_public_key ... ok602test cmd::fsck::tests::key_mismatch_force_fixes ... ok603test cmd::fsck::tests::no_public_key_force_fixes ... ok604test cmd::exchange::tests::roundtrip_multi ... ok605test cmd::dump::tests::inv_valid_table ... ok606test cmd::fsck::tests::obsolete_var ... ok607test cmd::fsck::tests::non_scripts_ignored ... ok608test cmd::fsck::tests::pem_pubkey_read ... ok609test cmd::info::tests::cascade_table ... ok610test cmd::info::tests::localtime_epoch_is_1970ish ... ok611test cmd::fsck::tests::private_key_file_config ... ok612test cmd::info::tests::localtime_shape ... ok613test cmd::fsck::tests::script_not_exec_force_fixes ... ok614test cmd::info::tests::localtime_zero_is_never ... ok615test cmd::info::tests::nodeinfo_format_golden ... ok616test cmd::info::tests::nodeinfo_format_unreachable ... ok617test cmd::info::tests::nodeinfo_traffic_double_space ... ok618test cmd::info::tests::nodeinfo_status_order ... ok619test cmd::info::tests::option_bits_match_connection_h ... ok620test cmd::fsck::tests::server_var_in_host ... ok621test cmd::info::tests::option_version_shifts_24 ... ok622test cmd::genkey::tests::disable_config_line ... ok623test cmd::info::tests::reachability_display_single_line ... ok624test cmd::info::tests::reachability_display_directup_multiline ... ok625test cmd::genkey::tests::disable_config_line_case ... ok626test cmd::info::tests::reachability_display_zero_rtt ... ok627test cmd::info::tests::status_bits_match_node_h_order ... ok628test cmd::genkey::tests::disable_config_line_exact_len ... ok629test cmd::genkey::tests::disable_end_type_unchecked ... ok630test cmd::genkey::tests::disable_ignores_rsa ... ok631test cmd::genkey::tests::disable_no_match ... ok632test cmd::fsck::tests::unknown_var_silent ... ok633test cmd::fsck::tests::unknown_script ... ok634test cmd::fsck::tests::script_not_exec_warns ... ok635test cmd::genkey::tests::disable_nonexistent ... ok636test cmd::fsck::tests::unsafe_key_mode_force_fixes ... ok637test cmd::fsck::tests::unsafe_key_mode_warns ... ok638test cmd::genkey::tests::disable_no_trailing_newline ... ok639test cmd::genkey::tests::disable_pem_block ... ok640test cmd::genkey::tests::disable_space_delimited_type ... ok641test cmd::genkey::tests::disable_preserves_mode ... ok642test cmd::genkey::tests::disable_pem_block_surrounded ... ok643test cmd::genkey::tests::rotation_roundtrip ... ok644test cmd::init::tests::bad_name_rejected ... ok645test cmd::init::tests::eacces_on_mkdir_hints_at_dash_c ... ok646test cmd::init::tests::fresh_init ... ok647test cmd::init::tests::makedir_clamps_mode ... ok648test cmd::init::tests::reinit_fails ... ok649test cmd::invite::tests::address_basic ... ok650test cmd::invite::tests::address_ipv6_brackets ... ok651test cmd::invite::tests::address_missing_bails ... ok652test cmd::invite::tests::address_port_zero_bails ... ok653test cmd::invite::tests::address_port_from_config ... ok654test cmd::invite::tests::address_with_port_on_line ... ok655test cmd::invite::tests::sweep_deletes_expired ... ok656test cmd::join::tests::greeting_line1 ... ok657test cmd::join::tests::greeting_line2 ... ok658test cmd::invite::tests::sweep_filters_by_filename_length ... ok659test cmd::invite::tests::invite_existing_host_fails ... ok660test cmd::join::tests::finalize_bad_name ... ok661test cmd::join::tests::split_var_forms ... ok662test cmd::invite::tests::invite_no_address_fails_clean ... ok663test cmd::join::tests::url_err ... ok664test cmd::join::tests::url_ok ... ok665test cmd::invite::tests::invite_bad_name_fails ... ok666test cmd::invite::tests::invite_full_flow ... ok667test cmd::network::tests::list_missing_confdir ... ok668test cmd::invite::tests::second_invite_reuses_key ... ok669test cmd::invite::tests::mesh_vars_copied ... ok670test cmd::invite::tests::corrupt_key_with_live_invites_not_clobbered ... ok671test cmd::join::tests::finalize_existing_tinc_conf ... ok672test cmd::network::tests::run_switch_dot_different_advice ... ok673test cmd::network::tests::run_switch_rejected ... ok674test cmd::join::tests::finalize_no_name ... ok675test cmd::join::tests::finalize_ifconfig_recognized_stubbed ... ok676test cmd::join::tests::finalize_force_accepts_unsafe ... ok677test cmd::join::tests::finalize_minimal_blob ... ok678test cmd::join::tests::finalize_secondary_chunk_drops_file_pointer_keys ... ok679test cmd::join::tests::finalize_self_clobber_detected ... ok680test cmd::network::tests::list_empty ... ok681test cmd::join::tests::finalize_unknown_var_dropped ... ok682test cmd::sign::tests::signed_message_format ... ok683test cmd::join::tests::finalize_secondary_chunks ... ok684test cmd::network::tests::list_anonymous_network ... ok685test cmd::join::tests::finalize_var_safe_filter ... ok686test cmd::network::tests::list_skip_no_tinc_conf ... ok687test cmd::network::tests::list_skip_regular_files ... ok688test cmd::join::tests::server_stub_recovers_file ... ok689test cmd::network::tests::list_skip_unreadable ... ok690test cmd::network::tests::list_skip_dotted ... ok691test cmd::start::tests::find_tincd_env_override ... ok692test cmd::join::tests::server_stub_single_use ... ok693test cmd::network::tests::list_three_sorted ... ok694test cmd::stream::tests::log_loop_color_forwarded ... ok695test cmd::join::tests::url_roundtrip_with_invite ... ok696test cmd::stream::tests::log_loop_malformed_breaks_clean ... ok697test cmd::stream::tests::log_loop_data_with_newline ... ok698test cmd::stream::tests::log_loop_two_records ... ok699test cmd::stream::tests::parse_header_table ... ok700test cmd::stream::tests::pcap_global_header_bytes_le ... ok701test cmd::dump::tests::inv_skipped ... ok702test cmd::stream::tests::pcap_global_header_snaplen_zero_defaults ... ok703test cmd::stream::tests::pcap_loop_one_packet ... ok704test cmd::stream::tests::pcap_loop_snaplen_zero ... ok705test cmd::stream::tests::pcap_loop_timestamps_per_packet ... ok706test cmd::sign::tests::load_host_pubkey_no_key ... ok707test cmd::stream::tests::pcap_packet_header_before_epoch_is_zero ... ok708test cmd::stream::tests::pcap_packet_header_bytes_le ... ok709test cmd::stream::tests::pcap_packet_header_y2038_truncates ... ok710test cmd::top::tests::compare_table ... ok711test cmd::top::tests::counter_decrease_wraps ... ok712test cmd::sign::tests::binary_body_roundtrip ... ok713test cmd::top::tests::display_order_is_arrival_order_not_name_order ... ok714test cmd::top::tests::departed_node_stays_dim ... ok715test cmd::sign::tests::empty_body_roundtrip ... ok716test cmd::sign::tests::golden_upstream_vector ... ok717test cmd::top::tests::fractional_dt ... ok718test cmd::top::tests::first_tick_rate_is_near_zero ... ok719test cmd::top::tests::parse_traffic_row ... ok720test cmd::top::tests::render_clips_at_max_rows ... ok721test cmd::top::tests::render_header_no_netname ... ok722test cmd::sign::tests::load_host_pubkey_pem_fallback ... ok723test cmd::top::tests::render_header_row0_golden ... ok724test cmd::sign::tests::sign_verify_roundtrip ... ok725test cmd::sign::tests::signer_parse ... ok726test cmd::genkey::tests::disable_config_line_delims ... ok727test cmd::sign::tests::trailer_leading_space ... ok728test cmd::sign::tests::verify_malformed_header ... ok729test cmd::sign::tests::verify_signer_mismatch ... ok730test cmd::sign::tests::verify_any_signer ... ok731test cmd::sign::tests::verify_header_too_long ... ok732test cmd::top::tests::render_header_row2_text ... ok733test cmd::top::tests::render_row_attribute_logic ... ok734test cmd::invite::tests::copy_host_table ... ok735test cmd::sign::tests::verify_tampered_time ... ok736test cmd::top::tests::render_row_column_layout ... ok737test cmd::start::tests::start_proceeds_past_missing_pidfile ... ok738test cmd::sign::tests::verify_tampered_body ... ok739test cmd::top::tests::render_row_cumulative ... ok740test cmd::join::tests::invite_join_roundtrip_in_process ... ok741test cmd::top::tests::render_row_kilo_scale ... ok742test cmd::top::tests::second_tick_rate_is_delta_over_dt ... ok743test cmd::top::tests::sort_name_is_ascending ... ok744test cmd::sign::tests::verify_tampered_signer_name ... ok745test ctl::tests::ack_nonzero_result ... ok746test ctl::tests::handshake_bad_line1 ... ok747test ctl::tests::handshake_smoke ... ok748test ctl::tests::pidfile_missing ... ok749test ctl::tests::recv_data_after_recv_line_shared_buffer ... ok750test ctl::tests::handshake_bad_cookie_eof ... ok751test ctl::tests::recv_data_short_is_error ... ok752test cmd::start::tests::start_proceeds_past_malformed_pidfile ... ok753test ctl::tests::pidfile_parse ... ok754test ctl::tests::pidfile_cookie_validated ... ok755test ctl::tests::recv_ack_wrong_type ... ok756test ctl::tests::recv_row_bad_code ... ok757test ctl::tests::recv_lines_until_eof ... ok758test ctl::tests::request_from_i32 ... ok759test ctl::tests::recv_row_eof_mid_dump ... ok760test ctl::tests::recv_row_basic ... ok761test ctl::tests::pidfile_shape_enforced ... ok762test ctl::tests::recv_row_graph_two_terminators ... ok763test ctl::tests::send_int2_wire ... ok764test ctl::tests::recv_row_trailing_space_is_terminator ... ok765test ctl::tests::send_and_ack ... ok766test ctl::tests::send_with_int_arg ... ok767test ctl::tests::stop_drains_to_eof ... ok768test idp::tests::form_parsing_decodes ... ok769test names::tests::check_id_charset ... ok770test names::tests::explicit_confbase_wins ... ok771test names::tests::confbase_from_netname ... ok772test names::tests::neither_given ... ok773test names::tests::replace_name_envvar_missing ... ok774test names::tests::pidfile_before_resolve_panics - should panic ... ok775test names::tests::replace_name_envvar_squashes ... ok776test keypair::tests::wrong_type_fails ... ok777test names::tests::replace_name_host_falls_through ... ok778test ctl::tests::send_with_str_arg ... ok779test names::tests::replace_name_literal ... ok780test names::tests::unix_socket_case_sensitive ... ok781test names::tests::unix_socket_dot_pid_replaced ... ok782test keypair::tests::roundtrip_via_disk ... ok783test names::tests::unix_socket_exactly_dot_pid ... ok784test names::tests::resolve_runtime_confbase_fallback ... ok785test names::tests::unix_socket_no_dot_pid_appended ... ok786test tui::tests::goto_adjusts_to_one_indexed ... ok787test idp::tests::authorize_rejects_before_redirect_validation ... ok788test idp::tests::authorize_errors_redirect_after_validation ... ok789test idp::tests::state_round_trips_and_query_merges ... ok790test idp::tests::token_redirect_uri_must_match_code ... ok791test idp::tests::discovery_has_required_fields ... ok792test idp::tests::userinfo_rejects_expired_and_unknown ... ok793test idp::tests::token_client_auth ... ok794test idp::tests::code_is_single_use_and_expires ... ok795test idp::tests::sweep_drops_expired_state ... ok796test idp::tests::pkce_s256 ... ok797test idp::tests::full_code_flow ... ok798799test result: ok. 305 passed; 0 failed; 0 ignored; 0 measured; 0 filtered out; finished in 0.11s800801 Running unittests src/bin/sptps_keypair.rs (target/release/deps/sptps_keypair-1e6f30d12766b5f0)802803running 0 tests804805test result: ok. 0 passed; 0 failed; 0 ignored; 0 measured; 0 filtered out; finished in 0.00s806807 Running unittests src/bin/sptps_test.rs (target/release/deps/sptps_test-e072c7e6ee39cb94)808809running 0 tests810811test result: ok. 0 passed; 0 failed; 0 ignored; 0 measured; 0 filtered out; finished in 0.00s812813 Running unittests src/bin/tinc.rs (target/release/deps/tinc-6d7b10b054eaf027)814815running 0 tests816817test result: ok. 0 passed; 0 failed; 0 ignored; 0 measured; 0 filtered out; finished in 0.00s818819 Running unittests src/bin/tinc-auth.rs (target/release/deps/tinc_auth-e7e59b506d5812d5)820821running 0 tests822823test result: ok. 0 passed; 0 failed; 0 ignored; 0 measured; 0 filtered out; finished in 0.00s824825 Running tests/join_chunk2_hardening.rs (target/release/deps/join_chunk2_hardening-20500e499163e06e)826827running 2 tests828test chunk2_self_name_guard_is_case_insensitive ... ok829test chunk2_drops_dangerous_keys ... ok830831test result: ok. 2 passed; 0 failed; 0 ignored; 0 measured; 0 filtered out; finished in 0.00s832833 Running tests/self_roundtrip.rs (target/release/deps/self_roundtrip-03c11a8e7dd32d0d)834835running 12 tests836test cross_stream_c_server_c_client ... ok837test cross_stream_c_server_rust_client ... ok838test cross_stream_rust_server_c_client ... ok839test stream_large_payload ... ok840test stream_mode ... ok841test cross_stream_large_payload ... ok842test cross_pem_read ... ok843test stream_swapped_roles ... ok844test cross_datagram_c_server_c_client ... ok845test cross_datagram_c_server_rust_client ... ok846test cross_datagram_rust_server_c_client ... ok847test datagram_mode ... ok848849test result: ok. 12 passed; 0 failed; 0 ignored; 0 measured; 0 filtered out; finished in 2.02s850851 Running tests/tinc_cli/main.rs (target/release/deps/tinc_cli-d85325ba785113f2)852853running 95 tests854test argv::help_does_not_list_itself ... ok855test argv::arity_error_shows_usage ... ok856test argv::netname_traversal_rejected ... ok857test argv::unknown_option_exits_nonzero ... ok858test argv::no_command_exits_nonzero ... ok859test argv::network_list_doesnt_panic ... ok860test argv::help_exits_zero ... ok861test argv::network_switch_rejected ... ok862test argv::help_commands_aligned ... ok863test argv::unknown_command_exits_nonzero ... ok864test argv::tinc_auth_sockpath_alias ... ok865test argv::netname_dot_is_noop ... ok866test argv::glued_short_c ... ok867test argv::netname_flag_reaches_paths ... ok868test argv::network_switch_dot ... ok869test argv::netname_env_reaches_paths ... ok870test argv::version_subcommand_same_as_option ... ok871test ctl::ctl_disconnect_missing_arg ... ok872test argv::help_subcommand_same_as_option ... ok873test ctl::ctl_disconnect_bad_name ... ok874test ctl::ctl_pidfile_missing ... ok875test ctl::ctl_full_connect_against_fake_daemon ... ok876test ctl::ctl_reload_against_fake_daemon ... ok877test dump::dump_graph_dedups_edges ... ok878test dump::dump_digraph_against_fake ... ok879test ctl::ctl_pidfile_malformed ... ok880test config::config_unknown_var ... ok881test config::config_umbrella_default_get ... ok882test config::config_set_no_daemon_still_succeeds ... ok883test dump::dump_list_alias ... ok884test dump::dump_nodes_against_fake ... ok885test dump::dump_reachable_nodes_filters ... ok886test dump::dump_subnets_against_fake ... ok887test config::config_set_fires_reload ... ok888test config::config_replace_alias ... ok889test dump::dump_invitations_none ... ok890test config::config_add_is_not_set ... ok891test export_import::export_no_config ... ok892test dump::dump_unknown_type ... ok893test cross_impl::cross_init_key_loads_in_c ... ok894test edit::edit_reject_traversal ... ok895test fsck::fsck_no_config ... ok896test edit::edit_false_exits_nonzero ... ok897test export_import::export_format_matches_c_sscanf ... ok898test genkey::genkey_no_config ... ok899test config::config_del_all ... ok900test edit::edit_spacey_editor_tokenized ... ok901test edit::edit_true_exits_zero ... ok902test fsck::fsck_clean ... ok903test fsck::fsck_warning_exits_zero ... ok904test info::info_node_against_fake ... ok905test export_import::import_force_flag ... ok906test genkey::genkey_after_init ... ok907test info::info_subnet_address_mode ... ok908test init::init_missing_name ... ok909test info::info_node_not_found_short_circuits ... ok910test info::info_subnet_no_match ... ok911test export_import::export_import_workflow ... ok912test config::config_set_survives_fsck ... ok913test export_import::export_all_import_workflow ... ok914test init::init_case_insensitive_dispatch ... ok915test invite_join::invite_missing_arg ... ok916test info::info_invalid_arg ... ok917test init::init_via_dash_c ... ok918test init::init_name_from_stdin ... ok919test invite_join::join_bad_url ... ok920test init::init_via_glued_config ... ok921test invite_join::join_url_from_stdin ... ok922test sign_verify::sign_no_config ... ok923test fsck::fsck_force_fixes ... ok924test sign_verify::verify_no_signer_arg ... ok925test invite_join::invite_no_address ... ok926test top_log_pcap::log_garbage_level_rejected ... ok927test top_log_pcap::log_against_fake ... ok928test invite_join::join_existing_config_fails_early ... ok929test top_log_pcap::log_level_arg_forwarded_against_fake ... ok930test top_log_pcap::pcap_against_fake ... ok931test top_log_pcap::pcap_negative_snaplen_rejected ... ok932test top_log_pcap::top_too_many_args ... ok933test invite_join::invite_netname_threads_through ... ok934test invite_join::invite_prints_url ... ok935test top_log_pcap::top_stdin_not_tty_fails_after_connect ... ok936test argv::tinc_auth_glued_long_opts ... ok937test sign_verify::sign_stdin_verify_stdin ... ok938test edit::edit_argc_check ... ok939test config::config_get_name ... ok940test dump::dump_invitations_no_daemon ... ok941test edit::edit_echo_shows_resolved_path ... ok942test edit::edit_dollar_in_filename_not_expanded ... ok943test auth_http::auth_http_flow ... ok944test auth_http::auth_http_bad_requests ... ok945test sign_verify::sign_verify_roundtrip_binary ... ok946test idp_http::idp_refuses_foreign_bind ... ok947test sign_verify::sign_verify_cross_node ... ok948test idp_http::idp_full_flow_over_http ... ok949950test result: ok. 95 passed; 0 failed; 0 ignored; 0 measured; 0 filtered out; finished in 0.13s951952 Running unittests src/lib.rs (target/release/deps/tincd-a86d4b9170c11977)953954running 666 tests955test addrcache::tests::add_recent_moves_to_front ... ok956test addrcache::tests::tier_order_and_known_replaces ... ok957test addr::tests::v4_mapped_and_private_ranges ... ok958test autoconnect::tests::backoff_respected ... ok959test autoconnect::tests::cancel_pending_at_exactly_3 ... ok960test autoconnect::tests::connect_when_only_dht_key ... ok961test autoconnect::tests::disconnect_skips_single_homed ... ok962test autoconnect::tests::connect_when_under_3 ... ok963test autoconnect::tests::cancel_pending_when_over_3 ... ok964test autoconnect::tests::disconnect_never_picks_inbound ... ok965test autoconnect::tests::disconnect_when_over_3 ... ok966test autoconnect::tests::connect_skips_ineligible ... ok967test autoconnect::tests::connect_unreachable_backoff_high_prob ... ok968test autoconnect::tests::connect_to_unreachable_still_reachable ... ok969test autoconnect::tests::idle_shortcut_kept_if_nexthop_for_other ... ok970test autoconnect::tests::connect_skips_already_pending ... ok971test autoconnect::tests::drop_superfluous_spares_hot_nexthop ... ok972test autoconnect::tests::drop_superfluous_noop_when_all_hot ... ok973test autoconnect::tests::idle_reap_respects_min_hold ... ok974test autoconnect::tests::myself_never_picked ... ok975test autoconnect::tests::connect_unreachable_backoff_low_prob ... ok976test autoconnect::tests::pending_shortcut_not_cancelled ... ok977test autoconnect::tests::shortcut_added_at_nc3_when_relaying ... ok978test autoconnect::tests::shortcut_cap_enforced ... ok979test addrcache::tests::hostname_not_resolved_inline ... ok980test autoconnect::tests::shortcut_dropped_when_idle ... ok981test autoconnect::tests::noop_at_exactly_3 ... ok982test addrcache::tests::cap_on_disk ... ok983test autoconnect::tests::shortcut_not_added_past_d_hi ... ok984test autoconnect::tests::shortcut_kept_while_tx_hot ... ok985test addrcache::tests::load_rejects_missing_or_wrong_header ... ok986test broadcast::tests::direct_excludes_self ... ok987test broadcast::tests::direct_from_not_self ... ok988test broadcast::tests::direct_via_is_node ... ok989test addrcache::tests::roundtrip_file ... ok990test broadcast::tests::direct_via_self_nexthop_self ... ok991test broadcast::tests::direct_via_someone_else ... ok992test broadcast::tests::mst_empty_mst ... ok993test broadcast::tests::mst_excludes_from_conn ... ok994test broadcast::tests::mst_filters_non_mst ... ok995test broadcast::tests::mst_from_none ... ok996test compress::tests::from_wire_all_known ... ok997test compress::tests::decompress_garbage_is_none ... ok998test compress::tests::lz4_kat_cross_decompress ... ok999test compress::tests::lz4_kat_compress_matches ... ok1000test compress::tests::lz4_roundtrip ... ok1001test compress::tests::compress_empty ... ok1002test compress::tests::compress_incompressible ... ok1003test compress::tests::lzo_compress_empty ... ok1004test compress::tests::lzo_decompress_garbage_is_none ... ok1005test compress::tests::lzo_lo_random_roundtrip ... ok1006test compress::tests::lzo_hi_compress_stub_decompress_works ... ok1007test compress::tests::lzo_lo_compresses ... ok1008test compress::tests::none_decompress_respects_max_len ... ok1009test compress::tests::none_is_memcpy ... ok1010test compress::tests::unknown_level_is_none ... ok1011test compress::tests::zlib_kat_cross_decompress ... ok1012test compress::tests::zlib_roundtrip_level_6 ... ok1013test conn::tests::linebuf_compact_avoids_realloc ... ok1014test conn::tests::linebuf_consume_partial ... ok1015test conn::tests::linebuf_consume_all_resets ... ok1016test conn::tests::linebuf_line_then_partial ... ok1017test conn::tests::linebuf_empty_line ... ok1018test conn::tests::linebuf_one_full_line ... ok1019test conn::tests::linebuf_partial_then_complete ... ok1020test conn::tests::linebuf_range_survives_going_empty ... ok1021test conn::tests::linebuf_read_n_after_read_line ... ok1022test conn::tests::feed_sptps_partial_record ... ok1023test conn::tests::feed_sptps_decrypt_fail_is_dead ... ok1024test conn::tests::feed_sptps_empty_chunk ... ok1025test compress::tests::zlib_all_levels ... ok1026test conn::tests::linebuf_read_n_partial ... ok1027test conn::tests::linebuf_read_n_exact ... ok1028test conn::tests::linebuf_read_n_zero ... ok1029test conn::tests::linebuf_two_lines_one_feed ... ok1030test conn::tests::maxbufsize_matches_c ... ok1031test conn::tests::send_formats_id_greeting ... ok1032test conn::tests::send_raw_no_newline ... ok1033test conn::tests::send_second_doesnt_signal ... ok1034test conn::tests::take_rest_after_read_line ... ok1035test conn::tests::take_rest_empty_after_full_line ... ok1036test conn::tests::feed_sptpslen_single_chunk ... ok1037test control::tests::cookie_is_64_lowercase_hex ... ok1038test control::tests::cookies_differ ... ok1039test conn::tests::feed_sptpslen_straddle ... ok1040test daemon::gossip::weight::tests::band_check_edges ... ok1041test daemon::gossip::weight::tests::band_check_survives_hostile_ack_weight ... ok1042test daemon::net::helpers::tests::is_udp_unreachable_errno_matches_routing_failures ... ok1043test daemon::net::helpers::tests::handle_udp_unreachable_clears_state_and_rate_limits ... ok1044test daemon::settings::tests::compression_lzo_lo_accepted_hi_rejected ... ok1045test conn::tests::outbuf_hard_cap_marks_dead ... ok1046test daemon::settings::tests::compression_out_of_range_error_quotes_input ... ok1047test daemon::settings::tests::dht_secret_b64_cases ... ok1048test daemon::settings::tests::udp_discovery_timeout_clamped_above_keepalive ... ok1049test daemon::settings::tests::parse_bind_addr_cases ... ok1050test control::tests::bind_preserves_non_socket ... ok1051test daemon::settings::tests::forwarding_is_reloadable ... ok1052test control::tests::accept_roundtrip ... ok1053test control::tests::pidfile_fchmod_on_existing ... ok1054test control::tests::pidfile_nofollow ... ok1055test daemon::settings::tests::pingtimeout_out_of_range_snaps_to_pinginterval ... ok1056test daemon::setup::tests::build_listeners_wildcard_host ... ok1057test daemon::setup::tests::build_listeners_dedups ... ok1058test daemon::settings::tests::keyexpire_clamped ... ok1059test daemon::setup::tests::build_listeners_no_config_is_wildcard ... ok1060test daemon::setup::tests::build_listeners_two_bindto_shares_port ... ok1061test daemon::setup::tests::expand_name_envvar ... ok1062test control::tests::pidfile_format ... ok1063test daemon::setup::tests::build_listeners_bindto_vs_listen ... ok1064test daemon::setup::tests::expand_name_host_fallback ... ok1065test daemon::setup::tests::expand_name_passthrough ... ok1066test control::tests::second_bind_refused ... ok1067test daemon::setup::tests::expand_name_unset_var_errors ... ok1068test daemon::tests::periodic_contradicting_edge_backoff ... ok1069test daemon::tests::ratelimit_drops_after_3 ... ok1070test discovery::probe::tests::port_probe_reply_parse_edges ... ok1071test control::tests::socket_perms ... ok1072test discovery::blind::tests::kat_pin ... ok1073test control::tests::stale_socket_recovered ... ok1074test discovery::record::tests::bep44_signable_matches_mainline ... ok1075test discovery::record::tests::parse_record_filters_unwanted_addr_classes ... ok1076test discovery::record::tests::record_parse ... ok1077test daemon::settings::tests::dht_secret_file_cases ... ok1078test discovery::record::tests::seal_open_roundtrip ... ok1079test daemon::setup::tests::aliases_collisions ... ok1080test discovery::blind::tests::blind_sign_verify_roundtrip ... ok1081test dispatch::tests::check_id_security ... ok1082test dispatch::tests::control_dump_traffic ... ok1083test dispatch::tests::control_log ... ok1084test dispatch::tests::control_disconnect ... ok1085test dispatch::tests::control_retry ... ok1086test dispatch::tests::gate_cases ... ok1087test dispatch::tests::control_pcap ... ok1088test dispatch::tests::id_cookie_mismatch ... ok1089test dispatch::tests::control_purge ... ok1090test conn::tests::feed_sptps_two_records_one_chunk ... ok1091test conn::tests::feed_sptpslen_then_record ... ok1092test dispatch::tests::id_invitation_bad_throwaway ... ok1093test dispatch::tests::control_malformed_subtype_drops ... ok1094test dispatch::tests::id_bumps_ping_time ... ok1095test dispatch::tests::control_set_debug ... ok1096test dispatch::tests::id_early_rejects ... ok1097test dispatch::tests::invite_label_no_nul ... ok1098test dispatch::tests::myself_options_clamp_mss_off ... ok1099test dispatch::tests::control_unknown_subtype ... ok1100test dispatch::tests::id_control_rejected_on_non_unix_conn ... ok1101test dispatch::tests::myself_options_default_value ... ok1102test dispatch::tests::id_invitation_rejected_on_outgoing_conn ... ok1103test dispatch::tests::myself_options_empty_config ... ok1104test dispatch::tests::myself_options_indirect_only ... ok1105test dispatch::tests::myself_options_tcponly_but_pmtu_forced_on ... ok1106test dispatch::tests::myself_options_tcponly_implies_indirect_clears_pmtu ... ok1107test dispatch::tests::control_reload ... ok1108test dispatch::tests::parse_ack_malformed ... ok1109test dispatch::tests::parse_ack_roundtrip ... ok1110test dispatch::tests::pmtu_cap_is_min_of_host_and_global ... ok1111test dispatch::tests::proto_version_pin ... ok1112test dispatch::tests::record_body_strip ... ok1113test dispatch::tests::send_ack_global_weight_fallback ... ok1114test dispatch::tests::id_peer_unknown_identity ... ok1115test dispatch::tests::send_ack_no_per_host_inherits_global ... ok1116test dispatch::tests::send_ack_per_host_beats_global ... ok1117test dispatch::tests::send_ack_per_host_clamp_mss_overrides ... ok1118test dispatch::tests::send_ack_per_host_indirect ... ok1119test dispatch::tests::send_ack_per_host_tcponly_clears_pmtu ... ok1120test dispatch::tests::id_peer_major_mismatch ... ok1121test dispatch::tests::send_ack_per_host_weight ... ok1122test dispatch::tests::tcp_label_has_trailing_nul ... ok1123test dispatch::tests::id_peer_rollback_rejected ... ok1124test dispatch::tests::tcp_label_order_matters ... ok1125test dispatch::tests::id_peer_no_dot_minor_zero ... ok1126test dns::tests::answer_a_alias ... ok1127test dns::tests::answer_a_ignores_ranges ... ok1128test dns::tests::answer_a_multi ... ok1129test dns::tests::answer_a_myself_nodata ... ok1130test dns::tests::answer_a_single ... ok1131test dns::tests::answer_a_unknown_node_nxdomain ... ok1132test dns::tests::answer_case_insensitive_owner ... ok1133test dns::tests::answer_aaaa ... ok1134test dns::tests::answer_ptr_v4 ... ok1135test dns::tests::answer_ptr_v4_only_range_nx ... ok1136test dns::tests::answer_ptr_v6 ... ok1137test dns::tests::answer_wrong_suffix_nx ... ok1138test dns::tests::match_v4_hit ... ok1139test dns::tests::match_v4_ip_options_rejected ... ok1140test dns::tests::match_v4_wrong_dst ... ok1141test dns::tests::match_v4_wrong_port ... ok1142test dns::tests::match_v6_hit ... ok1143test dns::tests::nxdomain_echoes_qtype ... ok1144test dns::tests::parse_query_basic ... ok1145test dns::tests::parse_query_compression_pointer_rejected ... ok1146test dns::tests::parse_query_lowercases ... ok1147test dns::tests::parse_query_non_standard_opcode ... ok1148test dns::tests::parse_query_response_bit_drops ... ok1149test dns::tests::parse_query_truncated_header ... ok1150test dns::tests::ptr_v4_roundtrip ... ok1151test dns::tests::ptr_v6_roundtrip ... ok1152test dns::tests::wrap_v4_shape ... ok1153test dns::tests::wrap_v6_checksum_verifies ... ok1154test egress::linux::tests::fast_count_1_is_plain_sendto ... ok1155test egress::linux::tests::fast_gso_splits_at_stride ... ok1156test egress::linux::tests::fast_gso_short_tail ... ok1157test egress::linux::tests::fast_gso_stride_changes ... ok1158test egress::linux::tests::fast_matches_portable_on_wire ... ok1159test egress::tests::portable_batch_splits_at_stride ... ok1160test egress::tests::portable_count_1_is_one_sendto ... ok1161test egress::tests::portable_dup_survives_drop ... ok1162test egress::tests::txbatch_caps_at_udp_datagram_limit ... ok1163test egress::tests::txbatch_coalesce_gates ... ok1164test egress::tests::txbatch_empty_take_is_none ... ok1165test egress::tests::txbatch_dense_packing_roundtrip ... ok1166test event::io::tests::add_failure_frees_slot ... ok1167test event::io::tests::del_idempotent ... ok1168test event::io::tests::del_makes_what_none ... ok1169test event::io::tests::freelist_reuses_slot ... ok1170test event::io::tests::io_wants_table ... ok1171test event::io::tests::partial_drain_refires_next_turn ... ok1172test event::io::tests::set_same_interest_noop ... ok1173test event::io::tests::write_before_read_same_fd ... ok1174test event::sig::tests::drain_dispatches_from_table ... ok1175test event::sig::tests::drain_reads_exactly_pending ... ok1176test event::sig::tests::drain_skips_unknown ... ok1177test event::sig::tests::drop_resets_singleton ... ok1178test event::timer::tests::del_idempotent ... ok1179test event::timer::tests::future_timer_returns_diff ... ok1180test event::timer::tests::tick_clears_out ... ok1181test event::io::tests::add_and_turn_reads ... ok1182test event::timer::tests::tick_empty_returns_none ... ok1183test fragment::tests::alignment_1499_payload ... ok1184test fragment::tests::fragments_1500_at_mtu_590 ... ok1185test fragment::tests::reassembly_roundtrip ... ok1186test fragment::tests::refragmentation_preserves_mf_and_offset ... ok1187test fragment::tests::rejects_ip_options ... ok1188test fragment::tests::rejects_length_mismatch ... ok1189test fragment::tests::rejects_too_short ... ok1190test event::io::tests::turn_clears_out ... ok1191test graph::glue_tests::myself_excluded ... ok1192test graph::glue_tests::no_change_empty ... ok1193test graph::glue_tests::cascade ... ok1194test graph::glue_tests::run_graph_mst_sees_writeback ... ok1195test graph::glue_tests::set_reachable_persisted ... ok1196test graph::glue_tests::single_reachable ... ok1197test graph::glue_tests::single_unreachable ... ok1198test graph::tests::del_both_halves_either_order ... ok1199test graph::tests::del_edge_on_freed_slot_is_noop ... ok1200test graph::tests::del_edge_postconditions ... ok1201test graph::tests::del_edge_removes_from_weight_order ... ok1202test graph::tests::del_node_recycles_slot ... ok1203test graph::tests::edge_iter_skips_freed_slots ... ok1204test graph::tests::edge_iter_yields_recycled_slot ... ok1205test graph::tests::edge_order_by_to_name ... ok1206test graph::tests::lookup_edge_finds_by_names ... ok1207test graph::tests::node_ids_skips_freed ... ok1208test graph::tests::reverse_auto_links ... ok1209test graph::tests::sssp_after_del_unreachable ... ok1210test graph::tests::sssp_singleton ... ok1211test graph::tests::sssp_skips_reverseless ... ok1212test graph::tests::sticky_empty_prev_is_plain_sssp ... ok1213test graph::tests::sticky_ignored_on_hop_change ... ok1214test graph::tests::sticky_ignored_when_old_nexthop_gone ... ok1215test graph::tests::sticky_keeps_prev_within_band ... ok1216test graph::tests::sticky_switches_when_clearly_better ... ok1217test graph::tests::del_node_cascades_outgoing ... ok1218test graph::tests::update_edge_changes_mst_result ... ok1219test graph::tests::update_edge_on_deleted_is_none ... ok1220test graph::tests::update_edge_preserves_id ... ok1221test graph::tests::update_edge_same_weight_is_noop_on_weight_order ... ok1222test icmp::tests::ratelimit_allows_then_drops ... ok1223test icmp::tests::v4_frag_needed_sets_mtu ... ok1224test icmp::tests::v4_net_unknown_kat ... ok1225test icmp::tests::v4_quote_capped_at_548 ... ok1226test icmp::tests::v4_quotes_original ... ok1227test icmp::tests::v4_src_override ... ok1228test icmp::tests::v4_swaps_addrs ... ok1229test icmp::tests::v4_too_short_is_none ... ok1230test icmp::tests::v6_basic ... ok1231test icmp::tests::v6_pkt_too_big_sets_mtu ... ok1232test icmp::tests::v6_src_override ... ok1233test icmp::tests::v6_too_short_is_none ... ok1234test inthash::tests::newtype_u32_keys ... ok1235test inthash::tests::distinct_u32_keys_distinct_hashes ... ok1236test inthash::tests::six_byte_keys_work ... ok1237test invitation_serve::tests::chunk_file_empty ... ok1238test invitation_serve::tests::chunk_file_exact_multiple ... ok1239test invitation_serve::tests::chunk_file_with_remainder ... ok1240test invitation_serve::tests::parse_name_line_case_insensitive ... ok1241test invitation_serve::tests::finalize_rejects_bad_pubkey_shapes ... ok1242test invitation_serve::tests::finalize_rejects_newline ... ok1243test invitation_serve::tests::finalize_rejects_existing ... ok1244test invitation_serve::tests::read_invitation_key_missing ... ok1245test invitation_serve::tests::finalize_writes_host_file ... ok1246test invitation_serve::tests::read_invitation_key_valid ... ok1247test invitation_serve::tests::serve_cookie_nonexisting ... ok1248test invitation_serve::tests::serve_cookie_bad_name_chars ... ok1249test invitation_serve::tests::serve_cookie_bad_first_line ... ok1250test event::timer::tests::del_double_does_not_alias_ids ... ok1251test invitation_serve::tests::serve_cookie_roundtrip ... ok1252test invitation_serve::tests::split_var_forms ... ok1253test event::timer::tests::fire_disarms_slot ... ok1254test keys::tests::b64_bad_char ... ok1255test invitation_serve::tests::serve_cookie_expired ... ok1256test keys::tests::b64_roundtrip ... ok1257test invitation_serve::tests::serve_cookie_self_invite_rejected ... ok1258test event::timer::tests::next_timeout_after_dispatch_rearm ... ok1259test keys::tests::b64_wrong_len ... ok1260test event::timer::tests::now_is_cached ... ok1261test event::timer::tests::rearm_removes_old_deadline ... ok1262test event::timer::tests::same_instant_timers_both_fire ... ok1263test keys::tests::priv_perm_condition ... ok1264test invitation_serve::tests::serve_cookie_single_use ... ok1265test keys::tests::priv_default_path ... ok1266test keys::tests::priv_explicit_path ... ok1267test keys::tests::systemd_credential_permissions_are_confined ... ok1268test listen::tarpit::tests::pit_drop_is_clean ... ok1269test listen::tarpit::tests::pit_ring_wrap ... ok1270test keys::tests::priv_insecure_perms_loads_anyway ... ok1271test listen::tarpit::tests::tarpit_allhost_triggers_at_ten ... ok1272test listen::tarpit::tests::tarpit_alternating_hosts_only_allhost ... ok1273test listen::tarpit::tests::tarpit_drain ... ok1274test keys::tests::priv_malformed ... ok1275test listen::tarpit::tests::tarpit_ignores_port ... ok1276test listen::tarpit::tests::tarpit_prev_updates_on_pit ... ok1277test keys::tests::priv_missing_is_distinct_variant ... ok1278test listen::tarpit::tests::tarpit_samehost_early_return ... ok1279test keys::tests::pub_hosts_file_missing ... ok1280test listen::tarpit::tests::tarpit_v6 ... ok1281test keys::tests::pub_no_key_silent_none ... ok1282test listen::tests::addr_family_parse ... ok1283test keys::tests::pub_source1_bad_no_fallthrough ... ok1284test keys::tests::pub_source1_inline_b64 ... ok1285test listen::tests::addr_family_try ... ok1286test keys::tests::pub_inline_wins_over_pem ... ok1287test keys::tests::pub_source2_explicit_file ... ok1288test listen::tests::adopt_dual_stack_fd_yields_dual_stack_udp ... ok1289test keys::tests::pub_source3_pem_in_hosts ... ok1290test listen::tests::adopt_listeners_from_high_fd ... ok1291test listen::tests::adopt_listeners_mid_error_closes_tail ... ok1292test listen::tests::adopt_listeners_not_a_socket ... ok1293test listen::tests::adopt_listeners_too_many ... ok1294test listen::tests::assign_static_port_cases ... ok1295test listen::tests::bind_reusing_port_fallback ... ok1296test listen::tests::fmt_addr_cases ... ok1297test listen::tests::is_local_cases ... ok1298test listen::tests::open_bind_to_interface_bad_is_graceful ... ok1299test listen::tests::open_any_one_or_two ... ok1300test listen::tests::open_bind_to_interface_lo ... ok1301test listen::tests::open_cloexec ... ok1302test listen::tests::open_fwmark_set ... ok1303test listen::tests::open_fwmark_zero_is_skip ... ok1304test listen::tests::open_pair_bindto_flag_plumbed ... ok1305test listen::tests::open_port_clash_is_graceful ... ok1306test listen::tests::open_port_zero_tcp_udp_same_port ... ok1307test listen::tests::open_port_zero_v4_v6_same_port ... ok1308test listen::tests::open_udp_nonblocking ... ok1309test event::io::tests::set_changes_interest ... ok1310test listen::tests::open_udp_pmtudisc_do ... ok1311test listen::tests::open_udp_rcvbuf_set ... ok1312test listen::tests::open_v4_only ... ok1313test bgresolve::tests::worker_roundtrip_localhost ... ok1314test listen::tests::open_v6only_set ... ok1315test event::timer::tests::drains_all_expired ... ok1316test listen::tests::pidfile_addr_empty_fallback ... ok1317test event::timer::tests::fires_after_duration ... ok1318test listen::tests::sockopts_defaults_match_c ... ok1319test listen::tests::unmap_then_is_local ... ok1320test listen::tests::unmap_cases ... ok1321test local_addr::tests::adapt_finds_match ... ok1322test local_addr::tests::adapt_no_match_returns_current ... ok1323test local_addr::tests::adapt_same_family_noop ... ok1324test local_addr::tests::ans_key_reflexive_roundtrip ... ok1325test local_addr::tests::choose_adapts_socket ... ok1326test local_addr::tests::choose_empty_returns_none ... ok1327test local_addr::tests::choose_single_returns_it ... ok1328test local_addr::tests::parse_garbage_is_none ... ok1329test local_addr::tests::parse_roundtrip_v4 ... ok1330test local_addr::tests::parse_roundtrip_v6 ... ok1331test local_addr::tests::choose_distribution ... ok1332test local_addr::tests::parse_v4_mapped_unmaps_to_native_v4 ... ok1333test local_addr::tests::parse_unspec_is_none ... ok1334test log_tap::tests::debug_level_roundtrip ... ok1335test log_tap::tests::gate_toggles ... ok1336test log_tap::tests::level_to_filter_mapping ... ok1337test log_tap::tests::push_and_drain ... ok1338test mac_lease::tests::age_all_expired ... ok1339test mac_lease::tests::age_exactly_at_expiry ... ok1340test mac_lease::tests::age_idempotent ... ok1341test mac_lease::tests::age_nothing_expired ... ok1342test mac_lease::tests::age_some_expired ... ok1343test mac_lease::tests::learn_existing_is_refresh ... ok1344test mac_lease::tests::learn_second_returns_false ... ok1345test mac_lease::tests::refresh_known_bumps ... ok1346test mac_lease::tests::refresh_unknown_returns_false ... ok1347test mss::tests::checksum_adjust_edge_cases ... ok1348test mss::tests::clamps_basic_v4_syn ... ok1349test mss::tests::does_not_increase ... ok1350test mss::tests::doff_less_than_5_noop ... ok1351test mss::tests::empty_packet_noop ... ok1352test mss::tests::eol_stops_walk ... ok1353test mss::tests::ihl_with_options ... ok1354test mss::tests::ip_in_ip ... ok1355test mss::tests::malformed_opt_len_0 ... ok1356test mss::tests::malformed_opt_len_overrun ... ok1357test mss::tests::mss_after_len4_opt_works_by_accident ... ok1358test mss::tests::mtu_too_small_noop ... ok1359test mss::tests::no_mss_option_noop ... ok1360test mss::tests::non_tcp_noop ... ok1361test mss::tests::short_packet_noop ... ok1362test mss::tests::skips_other_option_then_finds_mss ... ok1363test mss::tests::truncated_after_mss_kind ... ok1364test mss::tests::v6_basic ... ok1365test mss::tests::vlan_but_truncated ... ok1366test mss::tests::vlan_tagged ... ok1367test neighbor::tests::arp_roundtrip ... ok1368test neighbor::tests::build_arp_reply_swaps ... ok1369test neighbor::tests::build_ndp_advert_checksum_valid ... ok1370test neighbor::tests::build_ndp_advert_fields ... ok1371test neighbor::tests::build_ndp_advert_hlim_255 ... ok1372test neighbor::tests::overwrite_mac_snatch_then_stamp ... ok1373test neighbor::tests::build_ndp_advert_no_opt ... ok1374test neighbor::tests::parse_arp_non_ethernet_hw ... ok1375test neighbor::tests::parse_arp_reply_is_none ... ok1376test neighbor::tests::parse_arp_too_short ... ok1377test neighbor::tests::parse_arp_valid_request ... ok1378test neighbor::tests::parse_ndp_bad_checksum ... ok1379test neighbor::tests::parse_ndp_too_short ... ok1380test neighbor::tests::parse_ndp_valid_solicit ... ok1381test neighbor::tests::parse_ndp_wrong_nexthdr ... ok1382test neighbor::tests::parse_ndp_wrong_type ... ok1383test node_id::tests::display_is_12_hex_lowercase ... ok1384test node_id::tests::from_name_kat ... ok1385test node_id::tests::null_is_zero_is_null ... ok1386test node_id::tests::table_collision_overwrites ... ok1387test node_id::tests::table_roundtrip ... ok1388test outgoing::tests::bump_timeout_backoff ... ok1389test outgoing::tests::dial_sockopts_bad_iface_is_warn_only ... ok1390test outgoing::tests::dial_sockopts_bind_to_interface_lo ... ok1391test outgoing::tests::dial_sockopts_fwmark ... ok1392test outgoing::tests::probe_refused ... ok1393test outgoing::tests::proxy_config_parse ... ok1394test outgoing::tests::probe_connected_loopback ... ok1395test packet::tests::inet_checksum_is_chainable ... ok1396test packet::tests::ether_arp_roundtrip ... ok1397test packet::tests::inet_checksum_kat ... ok1398test packet::tests::inet_checksum_verifies_to_zero ... ok1399test packet::tests::ipv4_ihl_v_packing ... ok1400test packet::tests::ipv4hdr_len_is_be_on_wire ... ok1401test packet::tests::ipv4hdr_roundtrip ... ok1402test packet::tests::ipv6_flow_version_packing ... ok1403test packet::tests::ipv6hdr_roundtrip ... ok1404test packet::tests::struct_sizes_match_c_static_asserts ... ok1405test pmtu::tests::confirmed_idle_path_requires_cold_revalidation ... ok1406test outgoing::tests::resolve_missing_file ... ok1407test pmtu::tests::failed_revalidation_submissions_do_not_count ... ok1408test pmtu::tests::discovery_timeout_with_only_tiny_replies_fixes_at_zero ... ok1409test pmtu::tests::four_lost_reprobes_reset ... ok1410test pmtu::tests::increase_detector_gated_on_minmtu_floor ... ok1411test pmtu::tests::initial_udp_discovery_probe_is_due_immediately ... ok1412test outgoing::tests::proxy_exec_env ... ok1413test pmtu::tests::is_discovery_start_only_at_zero ... ok1414test outgoing::tests::resolve_address_port_precedence ... ok1415test pmtu::tests::keepalive_reply_does_not_raise_minmtu ... ok1416test pmtu::tests::on_emsgsize_caps_maxmtu ... ok1417test pmtu::tests::on_emsgsize_can_converge ... ok1418test pmtu::tests::on_emsgsize_floors_at_minmtu ... ok1419test pmtu::tests::on_meta_ack_clamps_peer_supplied_len ... ok1420test pmtu::tests::on_meta_ack_ignores_unsolicited ... ok1421test pmtu::tests::on_meta_ack_rewinds_revalidate_to_steady ... ok1422test pmtu::tests::on_meta_ack_short_len_does_not_rewind ... ok1423test pmtu::tests::on_meta_ack_small_len_does_not_raise_minmtu ... ok1424test pmtu::tests::on_probe_reply_clamps_peer_supplied_len ... ok1425test pmtu::tests::on_probe_reply_early_converge ... ok1426test pmtu::tests::on_probe_reply_increase_detected ... ok1427test pmtu::tests::on_probe_reply_raises_minmtu ... ok1428test pmtu::tests::on_probe_reply_records_rtt ... ok1429test pmtu::tests::on_probe_reply_stamps_udp_reply_rx ... ok1430test pmtu::tests::on_probe_reply_steady_confirm_rewinds ... ok1431test pmtu::tests::on_udp_timeout_idempotent_when_unconfirmed ... ok1432test pmtu::tests::on_udp_timeout_resets ... ok1433test pmtu::tests::probe_size_first_is_1329 ... ok1434test pmtu::tests::probe_size_interval_zero ... ok1435test pmtu::tests::probe_size_last_is_min_plus_1 ... ok1436test pmtu::tests::probe_size_maxmtu_not_1518_multiplier_1 ... ok1437test pmtu::tests::probe_size_second_is_1407 ... ok1438test pmtu::tests::steady_state_at_mtu_no_plus_one ... ok1439test pmtu::tests::steady_state_probes_maxmtu_plus_one ... ok1440test pmtu::tests::tick_at_20_fixes ... ok1441test pmtu::tests::tick_discovery_advances_phase ... ok1442test pmtu::tests::tick_gated_by_333ms ... ok1443test pmtu::tests::try_fix_clamp_down_below_minmtu_is_unusable ... ok1444test pmtu::tests::udp_probe_attempt_tracks_submission_separately ... ok1445test pmtu::tests::udp_timed_out_gates_on_outstanding_probe ... ok1446test pmtu::tests::udp_timeout_makes_rediscovery_probe_due_immediately ... ok1447test portmap::igd::tests::control_url_from_miniupnpd_rootdesc ... ok1448test portmap::igd::tests::control_url_prefers_ip_over_ppp ... ok1449test portmap::igd::tests::ssdp_reply_to_addr_and_path ... ok1450test portmap::pcp::tests::build_map_request_layout ... ok1451test portmap::pcp::tests::parse_map_response_paths ... ok1452test portmap::tests::publishable_ext_filter ... ok1453test portmap::tests::upnp_mode_parse ... ok1454test outgoing::tests::proxy_exec_roundtrip ... ok1455test punch::tests::dial_delay_clamped ... ok1456test punch::tests::expiry ... ok1457test punch::tests::handshake_b_then_a ... ok1458test punch::tests::replay_dropped ... ok1459test punch::tests::payload_roundtrip ... ok1460test reload::tests::connect_to_diff ... ok1461test reload::tests::connect_to_no_change ... ok1462test reload::tests::conns_to_terminate_file_deleted ... ok1463test reload::tests::conns_to_terminate_mixed ... ok1464test reload::tests::conns_to_terminate_mtime_exactly_equal ... ok1465test reload::tests::conns_to_terminate_mtime_newer ... ok1466test reload::tests::conns_to_terminate_mtime_older ... ok1467test reload::tests::subnets_full_replace ... ok1468test reload::tests::subnets_no_change ... ok1469test reload::tests::subnets_one_added ... ok1470test reload::tests::subnets_one_removed ... ok1471test reload::tests::subnets_same_addr_different_weight ... ok1472test route_decide::tests::decrement_ttl_8021q_skip ... ok1473test route_decide::tests::decrement_ttl_unknown_ethertype_noop ... ok1474test route_decide::tests::decrement_ttl_v4_at_1_but_is_timeexceeded ... ok1475test route_decide::tests::decrement_ttl_v4_at_1_sends_icmp ... ok1476test route_decide::tests::decrement_ttl_v4_decrements_and_adjusts_checksum ... ok1477test route_decide::tests::decrement_ttl_v4_minimal_frame_ttl_expired ... ok1478test route_decide::tests::decrement_ttl_v6_at_1_sends_icmp ... ok1479test route_decide::tests::decrement_ttl_v6_decrements ... ok1480test route_decide::tests::decrement_ttl_v6_minimal_frame_hlim_expired ... ok1481test route_decide::tests::extract_tos_gates ... ok1482test route_decide::tests::extract_tos_v4 ... ok1483test route_decide::tests::extract_tos_v6 ... ok1484test route_decide::tests::route_ethertype_dispatch ... ok1485test route_decide::tests::route_ipv4_broadcast_subnet ... ok1486test route_decide::tests::route_ipv4_forwards_to_owner ... ok1487test route_decide::tests::route_ipv4_forwards_to_self ... ok1488test route_decide::tests::route_ipv4_unknown_net ... ok1489test route_decide::tests::route_ipv4_unreachable_owner ... ok1490test route_decide::tests::route_ipv6_broadcast_subnet ... ok1491test route_decide::tests::route_ipv6_forwards_to_owner ... ok1492test route_decide::tests::route_ipv6_ndp_divert ... ok1493test route_decide::tests::route_ipv6_too_short ... ok1494test route_decide::tests::route_ipv6_unknown_is_unreachable_addr ... ok1495test route_decide::tests::route_ipv6_unreachable_owner_is_noroute ... ok1496test route_decide::tests::route_too_short ... ok1497test route_decide::tests::route_too_short_for_ethertype ... ok1498test route_mac::tests::route_mac_empty_table_broadcasts ... ok1499test route_mac::tests::route_mac_forwards_to_self ... ok1500test route_mac::tests::route_mac_kat_real_frame ... ok1501test route_mac::tests::route_mac_too_short ... ok1502test route_mac::tests::route_mac_table ... ok1503test sandbox::tests::can_before_enter_is_always_true ... ok1504test sandbox::tests::discover_paths_high_drops_scripts ... ok1505test sandbox::tests::discover_paths_normal_shape ... ok1506test sandbox::tests::level_parse_case_insensitive ... ok1507test script::tests::base_env_has_expected_keys ... ok1508test sd_notify::tests::abstract_socket_at_prefix_maps_to_nul ... ok1509test sd_notify::tests::datagram_body_is_exact_state_string ... ok1510test sd_notify::tests::relative_path_is_rejected ... ok1511test sd_notify::tests::multiple_states_arrive_as_separate_datagrams ... ok1512test sd_notify::tests::watchdog_interval_absent_or_garbage_is_none ... ok1513test sd_notify::tests::watchdog_interval_halves_the_timeout ... ok1514test seen::tests::age_counts ... ok1515test seen::tests::age_boundary_evicts ... ok1516test seen::tests::age_evicts_old ... ok1517test seen::tests::age_keeps_young ... ok1518test seen::tests::check_after_age_is_false ... ok1519test seen::tests::check_dedups_across_nonce ... ok1520test seen::tests::check_different_false ... ok1521test seen::tests::check_second_is_true ... ok1522test script::tests::not_found_is_ok ... ok1523test seen::tests::flood_limiter_allows_then_drops_then_refills ... ok1524test seen::tests::flood_limiter_caps_at_burst ... ok1525test shard::probe::tests::body_len_eq_minmtu_is_some ... ok1526test seen::tests::purge_mentions_frees_node_lines ... ok1527test shard::probe::tests::direct_peer_default_options_is_some ... ok1528test script::tests::env_is_inherited ... ok1529test shard::probe::tests::indirect_route_is_none ... ok1530test script::tests::runs_and_fails ... ok1531test shard::probe::tests::seal_key_limit_is_none ... ok1532test script::tests::env_vars_passed ... ok1533test shard::probe::tests::slowpath_all_is_none ... ok1534test script::tests::runs_and_succeeds ... ok1535test shard::probe::tests::minmtu_zero_is_none ... ok1536test shard::punt::tests::push_pop_roundtrip ... ok1537test shard::punt::tests::freelist_reuses_buffers ... ok1538test shard::rx::tests::bad_tag_no_replay_advance ... ok1539test shard::rx::tests::dst_not_myself_punts_no_replay_advance ... ok1540test shard::rx::tests::pkt_probe_punts_no_replay_advance ... ok1541test shard::rx::tests::roundtrip_probe_open_ok ... ok1542test shard::punt::tests::drops_when_full_and_counts ... ok1543test shard::probe::tests::tcponly_is_none ... ok1544test shard::rx::tests::short_packet_is_none ... ok1545test script::tests::script_cwd_is_confbase ... ok1546test shard::snapshot::tests::build_populates_entries_dense ... ok1547test shard::snapshot::tests::clone_is_refcount_bump ... ok1548test shard::snapshot::tests::default_is_empty_safe ... ok1549test shard::snapshot::tests::edge_addr_only_for_direct_neighbors ... ok1550test script::tests::interpreter_used ... ok1551test shard::snapshot::tests::resolve_gates_on_reachability ... ok1552test shard::snapshot::tests::resolve_mirrors_daemon_route_closure ... ok1553test socks::tests::check_socks4_table ... ok1554test socks::tests::check_socks5_table ... ok1555test socks::tests::roundtrip_socks4 ... ok1556test socks::tests::roundtrip_socks5_v4_anon ... ok1557test socks::tests::roundtrip_socks5_v4_password ... ok1558test socks::tests::roundtrip_socks5_v6_anon ... ok1559test socks::tests::socks4_v4_anonymous ... ok1560test socks::tests::socks4_v4_with_user ... ok1561test socks::tests::socks4_v6_rejected ... ok1562test socks::tests::socks5_cred_too_long ... ok1563test seen::tests::check_refuses_past_cap ... ok1564test socks::tests::socks5_user_without_pass_is_anonymous ... ok1565test socks::tests::socks5_v4_password ... ok1566test socks::tests::socks5_v4_anonymous ... ok1567test socks::tests::socks5_v6 ... ok1568test subnet_tree::tests::add_idempotent ... ok1569test subnet_tree::tests::del_missing_is_false ... ok1570test subnet_tree::tests::del_removes ... ok1571test subnet_tree::tests::del_weight_is_part_of_key ... ok1572test subnet_tree::tests::families_isolated ... ok1573test subnet_tree::tests::ipv4_ord_addr_tiebreak ... ok1574test subnet_tree::tests::ipv4_ord_owner_tiebreak ... ok1575test subnet_tree::tests::ipv4_ord_prefixlen_desc ... ok1576test subnet_tree::tests::ipv4_ord_weight_at_i32_extremes ... ok1577test subnet_tree::tests::ipv4_ord_weight_negative ... ok1578test subnet_tree::tests::ipv4_ord_weight_tiebreak ... ok1579test subnet_tree::tests::ipv6_ord_prefixlen_desc ... ok1580test subnet_tree::tests::iter_order_matches_c_splay ... ok1581test subnet_tree::tests::iter_skips_broadcast ... ok1582test subnet_tree::tests::lookup_broadcast_short_circuits_reachable ... ok1583test subnet_tree::tests::lookup_ipv6_longest_wins ... ok1584test subnet_tree::tests::lookup_longest_wins ... ok1585test subnet_tree::tests::lookup_miss ... ok1586test subnet_tree::tests::lookup_returns_unreachable_fallback ... ok1587test subnet_tree::tests::lookup_skips_unreachable ... ok1588test subnet_tree::tests::lookup_weight_prefers_lower ... ok1589test subnet_tree::tests::mac_no_prefix ... ok1590test subnet_tree::tests::peer_cannot_hijack_multicast_via_more_specific ... ok1591test tcp_tunnel::tests::build_roundtrip ... ok1592test tcp_tunnel::tests::kat_wire_bytes ... ok1593test tcp_tunnel::tests::parse_exactly_12 ... ok1594test tcp_tunnel::tests::parse_short ... ok1595test tcp_tunnel::tests::red_at_max_mostly_drops ... ok1596test tcp_tunnel::tests::red_below_half_never_drops ... ok1597test tcp_tunnel::tests::red_max_zero_never_drops ... ok1598test tunnel::tests::make_udp_label_differs_from_tcp ... ok1599test tunnel::tests::make_udp_label_format ... ok1600test tunnel::tests::periodic_rekey_due_gates ... ok1601test tunnel::tests::prev_sptps_reap_predicate ... ok1602test tunnel::tests::reset_unreachable_clears_everything ... ok1603test tunnel::tests::tunnel_status_bitfield_packing ... ok1604test udp_info::tests::mtu_adjust_table ... ok1605test udp_info::tests::mtu_recv_table ... ok1606test udp_info::tests::mtu_send_gates ... ok1607test udp_info::tests::udp_recv_table ... ok1608test scriptworker::tests::fifo_and_drain_on_drop ... ok1609test udp_info::tests::udp_send_gates ... ok1610test bgresolve::tests::inflight_dedup ... ok1611test script::tests::reap_children_targeted ... ok1612test discovery::probe::tests::testnet_port_probe_roundtrip ... ok1613test discovery::tests::testnet_first_publish_waits_for_dialable ... ok1614test portmap::igd::tests::http_roundtrip_bounded ... ok1615test discovery::tests::testnet_persist_roundtrip ... ok1616test discovery::tests::testnet_publish_resolve_roundtrip_secret ... ok1617test discovery::tests::testnet_publish_resolve_roundtrip_nosecret ... ok1618test discovery::tests::testnet_period_rollover_fallback ... ok1619test discovery::tests::testnet_dirty_preserved_while_publish_gated ... FAILED1620test discovery::tests::testnet_background_resolve_roundtrip ... ok16211622failures:16231624---- discovery::tests::testnet_dirty_preserved_while_publish_gated stdout ----16251626thread 'discovery::tests::testnet_dirty_preserved_while_publish_gated' (13521) panicked at crates/tincd/src/discovery/mod.rs:879:50:1627republish after gate opens1628note: run with `RUST_BACKTRACE=1` environment variable to display a backtrace162916301631failures:1632 discovery::tests::testnet_dirty_preserved_while_publish_gated16331634test result: FAILED. 665 passed; 1 failed; 0 ignored; 0 measured; 0 filtered out; finished in 10.05s16351636error: test failed, to rerun pass `-p tincd --lib`