this derivation will be built: /nix/store/pw6rn4k35p0kzv3ys572qr2f11szv3jg-tincd-test-0.1.0.drv error: build of '/nix/store/pw6rn4k35p0kzv3ys572qr2f11szv3jg-tincd-test-0.1.0.drv' on 'ssh-ng://customer@mac02' failed: Cannot build '/nix/store/pw6rn4k35p0kzv3ys572qr2f11szv3jg-tincd-test-0.1.0.drv'. Reason: builder failed with exit code 101. Output paths: /nix/store/hgrkkr1ym44zwba2blqz5g8a9gf2cic2-tincd-test-0.1.0 Last 25 log lines: > test portmap::igd::tests::http_roundtrip_bounded ... ok > test discovery::tests::testnet_period_rollover_fallback ... ok > test discovery::tests::testnet_background_resolve_roundtrip ... ok > > failures: > > ---- daemon::net::helpers::tests::is_udp_unreachable_errno_matches_routing_failures stdout ---- > > thread 'daemon::net::helpers::tests::is_udp_unreachable_errno_matches_routing_failures' (35561178) panicked at crates/tincd/src/daemon/net/helpers.rs:174:13: > errno 101 should be classified as udp-unreachable > note: run with `RUST_BACKTRACE=1` environment variable to display a backtrace > > ---- listen::tests::adopt_dual_stack_fd_yields_dual_stack_udp stdout ---- > > thread 'listen::tests::adopt_dual_stack_fd_yields_dual_stack_udp' (35561491) panicked at crates/tincd/src/listen/tests.rs:602:10: > v4 send through dual-stack UDP socket: Os { code: 22, kind: InvalidInput, message: "Invalid argument" } > > > failures: > daemon::net::helpers::tests::is_udp_unreachable_errno_matches_routing_failures > listen::tests::adopt_dual_stack_fd_yields_dual_stack_udp > > test result: FAILED. 655 passed; 2 failed; 0 ignored; 0 measured; 0 filtered out; finished in 9.98s > > error: test failed, to rerun pass `-p tincd --lib` For full logs, run: nix log /nix/store/pw6rn4k35p0kzv3ys572qr2f11szv3jg-tincd-test-0.1.0.drv error: Cannot build '/nix/store/pw6rn4k35p0kzv3ys572qr2f11szv3jg-tincd-test-0.1.0.drv'. Reason: builder failed with exit code 1. Output paths: /nix/store/hgrkkr1ym44zwba2blqz5g8a9gf2cic2-tincd-test-0.1.0