setup
checks.aarch64-darwin.pytest-impure
· build #31
· raw
1this derivation will be built:2 /nix/store/r54x6pap0yl243xizs7wi302imxkfi3g-pytest-impure.drv3error: Cannot build '/nix/store/rg47b86agkcaa9p8w0al1jqffqpb9wdv-pytest-impure.drv'.4 Reason: builder failed with exit code 1.5 Last 25 log lines:6 > ~~~~~~~~~~~~~~~~~~~~~~~~~~^^^^^^^^^^^^^^^^^^^^^^^^^^^^^^^^^^7 > File "/private/var/tb/8/scratch/b7a284bab7282824/build/src/src/update_flake_inputs/flake_service.py", line 235, in update_flake_input8 > raise FlakeServiceError(msg) from e9 > update_flake_inputs.exceptions.FlakeServiceError: Failed to update flake input flake-utils in flake.nix: Command '['nix', 'flake', 'update', '--flake', 'git+file:///private/var/tb/8/scratch/b7a284bab7282824/build/flake-update-oqtss5gw/update-flake-utils?shallow=1', 'flake-utils']' returned non-zero exit status 1.10 > Stderr: warning: unable to download 'https://api.github.com/repos/numtide/flake-utils/commits/HEAD': Could not resolve hostname (6) Could not resolve host: api.github.com; retrying in 265 ms (attempt 1/5)11 > warning: unable to download 'https://api.github.com/repos/numtide/flake-utils/commits/HEAD': Could not resolve hostname (6) Could not resolve host: api.github.com; retrying in 688 ms (attempt 2/5)12 > warning: unable to download 'https://api.github.com/repos/numtide/flake-utils/commits/HEAD': Could not resolve hostname (6) Could not resolve host: api.github.com; retrying in 1159 ms (attempt 3/5)13 > warning: unable to download 'https://api.github.com/repos/numtide/flake-utils/commits/HEAD': Could not resolve hostname (6) Could not resolve host: api.github.com; retrying in 2523 ms (attempt 4/5)14 > error:15 > … while updating the lock file of flake 'git+file:///private/var/tb/8/scratch/b7a284bab7282824/build/flake-update-oqtss5gw/update-flake-utils?ref=refs/heads/update-flake-utils&rev=d030a01624b911eab531c2a4dce089fbf5430da7&shallow=1'16 >17 > … while updating the flake input 'flake-utils'18 >19 > … while fetching the input 'github:numtide/flake-utils'20 >21 > error: unable to download 'https://api.github.com/repos/numtide/flake-utils/commits/HEAD': Could not resolve hostname (6) Could not resolve host: api.github.com22 > =========================== short test summary info ============================23 > FAILED tests/test_flake_service.py::TestFlakeService::test_update_flake_input24 > FAILED tests/test_flake_service.py::TestFlakeService::test_update_subflake_input25 > FAILED tests/test_process_flake_updates.py::TestProcessFlakeUpdates::test_with_updatable_flake_input26 > FAILED tests/test_process_flake_updates.py::TestProcessFlakeUpdates::test_worktree_based_on_base_branch_not_head27 > FAILED tests/test_process_flake_updates.py::TestProcessFlakeUpdates::test_custom_git_author_committer28 > FAILED tests/test_process_flake_updates.py::TestProcessFlakeUpdates::test_branch_suffix29 > FAILED tests/test_process_flake_updates.py::TestProcessFlakeUpdates::test_fails_at_end_when_individual_input_fails30 > 7 failed, 16 passed in 36.83s31 For full logs, run:32 nix log /nix/store/rg47b86agkcaa9p8w0al1jqffqpb9wdv-pytest-impure.drv33error: build of resolved derivation '/nix/store/rg47b86agkcaa9p8w0al1jqffqpb9wdv-pytest-impure.drv' failed