nixbot

builds

Mic92/update-flake-inputs-gitea build #32 failed

branch main · PR #150 · commit d398ed0015 · · took 3m 40s · eval 6s

eval warnings 1 kind · 4 occurrences
  • warn Nixpkgs 26.05 will be the last release to support x86_64-darwin; see https://nixos.org/… ×4

3 failed
failed attributes
status attribute duration
failed checks.aarch64-darwin.pytest-impure 3m 33s
pytest-impure: FAILED tests/test_flake_service.py::TestFlakeService::test_update_flake_input FAILED tests/test_flake_service.py::TestFlakeService::test_update_s …
pytest-impure:
FAILED tests/test_flake_service.py::TestFlakeService::test_update_flake_input
FAILED tests/test_flake_service.py::TestFlakeService::test_update_subflake_input
FAILED tests/test_process_flake_updates.py::TestProcessFlakeUpdates::test_with_updatable_flake_input
FAILED tests/test_process_flake_updates.py::TestProcessFlakeUpdates::test_worktree_based_on_base_branch_not_head
FAILED tests/test_process_flake_updates.py::TestProcessFlakeUpdates::test_custom_git_author_committer
FAILED tests/test_process_flake_updates.py::TestProcessFlakeUpdates::test_branch_suffix
FAILED tests/test_process_flake_updates.py::TestProcessFlakeUpdates::test_fails_at_end_when_individual_input_fails
7 failed, 16 passed in 104.64s (0:01:44)
failed checks.aarch64-linux.pytest-impure 2m 30s
pytest-impure: FAILED tests/test_flake_service.py::TestFlakeService::test_update_flake_input FAILED tests/test_flake_service.py::TestFlakeService::test_update_s …
pytest-impure:
FAILED tests/test_flake_service.py::TestFlakeService::test_update_flake_input
FAILED tests/test_flake_service.py::TestFlakeService::test_update_subflake_input
FAILED tests/test_process_flake_updates.py::TestProcessFlakeUpdates::test_with_updatable_flake_input
FAILED tests/test_process_flake_updates.py::TestProcessFlakeUpdates::test_worktree_based_on_base_branch_not_head
FAILED tests/test_process_flake_updates.py::TestProcessFlakeUpdates::test_custom_git_author_committer
FAILED tests/test_process_flake_updates.py::TestProcessFlakeUpdates::test_branch_suffix
FAILED tests/test_process_flake_updates.py::TestProcessFlakeUpdates::test_fails_at_end_when_individual_input_fails
7 failed, 16 passed in 73.76s (0:01:13)
failed checks.x86_64-linux.pytest-impure 2m 31s
pytest-impure: FAILED tests/test_flake_service.py::TestFlakeService::test_update_flake_input FAILED tests/test_flake_service.py::TestFlakeService::test_update_s …
pytest-impure:
FAILED tests/test_flake_service.py::TestFlakeService::test_update_flake_input
FAILED tests/test_flake_service.py::TestFlakeService::test_update_subflake_input
FAILED tests/test_process_flake_updates.py::TestProcessFlakeUpdates::test_with_updatable_flake_input
FAILED tests/test_process_flake_updates.py::TestProcessFlakeUpdates::test_worktree_based_on_base_branch_not_head
FAILED tests/test_process_flake_updates.py::TestProcessFlakeUpdates::test_custom_git_author_committer
FAILED tests/test_process_flake_updates.py::TestProcessFlakeUpdates::test_branch_suffix
FAILED tests/test_process_flake_updates.py::TestProcessFlakeUpdates::test_fails_at_end_when_individual_input_fails
7 failed, 16 passed in 73.90s (0:01:13)
9 succeeded
succeeded attributes
status attribute duration
loading…