php-filter-8.3.36
checks.aarch64-darwin.devShell-fastly-purge
· build #220
· raw
1tribuchet: building on mac02
unpackPhase
2unpacking source archive /nix/store/jjzjdicz0kshmnck5dk1gvf44sszbfdb-php-8.3.36.tar.bz23source root is php-8.3.364setting SOURCE_DATE_EPOCH to timestamp 1792418434 of file "php-8.3.36/win32/wsyslog.c"genfiles
5genfiles: bison version 3.8.2 (ok)6genfiles: re2c version 4.6 (ok)7genfiles: Generating Zend parser and lexer files8make: 'Zend/zend_language_parser.c' is up to date.9make: 'Zend/zend_language_scanner.c' is up to date.10make: 'Zend/zend_ini_parser.c' is up to date.11make: 'Zend/zend_ini_scanner.c' is up to date.12genfiles: Generating phpdbg parser and lexer files13make: 'sapi/phpdbg/phpdbg_parser.c' is up to date.14make: 'sapi/phpdbg/phpdbg_lexer.c' is up to date.15genfiles: Generating json extension parser and lexer files16make: 'ext/json/json_parser.tab.c' is up to date.17make: 'ext/json/json_scanner.c' is up to date.18genfiles: Generating PDO lexer file19make: 'ext/pdo/pdo_sql_parser.c' is up to date.20genfiles: Generating standard extension lexer files21make: 'ext/standard/var_unserializer.c' is up to date.22make: 'ext/standard/url_scanner_ex.c' is up to date.23genfiles: Generating phar extension lexer file24make: 'ext/phar/phar_path_check.c' is up to date.configurePhase
25Configuring for:26PHP Api Version: 2023083127Zend Module Api No: 2023083128Zend Extension Api No: 42023083129fixing libtool script ./build/ltmain.sh30patching script interpreter paths in ./configure31./configure: interpreter directive changed from "#! /bin/sh" to "/nix/store/i1pdjlwb27ki88zssg5q2h696v1r1m15-bash-5.3p20/bin/sh"32configure flags: --disable-static --prefix=/nix/store/pn4h7pg87g23kncj4sfq1v4hln0skzgi-php-filter-8.3.36 --bindir=/nix/store/pn4h7pg87g23kncj4sfq1v4hln0skzgi-php-filter-8.3.36/bin --sbindir=/nix/store/pn4h7pg87g23kncj4sfq1v4hln0skzgi-php-filter-8.3.36/sbin --includedir=/nix/store/qxx52idd5yk8bb47dzfhbr3jslgjhnyb-php-filter-8.3.36-dev/include --mandir=/nix/store/pn4h7pg87g23kncj4sfq1v4hln0skzgi-php-filter-8.3.36/share/man --infodir=/nix/store/pn4h7pg87g23kncj4sfq1v4hln0skzgi-php-filter-8.3.36/share/info --docdir=/nix/store/pn4h7pg87g23kncj4sfq1v4hln0skzgi-php-filter-8.3.36/share/doc/php-filter --libdir=/nix/store/pn4h7pg87g23kncj4sfq1v4hln0skzgi-php-filter-8.3.36/lib --libexecdir=/nix/store/pn4h7pg87g23kncj4sfq1v4hln0skzgi-php-filter-8.3.36/libexec --localedir=/nix/store/pn4h7pg87g23kncj4sfq1v4hln0skzgi-php-filter-8.3.36/share/locale --enable-filter33checking for grep that handles long lines and -e... /nix/store/7ihxb15yxm8345fdazx323iljjsi1i5i-gnugrep-3.12/bin/grep34checking for egrep... /nix/store/7ihxb15yxm8345fdazx323iljjsi1i5i-gnugrep-3.12/bin/grep -E35checking for a sed that does not truncate output... /nix/store/8fyr2rna4vqibkqsbzyfd4z6fna5c09p-gnused-4.10/bin/sed36checking pkg-config is at least version 0.9.0... yes37checking whether the C compiler works... yes38checking for C compiler default output file name... a.out39checking for suffix of executables... 40checking whether we are cross compiling... no41checking for suffix of object files... o42checking whether the compiler supports GNU C... yes43checking whether clang accepts -g... yes44checking for clang option to enable C23 features... -std=gnu2345checking how to run the C preprocessor... clang -std=gnu23 -E46checking for egrep -e... (cached) /nix/store/7ihxb15yxm8345fdazx323iljjsi1i5i-gnugrep-3.12/bin/grep -E47checking for icc... no48checking for suncc... no49checking for system library directory... lib50checking if compiler supports -Wl,-rpath,... yes51checking build system type... aarch64-apple-darwin25.6.052checking host system type... aarch64-apple-darwin25.6.053checking target system type... aarch64-apple-darwin25.6.054checking for PHP prefix... /nix/store/li9gjppwjacqg12qbyy7yz2gim73zpz9-php-8.3.3655checking for PHP includes... -I/nix/store/fjpgyh7g544988nsirkdlqnmwhl19wxx-php-8.3.36-dev/include/php -I/nix/store/fjpgyh7g544988nsirkdlqnmwhl19wxx-php-8.3.36-dev/include/php/main -I/nix/store/fjpgyh7g544988nsirkdlqnmwhl19wxx-php-8.3.36-dev/include/php/TSRM -I/nix/store/fjpgyh7g544988nsirkdlqnmwhl19wxx-php-8.3.36-dev/include/php/Zend -I/nix/store/fjpgyh7g544988nsirkdlqnmwhl19wxx-php-8.3.36-dev/include/php/ext -I/nix/store/fjpgyh7g544988nsirkdlqnmwhl19wxx-php-8.3.36-dev/include/php/ext/date/lib56checking for PHP extension directory... /nix/store/li9gjppwjacqg12qbyy7yz2gim73zpz9-php-8.3.36/lib/php/extensions57checking for PHP installed headers prefix... /nix/store/fjpgyh7g544988nsirkdlqnmwhl19wxx-php-8.3.36-dev/include/php58checking if debug is enabled... no59checking if zts is enabled... no60checking for gawk... gawk61checking whether to enable input filter support... yes, shared62checking for a sed that does not truncate output... /nix/store/8fyr2rna4vqibkqsbzyfd4z6fna5c09p-gnused-4.10/bin/sed63checking for ld used by clang -std=gnu23... ld64checking if the linker (ld) is GNU ld... no65checking for ld option to reload object files... -r66checking for BSD-compatible nm... nm67checking whether ln -s works... yes68checking how to recognize dependent libraries... (cached) pass_all69checking for stdio.h... yes70checking for stdlib.h... yes71checking for string.h... yes72checking for inttypes.h... yes73checking for stdint.h... yes74checking for strings.h... yes75checking for sys/stat.h... yes76checking for sys/types.h... yes77checking for unistd.h... yes78checking for dlfcn.h... yes79checking the maximum length of command line arguments... 78643280checking command to parse nm output from clang -std=gnu23 object... ok81checking for objdir... .libs82checking for ar... ar83checking for ranlib... ranlib84checking for strip... strip85checking for dsymutil... dsymutil86checking for nmedit... no87checking for -single_module linker flag... yes88checking for -exported_symbols_list linker flag... yes89checking if clang -std=gnu23 supports -fno-rtti -fno-exceptions... yes90checking for clang -std=gnu23 option to produce PIC... -fno-common91checking if clang -std=gnu23 PIC flag -fno-common works... yes92checking if clang -std=gnu23 static flag -static works... no93checking if clang -std=gnu23 supports -c -o file.o... yes94checking whether the clang -std=gnu23 linker (ld) supports shared libraries... yes95checking dynamic linker characteristics... darwin25.6.0 dyld96checking how to hardcode library paths into programs... immediate97checking whether stripping libraries is possible... yes98checking if libtool supports shared libraries... yes99checking whether to build shared libraries... yes100checking whether to build static libraries... no101102creating libtool103appending configuration tag "CXX" to libtool104checking whether the clang++ linker (ld) supports shared libraries... no105checking for clang++ option to produce PIC... 106checking if clang++ static flag works... yes107checking if clang++ supports -c -o file.o... yes108checking whether the clang++ linker (ld) supports shared libraries... no109checking dynamic linker characteristics... darwin25.6.0 dyld110(cached) (cached) checking how to hardcode library paths into programs... immediate111configure: patching config.h.in112configure: creating ./config.status113config.status: creating config.hbuildPhase
114build flags: -j24 SHELL=/nix/store/i1pdjlwb27ki88zssg5q2h696v1r1m15-bash-5.3p20/bin/bash115/nix/store/i1pdjlwb27ki88zssg5q2h696v1r1m15-bash-5.3p20/bin/bash /private/var/tb/7/scratch/25e243765893c731/build/php-8.3.36/ext/filter/libtool --tag=CC --mode=compile clang -std=gnu23 -I. -I/private/var/tb/7/scratch/25e243765893c731/build/php-8.3.36/ext/filter -I/private/var/tb/7/scratch/25e243765893c731/build/php-8.3.36/ext/filter/include -I/private/var/tb/7/scratch/25e243765893c731/build/php-8.3.36/ext/filter/main -I/private/var/tb/7/scratch/25e243765893c731/build/php-8.3.36/ext/filter -I/nix/store/fjpgyh7g544988nsirkdlqnmwhl19wxx-php-8.3.36-dev/include/php -I/nix/store/fjpgyh7g544988nsirkdlqnmwhl19wxx-php-8.3.36-dev/include/php/main -I/nix/store/fjpgyh7g544988nsirkdlqnmwhl19wxx-php-8.3.36-dev/include/php/TSRM -I/nix/store/fjpgyh7g544988nsirkdlqnmwhl19wxx-php-8.3.36-dev/include/php/Zend -I/nix/store/fjpgyh7g544988nsirkdlqnmwhl19wxx-php-8.3.36-dev/include/php/ext -I/nix/store/fjpgyh7g544988nsirkdlqnmwhl19wxx-php-8.3.36-dev/include/php/ext/date/lib -DHAVE_CONFIG_H -g -O2 -D_GNU_SOURCE -DZEND_ENABLE_STATIC_TSRMLS_CACHE=1 -DZEND_COMPILE_DL_EXT=1 -c /private/var/tb/7/scratch/25e243765893c731/build/php-8.3.36/ext/filter/filter.c -o filter.lo -MMD -MF filter.dep -MT filter.lo116/nix/store/i1pdjlwb27ki88zssg5q2h696v1r1m15-bash-5.3p20/bin/bash /private/var/tb/7/scratch/25e243765893c731/build/php-8.3.36/ext/filter/libtool --tag=CC --mode=compile clang -std=gnu23 -I. -I/private/var/tb/7/scratch/25e243765893c731/build/php-8.3.36/ext/filter -I/private/var/tb/7/scratch/25e243765893c731/build/php-8.3.36/ext/filter/include -I/private/var/tb/7/scratch/25e243765893c731/build/php-8.3.36/ext/filter/main -I/private/var/tb/7/scratch/25e243765893c731/build/php-8.3.36/ext/filter -I/nix/store/fjpgyh7g544988nsirkdlqnmwhl19wxx-php-8.3.36-dev/include/php -I/nix/store/fjpgyh7g544988nsirkdlqnmwhl19wxx-php-8.3.36-dev/include/php/main -I/nix/store/fjpgyh7g544988nsirkdlqnmwhl19wxx-php-8.3.36-dev/include/php/TSRM -I/nix/store/fjpgyh7g544988nsirkdlqnmwhl19wxx-php-8.3.36-dev/include/php/Zend -I/nix/store/fjpgyh7g544988nsirkdlqnmwhl19wxx-php-8.3.36-dev/include/php/ext -I/nix/store/fjpgyh7g544988nsirkdlqnmwhl19wxx-php-8.3.36-dev/include/php/ext/date/lib -DHAVE_CONFIG_H -g -O2 -D_GNU_SOURCE -DZEND_ENABLE_STATIC_TSRMLS_CACHE=1 -DZEND_COMPILE_DL_EXT=1 -c /private/var/tb/7/scratch/25e243765893c731/build/php-8.3.36/ext/filter/sanitizing_filters.c -o sanitizing_filters.lo -MMD -MF sanitizing_filters.dep -MT sanitizing_filters.lo117/nix/store/i1pdjlwb27ki88zssg5q2h696v1r1m15-bash-5.3p20/bin/bash /private/var/tb/7/scratch/25e243765893c731/build/php-8.3.36/ext/filter/libtool --tag=CC --mode=compile clang -std=gnu23 -I. -I/private/var/tb/7/scratch/25e243765893c731/build/php-8.3.36/ext/filter -I/private/var/tb/7/scratch/25e243765893c731/build/php-8.3.36/ext/filter/include -I/private/var/tb/7/scratch/25e243765893c731/build/php-8.3.36/ext/filter/main -I/private/var/tb/7/scratch/25e243765893c731/build/php-8.3.36/ext/filter -I/nix/store/fjpgyh7g544988nsirkdlqnmwhl19wxx-php-8.3.36-dev/include/php -I/nix/store/fjpgyh7g544988nsirkdlqnmwhl19wxx-php-8.3.36-dev/include/php/main -I/nix/store/fjpgyh7g544988nsirkdlqnmwhl19wxx-php-8.3.36-dev/include/php/TSRM -I/nix/store/fjpgyh7g544988nsirkdlqnmwhl19wxx-php-8.3.36-dev/include/php/Zend -I/nix/store/fjpgyh7g544988nsirkdlqnmwhl19wxx-php-8.3.36-dev/include/php/ext -I/nix/store/fjpgyh7g544988nsirkdlqnmwhl19wxx-php-8.3.36-dev/include/php/ext/date/lib -DHAVE_CONFIG_H -g -O2 -D_GNU_SOURCE -DZEND_ENABLE_STATIC_TSRMLS_CACHE=1 -DZEND_COMPILE_DL_EXT=1 -c /private/var/tb/7/scratch/25e243765893c731/build/php-8.3.36/ext/filter/logical_filters.c -o logical_filters.lo -MMD -MF logical_filters.dep -MT logical_filters.lo118/nix/store/i1pdjlwb27ki88zssg5q2h696v1r1m15-bash-5.3p20/bin/bash /private/var/tb/7/scratch/25e243765893c731/build/php-8.3.36/ext/filter/libtool --tag=CC --mode=compile clang -std=gnu23 -I. -I/private/var/tb/7/scratch/25e243765893c731/build/php-8.3.36/ext/filter -I/private/var/tb/7/scratch/25e243765893c731/build/php-8.3.36/ext/filter/include -I/private/var/tb/7/scratch/25e243765893c731/build/php-8.3.36/ext/filter/main -I/private/var/tb/7/scratch/25e243765893c731/build/php-8.3.36/ext/filter -I/nix/store/fjpgyh7g544988nsirkdlqnmwhl19wxx-php-8.3.36-dev/include/php -I/nix/store/fjpgyh7g544988nsirkdlqnmwhl19wxx-php-8.3.36-dev/include/php/main -I/nix/store/fjpgyh7g544988nsirkdlqnmwhl19wxx-php-8.3.36-dev/include/php/TSRM -I/nix/store/fjpgyh7g544988nsirkdlqnmwhl19wxx-php-8.3.36-dev/include/php/Zend -I/nix/store/fjpgyh7g544988nsirkdlqnmwhl19wxx-php-8.3.36-dev/include/php/ext -I/nix/store/fjpgyh7g544988nsirkdlqnmwhl19wxx-php-8.3.36-dev/include/php/ext/date/lib -DHAVE_CONFIG_H -g -O2 -D_GNU_SOURCE -DZEND_ENABLE_STATIC_TSRMLS_CACHE=1 -DZEND_COMPILE_DL_EXT=1 -c /private/var/tb/7/scratch/25e243765893c731/build/php-8.3.36/ext/filter/callback_filter.c -o callback_filter.lo -MMD -MF callback_filter.dep -MT callback_filter.lo119mkdir .libs120mkdir .libs121mkdir .libs122mkdir: cannot create directory '.libs': File exists123mkdir: cannot create directory '.libs': File exists124 clang -std=gnu23 -I. -I/private/var/tb/7/scratch/25e243765893c731/build/php-8.3.36/ext/filter -I/private/var/tb/7/scratch/25e243765893c731/build/php-8.3.36/ext/filter/include -I/private/var/tb/7/scratch/25e243765893c731/build/php-8.3.36/ext/filter/main -I/private/var/tb/7/scratch/25e243765893c731/build/php-8.3.36/ext/filter -I/nix/store/fjpgyh7g544988nsirkdlqnmwhl19wxx-php-8.3.36-dev/include/php -I/nix/store/fjpgyh7g544988nsirkdlqnmwhl19wxx-php-8.3.36-dev/include/php/main -I/nix/store/fjpgyh7g544988nsirkdlqnmwhl19wxx-php-8.3.36-dev/include/php/TSRM -I/nix/store/fjpgyh7g544988nsirkdlqnmwhl19wxx-php-8.3.36-dev/include/php/Zend -I/nix/store/fjpgyh7g544988nsirkdlqnmwhl19wxx-php-8.3.36-dev/include/php/ext -I/nix/store/fjpgyh7g544988nsirkdlqnmwhl19wxx-php-8.3.36-dev/include/php/ext/date/lib -DHAVE_CONFIG_H -g -O2 -D_GNU_SOURCE -DZEND_ENABLE_STATIC_TSRMLS_CACHE=1 -DZEND_COMPILE_DL_EXT=1 -c /private/var/tb/7/scratch/25e243765893c731/build/php-8.3.36/ext/filter/sanitizing_filters.c -MMD -MF sanitizing_filters.dep -MT sanitizing_filters.lo -fno-common -DPIC -o .libs/sanitizing_filters.o125 clang -std=gnu23 -I. -I/private/var/tb/7/scratch/25e243765893c731/build/php-8.3.36/ext/filter -I/private/var/tb/7/scratch/25e243765893c731/build/php-8.3.36/ext/filter/include -I/private/var/tb/7/scratch/25e243765893c731/build/php-8.3.36/ext/filter/main -I/private/var/tb/7/scratch/25e243765893c731/build/php-8.3.36/ext/filter -I/nix/store/fjpgyh7g544988nsirkdlqnmwhl19wxx-php-8.3.36-dev/include/php -I/nix/store/fjpgyh7g544988nsirkdlqnmwhl19wxx-php-8.3.36-dev/include/php/main -I/nix/store/fjpgyh7g544988nsirkdlqnmwhl19wxx-php-8.3.36-dev/include/php/TSRM -I/nix/store/fjpgyh7g544988nsirkdlqnmwhl19wxx-php-8.3.36-dev/include/php/Zend -I/nix/store/fjpgyh7g544988nsirkdlqnmwhl19wxx-php-8.3.36-dev/include/php/ext -I/nix/store/fjpgyh7g544988nsirkdlqnmwhl19wxx-php-8.3.36-dev/include/php/ext/date/lib -DHAVE_CONFIG_H -g -O2 -D_GNU_SOURCE -DZEND_ENABLE_STATIC_TSRMLS_CACHE=1 -DZEND_COMPILE_DL_EXT=1 -c /private/var/tb/7/scratch/25e243765893c731/build/php-8.3.36/ext/filter/logical_filters.c -MMD -MF logical_filters.dep -MT logical_filters.lo -fno-common -DPIC -o .libs/logical_filters.o126 clang -std=gnu23 -I. -I/private/var/tb/7/scratch/25e243765893c731/build/php-8.3.36/ext/filter -I/private/var/tb/7/scratch/25e243765893c731/build/php-8.3.36/ext/filter/include -I/private/var/tb/7/scratch/25e243765893c731/build/php-8.3.36/ext/filter/main -I/private/var/tb/7/scratch/25e243765893c731/build/php-8.3.36/ext/filter -I/nix/store/fjpgyh7g544988nsirkdlqnmwhl19wxx-php-8.3.36-dev/include/php -I/nix/store/fjpgyh7g544988nsirkdlqnmwhl19wxx-php-8.3.36-dev/include/php/main -I/nix/store/fjpgyh7g544988nsirkdlqnmwhl19wxx-php-8.3.36-dev/include/php/TSRM -I/nix/store/fjpgyh7g544988nsirkdlqnmwhl19wxx-php-8.3.36-dev/include/php/Zend -I/nix/store/fjpgyh7g544988nsirkdlqnmwhl19wxx-php-8.3.36-dev/include/php/ext -I/nix/store/fjpgyh7g544988nsirkdlqnmwhl19wxx-php-8.3.36-dev/include/php/ext/date/lib -DHAVE_CONFIG_H -g -O2 -D_GNU_SOURCE -DZEND_ENABLE_STATIC_TSRMLS_CACHE=1 -DZEND_COMPILE_DL_EXT=1 -c /private/var/tb/7/scratch/25e243765893c731/build/php-8.3.36/ext/filter/filter.c -MMD -MF filter.dep -MT filter.lo -fno-common -DPIC -o .libs/filter.o127 clang -std=gnu23 -I. -I/private/var/tb/7/scratch/25e243765893c731/build/php-8.3.36/ext/filter -I/private/var/tb/7/scratch/25e243765893c731/build/php-8.3.36/ext/filter/include -I/private/var/tb/7/scratch/25e243765893c731/build/php-8.3.36/ext/filter/main -I/private/var/tb/7/scratch/25e243765893c731/build/php-8.3.36/ext/filter -I/nix/store/fjpgyh7g544988nsirkdlqnmwhl19wxx-php-8.3.36-dev/include/php -I/nix/store/fjpgyh7g544988nsirkdlqnmwhl19wxx-php-8.3.36-dev/include/php/main -I/nix/store/fjpgyh7g544988nsirkdlqnmwhl19wxx-php-8.3.36-dev/include/php/TSRM -I/nix/store/fjpgyh7g544988nsirkdlqnmwhl19wxx-php-8.3.36-dev/include/php/Zend -I/nix/store/fjpgyh7g544988nsirkdlqnmwhl19wxx-php-8.3.36-dev/include/php/ext -I/nix/store/fjpgyh7g544988nsirkdlqnmwhl19wxx-php-8.3.36-dev/include/php/ext/date/lib -DHAVE_CONFIG_H -g -O2 -D_GNU_SOURCE -DZEND_ENABLE_STATIC_TSRMLS_CACHE=1 -DZEND_COMPILE_DL_EXT=1 -c /private/var/tb/7/scratch/25e243765893c731/build/php-8.3.36/ext/filter/callback_filter.c -MMD -MF callback_filter.dep -MT callback_filter.lo -fno-common -DPIC -o .libs/callback_filter.o128/nix/store/i1pdjlwb27ki88zssg5q2h696v1r1m15-bash-5.3p20/bin/bash /private/var/tb/7/scratch/25e243765893c731/build/php-8.3.36/ext/filter/libtool --tag=CC --mode=link clang -std=gnu23 -shared -I/private/var/tb/7/scratch/25e243765893c731/build/php-8.3.36/ext/filter/include -I/private/var/tb/7/scratch/25e243765893c731/build/php-8.3.36/ext/filter/main -I/private/var/tb/7/scratch/25e243765893c731/build/php-8.3.36/ext/filter -I/nix/store/fjpgyh7g544988nsirkdlqnmwhl19wxx-php-8.3.36-dev/include/php -I/nix/store/fjpgyh7g544988nsirkdlqnmwhl19wxx-php-8.3.36-dev/include/php/main -I/nix/store/fjpgyh7g544988nsirkdlqnmwhl19wxx-php-8.3.36-dev/include/php/TSRM -I/nix/store/fjpgyh7g544988nsirkdlqnmwhl19wxx-php-8.3.36-dev/include/php/Zend -I/nix/store/fjpgyh7g544988nsirkdlqnmwhl19wxx-php-8.3.36-dev/include/php/ext -I/nix/store/fjpgyh7g544988nsirkdlqnmwhl19wxx-php-8.3.36-dev/include/php/ext/date/lib -DHAVE_CONFIG_H -g -O2 -D_GNU_SOURCE -o filter.la -export-dynamic -avoid-version -prefer-pic -module -rpath /private/var/tb/7/scratch/25e243765893c731/build/php-8.3.36/ext/filter/modules filter.lo sanitizing_filters.lo logical_filters.lo callback_filter.lo 129clang -std=gnu23 ${wl}-undefined ${wl}dynamic_lookup -o .libs/filter.so -bundle .libs/filter.o .libs/sanitizing_filters.o .libs/logical_filters.o .libs/callback_filter.o 130dsymutil .libs/filter.so || :131creating filter.la132(cd .libs && rm -f filter.la && ln -s ../filter.la filter.la)133/nix/store/i1pdjlwb27ki88zssg5q2h696v1r1m15-bash-5.3p20/bin/bash /private/var/tb/7/scratch/25e243765893c731/build/php-8.3.36/ext/filter/libtool --tag=CC --mode=install cp ./filter.la /private/var/tb/7/scratch/25e243765893c731/build/php-8.3.36/ext/filter/modules134cp ./.libs/filter.so /private/var/tb/7/scratch/25e243765893c731/build/php-8.3.36/ext/filter/modules/filter.so135cp ./.libs/filter.lai /private/var/tb/7/scratch/25e243765893c731/build/php-8.3.36/ext/filter/modules/filter.la136----------------------------------------------------------------------137Libraries have been installed in:138 /private/var/tb/7/scratch/25e243765893c731/build/php-8.3.36/ext/filter/modules139140If you ever happen to want to link against installed libraries141in a given directory, LIBDIR, you must either use libtool, and142specify the full pathname of the library, or use the `-LLIBDIR'143flag during linking and do at least one of the following:144 - add LIBDIR to the `DYLD_LIBRARY_PATH' environment variable145 during execution146147See any operating system documentation about shared libraries for148more information, such as the ld(1) and ld.so(8) manual pages.149----------------------------------------------------------------------150151Build complete.152Don't forget to run 'make test'.153checkPhase
154155Build complete.156Don't forget to run 'make test'.157158159=====================================================================160PHP : /nix/store/li9gjppwjacqg12qbyy7yz2gim73zpz9-php-8.3.36/bin/php 161PHP_SAPI : cli162PHP_VERSION : 8.3.36163ZEND_VERSION: 4.3.36164PHP_OS : Darwin - Darwin mac02 25.6.0 Darwin Kernel Version 25.6.0: Tue Aug 18 17:51:33 PDT 2026; root:xnu-12377.161.15.700.19~2/RELEASE_ARM64_T8132 arm64165INI actual : /private/var/tb/7/scratch/25e243765893c731/build/php-8.3.36/ext/filter/tmp-php.ini166More .INIs : 167---------------------------------------------------------------------168PHP : /nix/store/li9gjppwjacqg12qbyy7yz2gim73zpz9-php-8.3.36/bin/php-cgi 169PHP_SAPI : cgi-fcgi170PHP_VERSION : 8.3.36171ZEND_VERSION: 4.3.36172PHP_OS : Darwin - Darwin mac02 25.6.0 Darwin Kernel Version 25.6.0: Tue Aug 18 17:51:33 PDT 2026; root:xnu-12377.161.15.700.19~2/RELEASE_ARM64_T8132 arm64173INI actual : /private/var/tb/7/scratch/25e243765893c731/build/php-8.3.36/ext/filter/tmp-php.ini174More .INIs : 175--------------------------------------------------------------------- 176---------------------------------------------------------------------177PHP : /nix/store/li9gjppwjacqg12qbyy7yz2gim73zpz9-php-8.3.36/bin/phpdbg 178PHP_SAPI : phpdbg179PHP_VERSION : 8.3.36180ZEND_VERSION: 4.3.36181PHP_OS : Darwin - Darwin mac02 25.6.0 Darwin Kernel Version 25.6.0: Tue Aug 18 17:51:33 PDT 2026; root:xnu-12377.161.15.700.19~2/RELEASE_ARM64_T8132 arm64182INI actual : /private/var/tb/7/scratch/25e243765893c731/build/php-8.3.36/ext/filter/tmp-php.ini183More .INIs : 184---------------------------------------------------------------------185CWD : /private/var/tb/7/scratch/25e243765893c731/build/php-8.3.36/ext/filter186Extra dirs : 187VALGRIND : Not used188=====================================================================189TIME START 2026-10-21 20:00:09190=====================================================================191PASS Simple GET test [tests/001.phpt] 192PASS GET test with 2 values and an empty one [tests/002.phpt] 193PASS GET/POST/REQUEST Test [tests/003.phpt] 194PASS GET/POST/REQUEST Test with filtered data [tests/004.phpt] 195PASS GET/REQUEST Test with fifa example data [tests/005.phpt] 196PASS filter_input() test [tests/006.phpt] 197PASS filter_has_var() [tests/007.phpt] 198PASS filter_list() [tests/008.phpt] 199PASS filter_id() [tests/009.phpt] 200PASS filter_var() [tests/010.phpt] 201PASS filter_input() [tests/011.phpt] 202PASS filter_input() [tests/012.phpt] 203PASS filter_var() and flags [tests/013.phpt] 204PASS filter_var() and FILTER_VALIDATE_BOOLEAN [tests/014.phpt] 205PASS filter_var() and FILTER_VALIDATE_URL [tests/015.phpt] 206PASS filter_var() and FILTER_VALIDATE_EMAIL [tests/016.phpt] 207PASS filter_var() and FILTER_VALIDATE_REGEXP [tests/017.phpt] 208PASS filter_var() and FILTER_VALIDATE_IP [tests/018.phpt] 209PASS filter_var() & FILTER_VALIDATE_IP and weird data [tests/019.phpt] 210PASS filter_var() and FILTER_SANITIZE_NUMBER_* [tests/021.phpt] 211PASS filter_var() and FILTER_SANITIZE_EMAIL [tests/022.phpt] 212PASS filter_var() and FILTER_UNSAFE_RAW [tests/023.phpt] 213PASS filter_var() and FILTER_SANITIZE_ENCODED [tests/024.phpt] 214PASS filter_var() and FILTER_SANITIZE_STRING [tests/025.phpt] 215PASS filter_var() and FILTER_SANITIZE_STRIPPED [tests/026.phpt] 216PASS filter_var() and FILTER_SANITIZE_ENCODED [tests/027.phpt] 217PASS filter_var() and FILTER_SANITIZE_SPECIAL_CHARS [tests/028.phpt] 218PASS filter_var() and FILTER_CALLBACK [tests/029.phpt] 219PASS filter_var() and IPv6 [tests/030.phpt] 220PASS filter_var() and FLOAT [tests/031.phpt] 221PASS filter_var_array() [tests/032.phpt] 222PASS Test all filters returned by filter_list() [tests/033.phpt] 223PASS Logical filter: boolean [tests/034.phpt] 224PASS GET/POST/REQUEST Test with input_filter [tests/035.phpt] 225PASS filter_var_array() and references [tests/036.phpt] 226PASS GET and data callback tests [tests/037.phpt] 227PASS Test scalar, array [tests/038.phpt] 228PASS filter_var_array() and different arguments [tests/039.phpt] 229PASS filter_has_var() tests [tests/040.phpt] 230PASS COOKIE multiple cookie test [tests/041.phpt] 231PASS Combination of strip & sanitize filters [tests/042.phpt] 232PASS Character encoding test [tests/043.phpt] 233PASS Integer validation with spaces [tests/044.phpt] 234PASS Options must not be changed by filter_var() [tests/045.phpt] 235PASS Integer overflow [tests/046.phpt] 236PASS Octal integer overflow [tests/047.phpt] 237PASS Hex integer overflow [tests/048.phpt] 238PASS filter_var() and doubles with thousend separators [tests/049.phpt] 239PASS filter_var() and double overflow/underflow [tests/050.phpt] 240PASS filter_var() and default values [tests/051.phpt] 241PASS filter_var() / filter_var_array() and passed data integrity [tests/052.phpt] 242PASS filter_var() - using callback [tests/053.phpt] 243PASS filter_var_array() - using the add_empty option [tests/054.phpt] 244PASS filter_var() and FILTER_VALIDATE_MAC [tests/055.phpt] 245PASS filter_var() and FILTER_VALIDATE_DOMAIN [tests/056.phpt] 246PASS filter_input_array() and filter_var_array() with invalid $definition arguments [tests/057.phpt] 247PASS FILTER_VALIDATE_EMAIL unicode support (https://tools.ietf.org/html/rfc6531) [tests/058.phpt] 248PASS filter_var() and FILTER_SANITIZE_ADD_SLASHES [tests/059.phpt] 249PASS filter_var() - tests for the range options of filter FILTER_VALIDATE_FLOAT [tests/060.phpt] 250PASS filter_var() and FILTER_VALIDATE_BOOL [tests/061.phpt] 251PASS CVE-2007-1900: PHP ext/filter Email Validation Vulnerability [tests/CVE-2007-1900.phpt] 252PASS Bug #39846 (ipv4 trailing data validation) [tests/bug39846.phpt] 253PASS Bug #42718 (unsafe_raw filter not applied when configured as default filter) [tests/bug42718-2.phpt] 254XFAIL Bug #42718 (unsafe_raw filter not applied when configured as default filter) [tests/bug42718.phpt] XFAIL REASON: FILTER_UNSAFE_RAW not applied when configured as default filter, even with flags255PASS Bug #44445 (email validator does not handle domains starting/ending with a -) [tests/bug44445.phpt] 256PASS Bug #44779 (filter returns NULL in CLI when it shouldn't) [tests/bug44779.phpt] 257PASS Bug #46973 (IPv6 address filter rejects valid address) [tests/bug46973.phpt] 258PASS Bug #47435 (FILTER_FLAG_NO_PRIV_RANGE and FILTER_FLAG_NO_RES_RANGE don't work with ipv6) [tests/bug47435.phpt] 259PASS Bug #47745 (FILTER_VALIDATE_INT doesn't allow minimum integer) [tests/bug47745.phpt] 260PASS Bug #48762 (IPv6 address filter still rejects valid address) [tests/bug48762.phpt] 261XFAIL Bug #67296 (filter_input doesn't validate variables) [tests/bug49184.phpt] XFAIL REASON: See Bug #49184262PASS Bug #49274 (fatal error when an object does not implement toString) [tests/bug49274.phpt] 263PASS Bug #49510 (boolean validation fails with FILTER_NULL_ON_FAILURE) [tests/bug49510.phpt] 264PASS Bug #50158 (FILTER_VALIDATE_EMAIL fails with valid addresses containing = or ?) [tests/bug50158.phpt] 265PASS Bug #50632 (filter_input() does not return default value if the variable does not exist) [tests/bug50632.phpt] 266PASS Bug #51192 (FILTER_VALIDATE_URL will invalidate a hostname that includes '-') [tests/bug51192.phpt] 267PASS Bug #51368 (php_filter_float does not allow custom thousand separators) [tests/bug51368.phpt] 268PASS Bug #52209 (INPUT_ENV returns NULL for set variables (CLI)) [tests/bug52209.phpt] 269PASS Bug #52929 (Segfault in filter_var with FILTER_VALIDATE_EMAIL with large amount of data) [tests/bug52929.phpt] 270PASS Bug #53037 (FILTER_FLAG_EMPTY_STRING_NULL is not implemented) [tests/bug53037.phpt] 271PASS Bug #53150 (FILTER_FLAG_NO_RES_RANGE is missing some IP ranges) [tests/bug53150.phpt] 272PASS Bug #55478 (FILTER_VALIDATE_EMAIL fails with internationalized domain name addresses containing >1 -) [tests/bug55478.phpt] 273PASS Bug #61700 (FILTER_FLAG_IPV6/FILTER_FLAG_NO_PRIV|RES_RANGE failing) [tests/bug61700.phpt] 274PASS Bug #64441 (FILTER_VALIDATE_URL will invalidate a hostname that ended by dot) [tests/bug64441.phpt] 275PASS Bug #67167 (object with VALIDATE_BOOLEAN and NULL_ON_FAILURE) [tests/bug67167.01.phpt] 276XFAIL Bug #67167 (filter_var(null,FILTER_VALIDATE_BOOLEAN,FILTER_NULL_ON_FAILURE) returns null) [tests/bug67167.02.phpt] XFAIL REASON: Requires php_zval_filter to not use convert_to_string for all filters.277PASS Bug #69202 (FILTER_FLAG_STRIP_BACKTICK ignored unless other flags are used) [tests/bug69202.phpt] 278PASS Bug #69203 (FILTER_FLAG_STRIP_HIGH doesn't strip ASCII 127) [tests/bug69203.phpt] 279PASS Bug #71063 (filter_input(INPUT_ENV, ..) does not work) [tests/bug71063.phpt] 280PASS Bug #73054 (default option ignored when object passed to int filter) [tests/bug73054.phpt] 281PASS Bug #76366 (references in sub-array for filtering breaks the filter) [tests/bug76366.phpt] 282PASS Bug #7715 (floats value with integer or incomplete input) [tests/bug7715.phpt] 283PASS Bug #77221 (Request IP address filter flag to exclude non-global IP addresses) [tests/bug77221.phpt] 284PASS Bug #7733 (filter_var() Float exponential weird result) [tests/bug7733.phpt] 285PASS Bug #77423 (parse_url() will deliver a wrong host to user) [tests/bug77423.phpt] 286PASS Bug #80584 ("0x" and "0X" are considered valid hex numbers by filter_var()) [tests/bug80584.phpt] 287PASS Bug #81122 (SSRF bypass in FILTER_VALIDATE_URL) [tests/bug81122.phpt] 288PASS Bug #81708 (UAF due to php_filter_float() failing for ints) [tests/bug81708.phpt] 289PASS Bug #8315 (NULL values halt the validation) [tests/bug8315.phpt] 290PASS callback function is a closure [tests/callback_closure.phpt] 291PASS callback function returns non modified value [tests/callback_non_modified_var.phpt] 292PASS FILTER_CALLBACK with explicit FILTER_REQUIRE_SCALAR [tests/filter_callback_require_scalar.phpt] 293PASS Simple filter_var() tests [tests/filter_data.phpt] 294PASS filter.default is deprecated [tests/filter_default_deprecation.phpt] 295PASS Bug #71745 FILTER_FLAG_NO_RES_RANGE does not cover whole 127.0.0.0/8 range [tests/filter_ipv4_rfc6890.phpt] 296PASS FILTER_NULL_ON_FAILURE will give NULL on filters [tests/filter_null_on_failure.phpt] 297PASS FILTER_SANITIZE_ENCODED percent-encodes 0xFF [tests/filter_sanitize_encoded_0xff.phpt] 298PASS filter_var_array() on array with reference [tests/filter_var_array_with_ref.phpt] 299PASS GH-16523 (FILTER_FLAG_HOSTNAME accepts ending hyphen) [tests/gh16523.phpt] 300PASS Bug GH-16944 (Invalid filtering of IPv6 with FILTER_FLAG_NO_RES_RANGE) [tests/gh16944.phpt] 301PASS GH-18309 (ipv6 filter integer overflow) [tests/gh18309.phpt] 302PASS GHSA-w8qr-v226-r27w [tests/ghsa-w8qr-v226-r27w.phpt] 303PASS filter.default=encoded doesn't reach hard limit while parsing POST data [tests/oom_filter_default_encoded.phpt] 304PASS filter_input() doesn't reach hard limit [tests/oom_filter_input.phpt] 305PASS filter_input_array() doesn't reach hard limit [tests/oom_filter_input_array.phpt] 306PASS filter_var(filter: FILTER_SANITIZE_SPECIAL_CHARS) doesn't reach hard limit [tests/oom_filter_var.phpt] 307PASS filter_var_array() doesn't reach hard limit [tests/oom_filter_var_array.phpt] 308PASS filter_var(filter: FILTER_SANITIZE_FULL_SPECIAL_CHARS) doesn't reach hard limit [tests/oom_filter_var_full_special_chars.phpt] 309PASS Surprising result with integer literals (hex/octal) [tests/surprising_integer_literals.phpt] 310=====================================================================311TIME END 2026-10-21 20:00:13312313=====================================================================314TEST RESULT SUMMARY315---------------------------------------------------------------------316Exts skipped : 0317Exts tested : 12318---------------------------------------------------------------------319320Number of tests : 119 119321Tests skipped : 0 ( 0.0%) --------322Tests warned : 0 ( 0.0%) ( 0.0%)323Tests failed : 0 ( 0.0%) ( 0.0%)324Expected fail : 3 ( 2.5%) ( 2.5%)325Tests passed : 116 ( 97.5%) ( 97.5%)326---------------------------------------------------------------------327Time taken : 4 seconds328=====================================================================fixupPhase
329checking for references to /private/var/tb/7/scratch/25e243765893c731/build/ in /nix/store/pn4h7pg87g23kncj4sfq1v4hln0skzgi-php-filter-8.3.36...330/nix/store/cv1d7p48379km6a85h4zp6kr86brh32q-audit-tmpdir.sh: line 39: 56923 Done find "$dir" -type f -not -path '*/.build-id/*' -print0331 56924 Segmentation fault: 11 | while IFS= read -r -d '' file; do332 if isELF "$file"; then333 printf '%s\0' "$file" 1>&3;334 else335 if isScript "$file"; then336 filename=${file##*/}; dir=${file%/*}; if [ -e "$dir/.$filename-wrapped" ]; then337 printf '%s\0' "$file" 1>&4;338 fi;339 fi;340 fi;341done342patching script interpreter paths in /nix/store/pn4h7pg87g23kncj4sfq1v4hln0skzgi-php-filter-8.3.36343stripping (with command strip and flags -S) in /nix/store/pn4h7pg87g23kncj4sfq1v4hln0skzgi-php-filter-8.3.36/lib344checking for references to /private/var/tb/7/scratch/25e243765893c731/build/ in /nix/store/qxx52idd5yk8bb47dzfhbr3jslgjhnyb-php-filter-8.3.36-dev...345/nix/store/cv1d7p48379km6a85h4zp6kr86brh32q-audit-tmpdir.sh: line 39: 56953 Done find "$dir" -type f -not -path '*/.build-id/*' -print0346 56954 Segmentation fault: 11 | while IFS= read -r -d '' file; do347 if isELF "$file"; then348 printf '%s\0' "$file" 1>&3;349 else350 if isScript "$file"; then351 filename=${file##*/}; dir=${file%/*}; if [ -e "$dir/.$filename-wrapped" ]; then352 printf '%s\0' "$file" 1>&4;353 fi;354 fi;355 fi;356done357patching script interpreter paths in /nix/store/qxx52idd5yk8bb47dzfhbr3jslgjhnyb-php-filter-8.3.36-dev