nixbot

builds

succeeded php-iconv-8.3.36 checks.x86_64-linux.fastly-purge-lint · build #220 · raw

1tribuchet: building on jamie
unpackPhase
2unpacking source archive /nix/store/jjzjdicz0kshmnck5dk1gvf44sszbfdb-php-8.3.36.tar.bz23source root is php-8.3.364setting SOURCE_DATE_EPOCH to timestamp 1792418434 of file "php-8.3.36/win32/wsyslog.c"
genfiles
5genfiles: bison version 3.8.2 (ok)6genfiles: re2c version 4.6 (ok)7genfiles: Generating Zend parser and lexer files8make: 'Zend/zend_language_parser.c' is up to date.9make: 'Zend/zend_language_scanner.c' is up to date.10make: 'Zend/zend_ini_parser.c' is up to date.11make: 'Zend/zend_ini_scanner.c' is up to date.12genfiles: Generating phpdbg parser and lexer files13make: 'sapi/phpdbg/phpdbg_parser.c' is up to date.14make: 'sapi/phpdbg/phpdbg_lexer.c' is up to date.15genfiles: Generating json extension parser and lexer files16make: 'ext/json/json_parser.tab.c' is up to date.17make: 'ext/json/json_scanner.c' is up to date.18genfiles: Generating PDO lexer file19make: 'ext/pdo/pdo_sql_parser.c' is up to date.20genfiles: Generating standard extension lexer files21make: 'ext/standard/var_unserializer.c' is up to date.22make: 'ext/standard/url_scanner_ex.c' is up to date.23genfiles: Generating phar extension lexer file24make: 'ext/phar/phar_path_check.c' is up to date.
configurePhase
25Configuring for:26PHP Api Version: 2023083127Zend Module Api No: 2023083128Zend Extension Api No: 42023083129fixing libtool script ./build/ltmain.sh30patching script interpreter paths in ./configure31./configure: interpreter directive changed from "#! /bin/sh" to "/nix/store/nnm9gdr70ihc6zc9298mzz8jpcgaciql-bash-5.3p20/bin/sh"32configure flags: --disable-static --prefix=/nix/store/d3s21jpcbqw3m28yin49v618di85zn6j-php-iconv-8.3.36 --bindir=/nix/store/d3s21jpcbqw3m28yin49v618di85zn6j-php-iconv-8.3.36/bin --sbindir=/nix/store/d3s21jpcbqw3m28yin49v618di85zn6j-php-iconv-8.3.36/sbin --includedir=/nix/store/b1cwn7x60q769xj45zxzmdgcmw77ny1g-php-iconv-8.3.36-dev/include --mandir=/nix/store/d3s21jpcbqw3m28yin49v618di85zn6j-php-iconv-8.3.36/share/man --infodir=/nix/store/d3s21jpcbqw3m28yin49v618di85zn6j-php-iconv-8.3.36/share/info --docdir=/nix/store/d3s21jpcbqw3m28yin49v618di85zn6j-php-iconv-8.3.36/share/doc/php-iconv --libdir=/nix/store/d3s21jpcbqw3m28yin49v618di85zn6j-php-iconv-8.3.36/lib --libexecdir=/nix/store/d3s21jpcbqw3m28yin49v618di85zn6j-php-iconv-8.3.36/libexec --localedir=/nix/store/d3s21jpcbqw3m28yin49v618di85zn6j-php-iconv-8.3.36/share/locale --with-iconv33checking for grep that handles long lines and -e... /nix/store/c3f45pxlb81gzz4w1nym7lpznfypva7s-gnugrep-3.12/bin/grep34checking for egrep... /nix/store/c3f45pxlb81gzz4w1nym7lpznfypva7s-gnugrep-3.12/bin/grep -E35checking for a sed that does not truncate output... /nix/store/9wc73n5izv0m7ppjbibi4hbr68rba1lj-gnused-4.10/bin/sed36checking pkg-config is at least version 0.9.0... yes37checking whether the C compiler works... yes38checking for C compiler default output file name... a.out39checking for suffix of executables... 40checking whether we are cross compiling... no41checking for suffix of object files... o42checking whether the compiler supports GNU C... yes43checking whether gcc accepts -g... yes44checking for gcc option to enable C23 features... none needed45checking how to run the C preprocessor... gcc -E46checking for egrep -e... (cached) /nix/store/c3f45pxlb81gzz4w1nym7lpznfypva7s-gnugrep-3.12/bin/grep -E47checking for icc... no48checking for suncc... no49checking for system library directory... lib50checking if compiler supports -Wl,-rpath,... yes51checking build system type... x86_64-pc-linux-gnu52checking host system type... x86_64-pc-linux-gnu53checking target system type... x86_64-pc-linux-gnu54checking for PHP prefix... /nix/store/wpnr7wiy682rqqbb0i58pn9n6lm9w1cl-php-8.3.3655checking for PHP includes... -I/nix/store/cs7yhhbml8l7zna37kq4nf147z9aivf3-php-8.3.36-dev/include/php -I/nix/store/cs7yhhbml8l7zna37kq4nf147z9aivf3-php-8.3.36-dev/include/php/main -I/nix/store/cs7yhhbml8l7zna37kq4nf147z9aivf3-php-8.3.36-dev/include/php/TSRM -I/nix/store/cs7yhhbml8l7zna37kq4nf147z9aivf3-php-8.3.36-dev/include/php/Zend -I/nix/store/cs7yhhbml8l7zna37kq4nf147z9aivf3-php-8.3.36-dev/include/php/ext -I/nix/store/cs7yhhbml8l7zna37kq4nf147z9aivf3-php-8.3.36-dev/include/php/ext/date/lib56checking for PHP extension directory... /nix/store/wpnr7wiy682rqqbb0i58pn9n6lm9w1cl-php-8.3.36/lib/php/extensions57checking for PHP installed headers prefix... /nix/store/cs7yhhbml8l7zna37kq4nf147z9aivf3-php-8.3.36-dev/include/php58checking if debug is enabled... no59checking if zts is enabled... no60checking for gawk... gawk61checking for iconv support... yes, shared62checking for iconv... yes63checking if iconv is glibc's... yes64checking if iconv supports errno... yes65checking if iconv input parameter is const (non-standard)... non-const66checking if iconv supports //IGNORE... no67checking for a sed that does not truncate output... /nix/store/9wc73n5izv0m7ppjbibi4hbr68rba1lj-gnused-4.10/bin/sed68checking for ld used by gcc... ld69checking if the linker (ld) is GNU ld... yes70checking for ld option to reload object files... -r71checking for BSD-compatible nm... nm72checking whether ln -s works... yes73checking how to recognize dependent libraries... (cached) pass_all74./configure: line 6728: /usr/bin/file: No such file or directory75checking for stdio.h... yes76checking for stdlib.h... yes77checking for string.h... yes78checking for inttypes.h... yes79checking for stdint.h... yes80checking for strings.h... yes81checking for sys/stat.h... yes82checking for sys/types.h... yes83checking for unistd.h... yes84checking for dlfcn.h... yes85checking the maximum length of command line arguments... 157286486checking command to parse nm output from gcc object... ok87checking for objdir... .libs88checking for ar... ar89checking for ranlib... ranlib90checking for strip... strip91checking if gcc supports -fno-rtti -fno-exceptions... no92checking for gcc option to produce PIC... -fPIC93checking if gcc PIC flag -fPIC works... yes94checking if gcc static flag -static works... no95checking if gcc supports -c -o file.o... yes96checking whether the gcc linker (ld) supports shared libraries... yes97checking whether -lc should be explicitly linked in... no98checking dynamic linker characteristics... GNU/Linux ld.so99checking how to hardcode library paths into programs... immediate100checking whether stripping libraries is possible... yes101checking if libtool supports shared libraries... yes102checking whether to build shared libraries... yes103checking whether to build static libraries... no104105creating libtool106appending configuration tag "CXX" to libtool107checking whether the g++ linker (ld) supports shared libraries... yes108checking for g++ option to produce PIC... 109checking if g++ static flag works... yes110checking if g++ supports -c -o file.o... yes111checking whether the g++ linker (ld) supports shared libraries... yes112checking dynamic linker characteristics... GNU/Linux ld.so113(cached) (cached) checking how to hardcode library paths into programs... unsupported114configure: patching config.h.in115configure: creating ./config.status116config.status: creating config.h
buildPhase
117build flags: -j24 SHELL=/nix/store/nnm9gdr70ihc6zc9298mzz8jpcgaciql-bash-5.3p20/bin/bash118/nix/store/nnm9gdr70ihc6zc9298mzz8jpcgaciql-bash-5.3p20/bin/bash /build/php-8.3.36/ext/iconv/libtool --tag=CC --mode=compile gcc -I. -I/build/php-8.3.36/ext/iconv -I/build/php-8.3.36/ext/iconv/include -I/build/php-8.3.36/ext/iconv/main -I/build/php-8.3.36/ext/iconv -I/nix/store/cs7yhhbml8l7zna37kq4nf147z9aivf3-php-8.3.36-dev/include/php -I/nix/store/cs7yhhbml8l7zna37kq4nf147z9aivf3-php-8.3.36-dev/include/php/main -I/nix/store/cs7yhhbml8l7zna37kq4nf147z9aivf3-php-8.3.36-dev/include/php/TSRM -I/nix/store/cs7yhhbml8l7zna37kq4nf147z9aivf3-php-8.3.36-dev/include/php/Zend -I/nix/store/cs7yhhbml8l7zna37kq4nf147z9aivf3-php-8.3.36-dev/include/php/ext -I/nix/store/cs7yhhbml8l7zna37kq4nf147z9aivf3-php-8.3.36-dev/include/php/ext/date/lib -DHAVE_CONFIG_H -g -O2 -D_GNU_SOURCE -DZEND_ENABLE_STATIC_TSRMLS_CACHE=1 -DICONV_CONST= -DZEND_COMPILE_DL_EXT=1 -c /build/php-8.3.36/ext/iconv/iconv.c -o iconv.lo -MMD -MF iconv.dep -MT iconv.lo119mkdir .libs120 gcc -I. -I/build/php-8.3.36/ext/iconv -I/build/php-8.3.36/ext/iconv/include -I/build/php-8.3.36/ext/iconv/main -I/build/php-8.3.36/ext/iconv -I/nix/store/cs7yhhbml8l7zna37kq4nf147z9aivf3-php-8.3.36-dev/include/php -I/nix/store/cs7yhhbml8l7zna37kq4nf147z9aivf3-php-8.3.36-dev/include/php/main -I/nix/store/cs7yhhbml8l7zna37kq4nf147z9aivf3-php-8.3.36-dev/include/php/TSRM -I/nix/store/cs7yhhbml8l7zna37kq4nf147z9aivf3-php-8.3.36-dev/include/php/Zend -I/nix/store/cs7yhhbml8l7zna37kq4nf147z9aivf3-php-8.3.36-dev/include/php/ext -I/nix/store/cs7yhhbml8l7zna37kq4nf147z9aivf3-php-8.3.36-dev/include/php/ext/date/lib -DHAVE_CONFIG_H -g -O2 -D_GNU_SOURCE -DZEND_ENABLE_STATIC_TSRMLS_CACHE=1 -DICONV_CONST= -DZEND_COMPILE_DL_EXT=1 -c /build/php-8.3.36/ext/iconv/iconv.c -MMD -MF iconv.dep -MT iconv.lo -fPIC -DPIC -o .libs/iconv.o121/build/php-8.3.36/ext/iconv/iconv.c: In function 'php_iconv_output_handler':122/build/php-8.3.36/ext/iconv/iconv.c:324:35: warning: initialization discards 'const' qualifier from pointer target type [-Wdiscarded-qualifiers]123 324 | char *p = strstr(get_output_encoding(), "//");124 | ^~~~~~125/build/php-8.3.36/ext/iconv/iconv.c: In function 'php_iconv_stream_filter_factory_create':126/build/php-8.3.36/ext/iconv/iconv.c:2610:27: warning: assignment discards 'const' qualifier from pointer target type [-Wdiscarded-qualifiers]127 2610 | if ((from_charset = strchr(name, '.')) == NULL) {128 | ^129/nix/store/nnm9gdr70ihc6zc9298mzz8jpcgaciql-bash-5.3p20/bin/bash /build/php-8.3.36/ext/iconv/libtool --tag=CC --mode=link gcc -shared -I/build/php-8.3.36/ext/iconv/include -I/build/php-8.3.36/ext/iconv/main -I/build/php-8.3.36/ext/iconv -I/nix/store/cs7yhhbml8l7zna37kq4nf147z9aivf3-php-8.3.36-dev/include/php -I/nix/store/cs7yhhbml8l7zna37kq4nf147z9aivf3-php-8.3.36-dev/include/php/main -I/nix/store/cs7yhhbml8l7zna37kq4nf147z9aivf3-php-8.3.36-dev/include/php/TSRM -I/nix/store/cs7yhhbml8l7zna37kq4nf147z9aivf3-php-8.3.36-dev/include/php/Zend -I/nix/store/cs7yhhbml8l7zna37kq4nf147z9aivf3-php-8.3.36-dev/include/php/ext -I/nix/store/cs7yhhbml8l7zna37kq4nf147z9aivf3-php-8.3.36-dev/include/php/ext/date/lib -DHAVE_CONFIG_H -g -O2 -D_GNU_SOURCE -o iconv.la -export-dynamic -avoid-version -prefer-pic -module -rpath /build/php-8.3.36/ext/iconv/modules iconv.lo 130gcc -shared .libs/iconv.o -Wl,-soname -Wl,iconv.so -o .libs/iconv.so131creating iconv.la132(cd .libs && rm -f iconv.la && ln -s ../iconv.la iconv.la)133/nix/store/nnm9gdr70ihc6zc9298mzz8jpcgaciql-bash-5.3p20/bin/bash /build/php-8.3.36/ext/iconv/libtool --tag=CC --mode=install cp ./iconv.la /build/php-8.3.36/ext/iconv/modules134cp ./.libs/iconv.so /build/php-8.3.36/ext/iconv/modules/iconv.so135cp ./.libs/iconv.lai /build/php-8.3.36/ext/iconv/modules/iconv.la136PATH="$PATH:/sbin" ldconfig -n /build/php-8.3.36/ext/iconv/modules137----------------------------------------------------------------------138Libraries have been installed in:139 /build/php-8.3.36/ext/iconv/modules140141If you ever happen to want to link against installed libraries142in a given directory, LIBDIR, you must either use libtool, and143specify the full pathname of the library, or use the `-LLIBDIR'144flag during linking and do at least one of the following:145 - add LIBDIR to the `LD_LIBRARY_PATH' environment variable146 during execution147 - add LIBDIR to the `LD_RUN_PATH' environment variable148 during linking149 - use the `-Wl,--rpath -Wl,LIBDIR' linker flag150151See any operating system documentation about shared libraries for152more information, such as the ld(1) and ld.so(8) manual pages.153----------------------------------------------------------------------154155Build complete.156Don't forget to run 'make test'.157
checkPhase
158159Build complete.160Don't forget to run 'make test'.161162163=====================================================================164PHP : /nix/store/wpnr7wiy682rqqbb0i58pn9n6lm9w1cl-php-8.3.36/bin/php 165PHP_SAPI : cli166PHP_VERSION : 8.3.36167ZEND_VERSION: 4.3.36168PHP_OS : Linux - Linux localhost 6.11.0 #1-NixOS SMP PREEMPT_DYNAMIC Mon Aug 24 01:44:40 UTC 2026 x86_64169INI actual : /build/php-8.3.36/ext/iconv/tmp-php.ini170More .INIs : 171---------------------------------------------------------------------172PHP : /nix/store/wpnr7wiy682rqqbb0i58pn9n6lm9w1cl-php-8.3.36/bin/php-cgi 173PHP_SAPI : cgi-fcgi174PHP_VERSION : 8.3.36175ZEND_VERSION: 4.3.36176PHP_OS : Linux - Linux localhost 6.11.0 #1-NixOS SMP PREEMPT_DYNAMIC Mon Aug 24 01:44:40 UTC 2026 x86_64177INI actual : /build/php-8.3.36/ext/iconv/tmp-php.ini178More .INIs : 179--------------------------------------------------------------------- 180---------------------------------------------------------------------181PHP : /nix/store/wpnr7wiy682rqqbb0i58pn9n6lm9w1cl-php-8.3.36/bin/phpdbg 182PHP_SAPI : phpdbg183PHP_VERSION : 8.3.36184ZEND_VERSION: 4.3.36185PHP_OS : Linux - Linux localhost 6.11.0 #1-NixOS SMP PREEMPT_DYNAMIC Mon Aug 24 01:44:40 UTC 2026 x86_64186INI actual : /build/php-8.3.36/ext/iconv/tmp-php.ini187More .INIs : 188---------------------------------------------------------------------189CWD : /build/php-8.3.36/ext/iconv190Extra dirs : 191VALGRIND : Not used192=====================================================================193TIME START 2026-10-21 19:57:55194=====================================================================195PASS Bug #37176 (iconv_strpos() fails to find a string) [tests/bug37176.phpt] 196PASS Bug #37773 (iconv_substr() gives "Unknown error" when string length = 1") [tests/bug37773.phpt] 197PASS Bug #48147 (iconv with //IGNORE cuts the string) [tests/bug48147.phpt] 198PASS Bug #48289 (iconv_mime_encode() quoted-printable scheme is broken) [tests/bug48289.phpt] 199PASS Bug #51250 (iconv_mime_decode() does not ignore malformed Q-encoded words) [tests/bug51250.phpt] 200PASS Bug #52211 (iconv() returns part of string on error) [tests/bug52211.phpt] 201PASS Bug #52941 (The 'iconv_mime_decode_headers' function is skipping headers) [tests/bug52941.phpt] 202PASS Bug #53304 (quot_print_decode does not handle lower-case hex digits) [tests/bug53304.phpt] 203PASS Bug #53891 (iconv_mime_encode() fails to Q-encode UTF-8 string) [tests/bug53891.phpt] 204PASS Bug #55146 (iconv_mime_decode_headers() skips some headers) [tests/bug55146.phpt] 205PASS Bug #60494 (iconv_mime_decode does ignore special characters) [tests/bug60494.phpt] 206PASS Bug #63839 (iconv_mime_decode_headers function is skipping headers) [tests/bug63839.phpt] 207PASS Bug #66828 (iconv_mime_encode Q-encoding longer than it should be) [tests/bug66828.phpt] 208PASS Bug #68180 (iconv_mime_decode can return extra characters in a header) [tests/bug68180.phpt] 209PASS Bug #69840 (iconv_substr() doesn't work with UTF-16BE) [tests/bug69840.phpt] 210PASS Bug #72320 (iconv_substr returns false for empty strings) [tests/bug72320.phpt] 211PASS Bug #74230 iconv fails to fail on surrogates [tests/bug74230.phpt] 212PASS Bug #76249 (stream filter convert.iconv leads to infinite loop on invalid sequence) [tests/bug76249.phpt] 213PASS Bug #77147 (Fixing 60494 ignored ICONV_MIME_DECODE_CONTINUE_ON_ERROR) [tests/bug77147.phpt] 214PASS Bug #78069 (Out-of-bounds read in iconv.c:_php_iconv_mime_decode() due to integer overflow) [tests/bug78069.phpt] 215PASS Bug #79200 (Some iconv functions cut Windows-1258) [tests/bug79200.phpt] 216PASS EUC-JP to ISO-2022-JP [tests/eucjp2iso2022jp.phpt] 217PASS EUC-JP to SJIS [tests/eucjp2sjis.phpt] 218PASS EUC-JP to UTF8 [tests/eucjp2utf8.phpt] 219PASS GH-17047 (UAF on iconv filter failure) [tests/gh17047.phpt] 220PASS GH-7953 (ob_clean() only may not set Content-* header) [tests/gh7953.phpt] 221PASS Bug GH-7980 (Unexpected result for iconv_mime_decode) [tests/gh7980.phpt] 222PASS iconv() charset parameter length checks (CVE-2007-4840) [tests/iconv-charset-length-cve-2007-4840.phpt] 223PASS iconv() test 1 [tests/iconv001.phpt] 224PASS iconv() test 2 (UCS4BE to ASCII) [tests/iconv002.phpt] 225PASS iconv() test 3 [tests/iconv003.phpt] 226PASS iconv_mime_encode() sanity cheeck. [tests/iconv004.phpt] 227PASS Test iconv() function : basic functionality [tests/iconv_basic.phpt] 228SKIP Test the basics to function iconv. [tests/iconv_basic_001-win32.phpt] reason: windows only test229SKIP Test the basics to function iconv. [tests/iconv_basic_001.phpt] reason: en_US.utf8 locales not available230PASS Test default_charset handling [tests/iconv_default_charset.phpt] 231PASS Test iconv_get_encoding()/iconv_set_encoding() function : basic functionality [tests/iconv_encoding_basic.phpt] 232PASS iconv_get_encoding() parameter tests [tests/iconv_get_encoding_basic.phpt] 233PASS Encoding INI test [tests/iconv_ini_encoding.phpt] 234PASS iconv_mime_decode() charset parameter length checks (CVE-2007-4840) [tests/iconv_mime_decode-charset-length-cve-2007-4840.phpt] 235PASS iconv_mime_decode() [tests/iconv_mime_decode.phpt] 236PASS iconv_mime_decode_headers() charset parameter length checks (CVE-2007-4840) [tests/iconv_mime_decode_headers-charset-length-cve-2007-4840.phpt] 237PASS iconv_mime_decode_headers() [tests/iconv_mime_decode_headers.phpt] 238PASS iconv_mime_encode() [tests/iconv_mime_encode.phpt] 239PASS iconv_mime_encode(): Encoding parameter exceeds the maximum allowed for preference "input-charset" and "output-charset" [tests/iconv_mime_encode_001.phpt] 240PASS iconv_set_encoding() charset parameter length checks (CVE-2007-4840) [tests/iconv_set_encoding-charset-length-cve-2007-4840.phpt] 241PASS iconv stream filter [tests/iconv_stream_filter.phpt] 242PASS iconv stream filter [tests/iconv_stream_filter_delimiter.phpt] 243PASS iconv_strlen() charset parameter length checks (CVE-2007-4840) [tests/iconv_strlen-charset-length-cve-2007-4840.phpt] 244PASS iconv_strlen() [tests/iconv_strlen.phpt] 245PASS Test iconv_strlen() function : basic functionality [tests/iconv_strlen_basic.phpt] 246PASS Test iconv_strlen() function : error conditions - pass an unknown encoding [tests/iconv_strlen_error2.phpt] 247PASS iconv_strpos() charset parameter length checks (CVE-2007-4840) [tests/iconv_strpos-charset-length-cve-2007-4840.phpt] 248PASS iconv_strpos() [tests/iconv_strpos.phpt] 249PASS Test iconv_strpos() function : basic functionality [tests/iconv_strpos_basic.phpt] 250PASS Test iconv_strpos() function : error conditions - Pass unknown encoding [tests/iconv_strpos_error2.phpt] 251PASS iconv_strpos() - test against PHP's default internal encoding [tests/iconv_strpos_error_001.phpt] 252PASS Test iconv_strpos() function : usage variations - Pass different integers as $offset argument [tests/iconv_strpos_variation5.phpt] 253PASS iconv_strrpos() charset parameter length checks (CVE-2007-4840) [tests/iconv_strrpos-charset-length-cve-2007-4840.phpt] 254PASS iconv_strrpos() [tests/iconv_strrpos.phpt] 255PASS Test iconv_strrpos() function : basic functionality [tests/iconv_strrpos_basic.phpt] 256PASS Test iconv_strrpos() function : error conditions - pass an unknown encoding [tests/iconv_strrpos_error2.phpt] 257PASS iconv_substr() charset parameter length checks (CVE-2007-4783) [tests/iconv_substr-charset-length-cve-2007-4783.phpt] 258PASS iconv_substr() [tests/iconv_substr.phpt] 259PASS Test iconv_substr() function : basic functionality [tests/iconv_substr_basic.phpt] 260PASS Test iconv_substr() function : error conditions - Pass an unknown encoding [tests/iconv_substr_error2.phpt] 261PASS iconv_substr() with out of bounds offset [tests/iconv_substr_out_of_bounds.phpt] 262PASS ob_iconv_handler() charset parameter length checks (CVE-2007-4840) [tests/ob_iconv_handler-charset-length-cve-2007-4840.phpt] 263PASS ob_iconv_handler() [tests/ob_iconv_handler.phpt] 264PASS iconv() doesn't reach hard limit [tests/oom_iconv.phpt] 265PASS iconv_mime_decode() doesn't reach hard limit [tests/oom_iconv_mime_decode.phpt] 266PASS iconv_mime_decode_headers() doesn't reach hard limit [tests/oom_iconv_mime_decode_headers.phpt] 267PASS iconv_mime_encode() doesn't reach hard limit [tests/oom_iconv_mime_encode.phpt] 268PASS iconv_mime_encode() line-length doesn't reach hard limit [tests/oom_iconv_mime_encode_line_length.phpt] 269PASS convert.iconv stream filter doesn't reach hard limit [tests/oom_iconv_stream_filter.phpt] 270SKIP Translit failure [tests/translit-failure.phpt] reason: ICONV_IMPL != "libiconv"271SKIP Translit UTF-8 quotes [tests/translit-utf8.phpt] reason: ICONV_IMPL != "libiconv"272=====================================================================273TIME END 2026-10-21 19:57:56274275=====================================================================276TEST RESULT SUMMARY277---------------------------------------------------------------------278Exts skipped : 0279Exts tested : 12280---------------------------------------------------------------------281282Number of tests : 77 73283Tests skipped : 4 ( 5.2%) --------284Tests warned : 0 ( 0.0%) ( 0.0%)285Tests failed : 0 ( 0.0%) ( 0.0%)286Tests passed : 73 ( 94.8%) (100.0%)287---------------------------------------------------------------------288Time taken : 1 seconds289=====================================================================
fixupPhase
290shrinking RPATHs of ELF executables and libraries in /nix/store/d3s21jpcbqw3m28yin49v618di85zn6j-php-iconv-8.3.36291shrinking /nix/store/d3s21jpcbqw3m28yin49v618di85zn6j-php-iconv-8.3.36/lib/php/extensions/iconv.so292checking for references to /build/ in /nix/store/d3s21jpcbqw3m28yin49v618di85zn6j-php-iconv-8.3.36...293patching script interpreter paths in /nix/store/d3s21jpcbqw3m28yin49v618di85zn6j-php-iconv-8.3.36294stripping (with command strip and flags -S -p) in /nix/store/d3s21jpcbqw3m28yin49v618di85zn6j-php-iconv-8.3.36/lib295shrinking RPATHs of ELF executables and libraries in /nix/store/b1cwn7x60q769xj45zxzmdgcmw77ny1g-php-iconv-8.3.36-dev296checking for references to /build/ in /nix/store/b1cwn7x60q769xj45zxzmdgcmw77ny1g-php-iconv-8.3.36-dev...297patching script interpreter paths in /nix/store/b1cwn7x60q769xj45zxzmdgcmw77ny1g-php-iconv-8.3.36-dev