php-calendar-8.3.36
checks.x86_64-linux.fastly-purge-lint
· build #220
· raw
1tribuchet: building on jamie
unpackPhase
2unpacking source archive /nix/store/jjzjdicz0kshmnck5dk1gvf44sszbfdb-php-8.3.36.tar.bz23source root is php-8.3.364setting SOURCE_DATE_EPOCH to timestamp 1792418434 of file "php-8.3.36/win32/wsyslog.c"genfiles
5genfiles: bison version 3.8.2 (ok)6genfiles: re2c version 4.6 (ok)7genfiles: Generating Zend parser and lexer files8make: 'Zend/zend_language_parser.c' is up to date.9make: 'Zend/zend_language_scanner.c' is up to date.10make: 'Zend/zend_ini_parser.c' is up to date.11make: 'Zend/zend_ini_scanner.c' is up to date.12genfiles: Generating phpdbg parser and lexer files13make: 'sapi/phpdbg/phpdbg_parser.c' is up to date.14make: 'sapi/phpdbg/phpdbg_lexer.c' is up to date.15genfiles: Generating json extension parser and lexer files16make: 'ext/json/json_parser.tab.c' is up to date.17make: 'ext/json/json_scanner.c' is up to date.18genfiles: Generating PDO lexer file19make: 'ext/pdo/pdo_sql_parser.c' is up to date.20genfiles: Generating standard extension lexer files21make: 'ext/standard/var_unserializer.c' is up to date.22make: 'ext/standard/url_scanner_ex.c' is up to date.23genfiles: Generating phar extension lexer file24make: 'ext/phar/phar_path_check.c' is up to date.configurePhase
25Configuring for:26PHP Api Version: 2023083127Zend Module Api No: 2023083128Zend Extension Api No: 42023083129fixing libtool script ./build/ltmain.sh30patching script interpreter paths in ./configure31./configure: interpreter directive changed from "#! /bin/sh" to "/nix/store/nnm9gdr70ihc6zc9298mzz8jpcgaciql-bash-5.3p20/bin/sh"32configure flags: --disable-static --prefix=/nix/store/sjbwj10bmbwdd6hhvdgbnlqhdvynkq5y-php-calendar-8.3.36 --bindir=/nix/store/sjbwj10bmbwdd6hhvdgbnlqhdvynkq5y-php-calendar-8.3.36/bin --sbindir=/nix/store/sjbwj10bmbwdd6hhvdgbnlqhdvynkq5y-php-calendar-8.3.36/sbin --includedir=/nix/store/p45pkla01pa7q126cv8dwaj9q017n16n-php-calendar-8.3.36-dev/include --mandir=/nix/store/sjbwj10bmbwdd6hhvdgbnlqhdvynkq5y-php-calendar-8.3.36/share/man --infodir=/nix/store/sjbwj10bmbwdd6hhvdgbnlqhdvynkq5y-php-calendar-8.3.36/share/info --docdir=/nix/store/sjbwj10bmbwdd6hhvdgbnlqhdvynkq5y-php-calendar-8.3.36/share/doc/php-calendar --libdir=/nix/store/sjbwj10bmbwdd6hhvdgbnlqhdvynkq5y-php-calendar-8.3.36/lib --libexecdir=/nix/store/sjbwj10bmbwdd6hhvdgbnlqhdvynkq5y-php-calendar-8.3.36/libexec --localedir=/nix/store/sjbwj10bmbwdd6hhvdgbnlqhdvynkq5y-php-calendar-8.3.36/share/locale --enable-calendar33checking for grep that handles long lines and -e... /nix/store/c3f45pxlb81gzz4w1nym7lpznfypva7s-gnugrep-3.12/bin/grep34checking for egrep... /nix/store/c3f45pxlb81gzz4w1nym7lpznfypva7s-gnugrep-3.12/bin/grep -E35checking for a sed that does not truncate output... /nix/store/9wc73n5izv0m7ppjbibi4hbr68rba1lj-gnused-4.10/bin/sed36checking pkg-config is at least version 0.9.0... yes37checking whether the C compiler works... yes38checking for C compiler default output file name... a.out39checking for suffix of executables... 40checking whether we are cross compiling... no41checking for suffix of object files... o42checking whether the compiler supports GNU C... yes43checking whether gcc accepts -g... yes44checking for gcc option to enable C23 features... none needed45checking how to run the C preprocessor... gcc -E46checking for egrep -e... (cached) /nix/store/c3f45pxlb81gzz4w1nym7lpznfypva7s-gnugrep-3.12/bin/grep -E47checking for icc... no48checking for suncc... no49checking for system library directory... lib50checking if compiler supports -Wl,-rpath,... yes51checking build system type... x86_64-pc-linux-gnu52checking host system type... x86_64-pc-linux-gnu53checking target system type... x86_64-pc-linux-gnu54checking for PHP prefix... /nix/store/wpnr7wiy682rqqbb0i58pn9n6lm9w1cl-php-8.3.3655checking for PHP includes... -I/nix/store/cs7yhhbml8l7zna37kq4nf147z9aivf3-php-8.3.36-dev/include/php -I/nix/store/cs7yhhbml8l7zna37kq4nf147z9aivf3-php-8.3.36-dev/include/php/main -I/nix/store/cs7yhhbml8l7zna37kq4nf147z9aivf3-php-8.3.36-dev/include/php/TSRM -I/nix/store/cs7yhhbml8l7zna37kq4nf147z9aivf3-php-8.3.36-dev/include/php/Zend -I/nix/store/cs7yhhbml8l7zna37kq4nf147z9aivf3-php-8.3.36-dev/include/php/ext -I/nix/store/cs7yhhbml8l7zna37kq4nf147z9aivf3-php-8.3.36-dev/include/php/ext/date/lib56checking for PHP extension directory... /nix/store/wpnr7wiy682rqqbb0i58pn9n6lm9w1cl-php-8.3.36/lib/php/extensions57checking for PHP installed headers prefix... /nix/store/cs7yhhbml8l7zna37kq4nf147z9aivf3-php-8.3.36-dev/include/php58checking if debug is enabled... no59checking if zts is enabled... no60checking for gawk... gawk61checking whether to enable calendar conversion support... yes, shared62checking for a sed that does not truncate output... /nix/store/9wc73n5izv0m7ppjbibi4hbr68rba1lj-gnused-4.10/bin/sed63checking for ld used by gcc... ld64checking if the linker (ld) is GNU ld... yes65checking for ld option to reload object files... -r66checking for BSD-compatible nm... nm67checking whether ln -s works... yes68checking how to recognize dependent libraries... (cached) pass_all69./configure: line 5766: /usr/bin/file: No such file or directory70checking for stdio.h... yes71checking for stdlib.h... yes72checking for string.h... yes73checking for inttypes.h... yes74checking for stdint.h... yes75checking for strings.h... yes76checking for sys/stat.h... yes77checking for sys/types.h... yes78checking for unistd.h... yes79checking for dlfcn.h... yes80checking the maximum length of command line arguments... 157286481checking command to parse nm output from gcc object... ok82checking for objdir... .libs83checking for ar... ar84checking for ranlib... ranlib85checking for strip... strip86checking if gcc supports -fno-rtti -fno-exceptions... no87checking for gcc option to produce PIC... -fPIC88checking if gcc PIC flag -fPIC works... yes89checking if gcc static flag -static works... no90checking if gcc supports -c -o file.o... yes91checking whether the gcc linker (ld) supports shared libraries... yes92checking whether -lc should be explicitly linked in... no93checking dynamic linker characteristics... GNU/Linux ld.so94checking how to hardcode library paths into programs... immediate95checking whether stripping libraries is possible... yes96checking if libtool supports shared libraries... yes97checking whether to build shared libraries... yes98checking whether to build static libraries... no99100creating libtool101appending configuration tag "CXX" to libtool102checking whether the g++ linker (ld) supports shared libraries... yes103checking for g++ option to produce PIC... 104checking if g++ static flag works... yes105checking if g++ supports -c -o file.o... yes106checking whether the g++ linker (ld) supports shared libraries... yes107checking dynamic linker characteristics... GNU/Linux ld.so108(cached) (cached) checking how to hardcode library paths into programs... unsupported109configure: patching config.h.in110configure: creating ./config.status111config.status: creating config.hbuildPhase
112build flags: -j24 SHELL=/nix/store/nnm9gdr70ihc6zc9298mzz8jpcgaciql-bash-5.3p20/bin/bash113/nix/store/nnm9gdr70ihc6zc9298mzz8jpcgaciql-bash-5.3p20/bin/bash /build/php-8.3.36/ext/calendar/libtool --tag=CC --mode=compile gcc -I. -I/build/php-8.3.36/ext/calendar -I/build/php-8.3.36/ext/calendar/include -I/build/php-8.3.36/ext/calendar/main -I/build/php-8.3.36/ext/calendar -I/nix/store/cs7yhhbml8l7zna37kq4nf147z9aivf3-php-8.3.36-dev/include/php -I/nix/store/cs7yhhbml8l7zna37kq4nf147z9aivf3-php-8.3.36-dev/include/php/main -I/nix/store/cs7yhhbml8l7zna37kq4nf147z9aivf3-php-8.3.36-dev/include/php/TSRM -I/nix/store/cs7yhhbml8l7zna37kq4nf147z9aivf3-php-8.3.36-dev/include/php/Zend -I/nix/store/cs7yhhbml8l7zna37kq4nf147z9aivf3-php-8.3.36-dev/include/php/ext -I/nix/store/cs7yhhbml8l7zna37kq4nf147z9aivf3-php-8.3.36-dev/include/php/ext/date/lib -DHAVE_CONFIG_H -g -O2 -D_GNU_SOURCE -DZEND_COMPILE_DL_EXT=1 -c /build/php-8.3.36/ext/calendar/calendar.c -o calendar.lo -MMD -MF calendar.dep -MT calendar.lo114/nix/store/nnm9gdr70ihc6zc9298mzz8jpcgaciql-bash-5.3p20/bin/bash /build/php-8.3.36/ext/calendar/libtool --tag=CC --mode=compile gcc -I. -I/build/php-8.3.36/ext/calendar -I/build/php-8.3.36/ext/calendar/include -I/build/php-8.3.36/ext/calendar/main -I/build/php-8.3.36/ext/calendar -I/nix/store/cs7yhhbml8l7zna37kq4nf147z9aivf3-php-8.3.36-dev/include/php -I/nix/store/cs7yhhbml8l7zna37kq4nf147z9aivf3-php-8.3.36-dev/include/php/main -I/nix/store/cs7yhhbml8l7zna37kq4nf147z9aivf3-php-8.3.36-dev/include/php/TSRM -I/nix/store/cs7yhhbml8l7zna37kq4nf147z9aivf3-php-8.3.36-dev/include/php/Zend -I/nix/store/cs7yhhbml8l7zna37kq4nf147z9aivf3-php-8.3.36-dev/include/php/ext -I/nix/store/cs7yhhbml8l7zna37kq4nf147z9aivf3-php-8.3.36-dev/include/php/ext/date/lib -DHAVE_CONFIG_H -g -O2 -D_GNU_SOURCE -DZEND_COMPILE_DL_EXT=1 -c /build/php-8.3.36/ext/calendar/dow.c -o dow.lo -MMD -MF dow.dep -MT dow.lo115/nix/store/nnm9gdr70ihc6zc9298mzz8jpcgaciql-bash-5.3p20/bin/bash /build/php-8.3.36/ext/calendar/libtool --tag=CC --mode=compile gcc -I. -I/build/php-8.3.36/ext/calendar -I/build/php-8.3.36/ext/calendar/include -I/build/php-8.3.36/ext/calendar/main -I/build/php-8.3.36/ext/calendar -I/nix/store/cs7yhhbml8l7zna37kq4nf147z9aivf3-php-8.3.36-dev/include/php -I/nix/store/cs7yhhbml8l7zna37kq4nf147z9aivf3-php-8.3.36-dev/include/php/main -I/nix/store/cs7yhhbml8l7zna37kq4nf147z9aivf3-php-8.3.36-dev/include/php/TSRM -I/nix/store/cs7yhhbml8l7zna37kq4nf147z9aivf3-php-8.3.36-dev/include/php/Zend -I/nix/store/cs7yhhbml8l7zna37kq4nf147z9aivf3-php-8.3.36-dev/include/php/ext -I/nix/store/cs7yhhbml8l7zna37kq4nf147z9aivf3-php-8.3.36-dev/include/php/ext/date/lib -DHAVE_CONFIG_H -g -O2 -D_GNU_SOURCE -DZEND_COMPILE_DL_EXT=1 -c /build/php-8.3.36/ext/calendar/french.c -o french.lo -MMD -MF french.dep -MT french.lo116/nix/store/nnm9gdr70ihc6zc9298mzz8jpcgaciql-bash-5.3p20/bin/bash /build/php-8.3.36/ext/calendar/libtool --tag=CC --mode=compile gcc -I. -I/build/php-8.3.36/ext/calendar -I/build/php-8.3.36/ext/calendar/include -I/build/php-8.3.36/ext/calendar/main -I/build/php-8.3.36/ext/calendar -I/nix/store/cs7yhhbml8l7zna37kq4nf147z9aivf3-php-8.3.36-dev/include/php -I/nix/store/cs7yhhbml8l7zna37kq4nf147z9aivf3-php-8.3.36-dev/include/php/main -I/nix/store/cs7yhhbml8l7zna37kq4nf147z9aivf3-php-8.3.36-dev/include/php/TSRM -I/nix/store/cs7yhhbml8l7zna37kq4nf147z9aivf3-php-8.3.36-dev/include/php/Zend -I/nix/store/cs7yhhbml8l7zna37kq4nf147z9aivf3-php-8.3.36-dev/include/php/ext -I/nix/store/cs7yhhbml8l7zna37kq4nf147z9aivf3-php-8.3.36-dev/include/php/ext/date/lib -DHAVE_CONFIG_H -g -O2 -D_GNU_SOURCE -DZEND_COMPILE_DL_EXT=1 -c /build/php-8.3.36/ext/calendar/gregor.c -o gregor.lo -MMD -MF gregor.dep -MT gregor.lo117/nix/store/nnm9gdr70ihc6zc9298mzz8jpcgaciql-bash-5.3p20/bin/bash /build/php-8.3.36/ext/calendar/libtool --tag=CC --mode=compile gcc -I. -I/build/php-8.3.36/ext/calendar -I/build/php-8.3.36/ext/calendar/include -I/build/php-8.3.36/ext/calendar/main -I/build/php-8.3.36/ext/calendar -I/nix/store/cs7yhhbml8l7zna37kq4nf147z9aivf3-php-8.3.36-dev/include/php -I/nix/store/cs7yhhbml8l7zna37kq4nf147z9aivf3-php-8.3.36-dev/include/php/main -I/nix/store/cs7yhhbml8l7zna37kq4nf147z9aivf3-php-8.3.36-dev/include/php/TSRM -I/nix/store/cs7yhhbml8l7zna37kq4nf147z9aivf3-php-8.3.36-dev/include/php/Zend -I/nix/store/cs7yhhbml8l7zna37kq4nf147z9aivf3-php-8.3.36-dev/include/php/ext -I/nix/store/cs7yhhbml8l7zna37kq4nf147z9aivf3-php-8.3.36-dev/include/php/ext/date/lib -DHAVE_CONFIG_H -g -O2 -D_GNU_SOURCE -DZEND_COMPILE_DL_EXT=1 -c /build/php-8.3.36/ext/calendar/jewish.c -o jewish.lo -MMD -MF jewish.dep -MT jewish.lo118/nix/store/nnm9gdr70ihc6zc9298mzz8jpcgaciql-bash-5.3p20/bin/bash /build/php-8.3.36/ext/calendar/libtool --tag=CC --mode=compile gcc -I. -I/build/php-8.3.36/ext/calendar -I/build/php-8.3.36/ext/calendar/include -I/build/php-8.3.36/ext/calendar/main -I/build/php-8.3.36/ext/calendar -I/nix/store/cs7yhhbml8l7zna37kq4nf147z9aivf3-php-8.3.36-dev/include/php -I/nix/store/cs7yhhbml8l7zna37kq4nf147z9aivf3-php-8.3.36-dev/include/php/main -I/nix/store/cs7yhhbml8l7zna37kq4nf147z9aivf3-php-8.3.36-dev/include/php/TSRM -I/nix/store/cs7yhhbml8l7zna37kq4nf147z9aivf3-php-8.3.36-dev/include/php/Zend -I/nix/store/cs7yhhbml8l7zna37kq4nf147z9aivf3-php-8.3.36-dev/include/php/ext -I/nix/store/cs7yhhbml8l7zna37kq4nf147z9aivf3-php-8.3.36-dev/include/php/ext/date/lib -DHAVE_CONFIG_H -g -O2 -D_GNU_SOURCE -DZEND_COMPILE_DL_EXT=1 -c /build/php-8.3.36/ext/calendar/julian.c -o julian.lo -MMD -MF julian.dep -MT julian.lo119/nix/store/nnm9gdr70ihc6zc9298mzz8jpcgaciql-bash-5.3p20/bin/bash /build/php-8.3.36/ext/calendar/libtool --tag=CC --mode=compile gcc -I. -I/build/php-8.3.36/ext/calendar -I/build/php-8.3.36/ext/calendar/include -I/build/php-8.3.36/ext/calendar/main -I/build/php-8.3.36/ext/calendar -I/nix/store/cs7yhhbml8l7zna37kq4nf147z9aivf3-php-8.3.36-dev/include/php -I/nix/store/cs7yhhbml8l7zna37kq4nf147z9aivf3-php-8.3.36-dev/include/php/main -I/nix/store/cs7yhhbml8l7zna37kq4nf147z9aivf3-php-8.3.36-dev/include/php/TSRM -I/nix/store/cs7yhhbml8l7zna37kq4nf147z9aivf3-php-8.3.36-dev/include/php/Zend -I/nix/store/cs7yhhbml8l7zna37kq4nf147z9aivf3-php-8.3.36-dev/include/php/ext -I/nix/store/cs7yhhbml8l7zna37kq4nf147z9aivf3-php-8.3.36-dev/include/php/ext/date/lib -DHAVE_CONFIG_H -g -O2 -D_GNU_SOURCE -DZEND_COMPILE_DL_EXT=1 -c /build/php-8.3.36/ext/calendar/easter.c -o easter.lo -MMD -MF easter.dep -MT easter.lo120/nix/store/nnm9gdr70ihc6zc9298mzz8jpcgaciql-bash-5.3p20/bin/bash /build/php-8.3.36/ext/calendar/libtool --tag=CC --mode=compile gcc -I. -I/build/php-8.3.36/ext/calendar -I/build/php-8.3.36/ext/calendar/include -I/build/php-8.3.36/ext/calendar/main -I/build/php-8.3.36/ext/calendar -I/nix/store/cs7yhhbml8l7zna37kq4nf147z9aivf3-php-8.3.36-dev/include/php -I/nix/store/cs7yhhbml8l7zna37kq4nf147z9aivf3-php-8.3.36-dev/include/php/main -I/nix/store/cs7yhhbml8l7zna37kq4nf147z9aivf3-php-8.3.36-dev/include/php/TSRM -I/nix/store/cs7yhhbml8l7zna37kq4nf147z9aivf3-php-8.3.36-dev/include/php/Zend -I/nix/store/cs7yhhbml8l7zna37kq4nf147z9aivf3-php-8.3.36-dev/include/php/ext -I/nix/store/cs7yhhbml8l7zna37kq4nf147z9aivf3-php-8.3.36-dev/include/php/ext/date/lib -DHAVE_CONFIG_H -g -O2 -D_GNU_SOURCE -DZEND_COMPILE_DL_EXT=1 -c /build/php-8.3.36/ext/calendar/cal_unix.c -o cal_unix.lo -MMD -MF cal_unix.dep -MT cal_unix.lo121mkdir .libs122mkdir .libs123mkdir: cannot create directory '.libs': File exists124 gcc -I. -I/build/php-8.3.36/ext/calendar -I/build/php-8.3.36/ext/calendar/include -I/build/php-8.3.36/ext/calendar/main -I/build/php-8.3.36/ext/calendar -I/nix/store/cs7yhhbml8l7zna37kq4nf147z9aivf3-php-8.3.36-dev/include/php -I/nix/store/cs7yhhbml8l7zna37kq4nf147z9aivf3-php-8.3.36-dev/include/php/main -I/nix/store/cs7yhhbml8l7zna37kq4nf147z9aivf3-php-8.3.36-dev/include/php/TSRM -I/nix/store/cs7yhhbml8l7zna37kq4nf147z9aivf3-php-8.3.36-dev/include/php/Zend -I/nix/store/cs7yhhbml8l7zna37kq4nf147z9aivf3-php-8.3.36-dev/include/php/ext -I/nix/store/cs7yhhbml8l7zna37kq4nf147z9aivf3-php-8.3.36-dev/include/php/ext/date/lib -DHAVE_CONFIG_H -g -O2 -D_GNU_SOURCE -DZEND_COMPILE_DL_EXT=1 -c /build/php-8.3.36/ext/calendar/julian.c -MMD -MF julian.dep -MT julian.lo -fPIC -DPIC -o .libs/julian.o125 gcc -I. -I/build/php-8.3.36/ext/calendar -I/build/php-8.3.36/ext/calendar/include -I/build/php-8.3.36/ext/calendar/main -I/build/php-8.3.36/ext/calendar -I/nix/store/cs7yhhbml8l7zna37kq4nf147z9aivf3-php-8.3.36-dev/include/php -I/nix/store/cs7yhhbml8l7zna37kq4nf147z9aivf3-php-8.3.36-dev/include/php/main -I/nix/store/cs7yhhbml8l7zna37kq4nf147z9aivf3-php-8.3.36-dev/include/php/TSRM -I/nix/store/cs7yhhbml8l7zna37kq4nf147z9aivf3-php-8.3.36-dev/include/php/Zend -I/nix/store/cs7yhhbml8l7zna37kq4nf147z9aivf3-php-8.3.36-dev/include/php/ext -I/nix/store/cs7yhhbml8l7zna37kq4nf147z9aivf3-php-8.3.36-dev/include/php/ext/date/lib -DHAVE_CONFIG_H -g -O2 -D_GNU_SOURCE -DZEND_COMPILE_DL_EXT=1 -c /build/php-8.3.36/ext/calendar/jewish.c -MMD -MF jewish.dep -MT jewish.lo -fPIC -DPIC -o .libs/jewish.o126 gcc -I. -I/build/php-8.3.36/ext/calendar -I/build/php-8.3.36/ext/calendar/include -I/build/php-8.3.36/ext/calendar/main -I/build/php-8.3.36/ext/calendar -I/nix/store/cs7yhhbml8l7zna37kq4nf147z9aivf3-php-8.3.36-dev/include/php -I/nix/store/cs7yhhbml8l7zna37kq4nf147z9aivf3-php-8.3.36-dev/include/php/main -I/nix/store/cs7yhhbml8l7zna37kq4nf147z9aivf3-php-8.3.36-dev/include/php/TSRM -I/nix/store/cs7yhhbml8l7zna37kq4nf147z9aivf3-php-8.3.36-dev/include/php/Zend -I/nix/store/cs7yhhbml8l7zna37kq4nf147z9aivf3-php-8.3.36-dev/include/php/ext -I/nix/store/cs7yhhbml8l7zna37kq4nf147z9aivf3-php-8.3.36-dev/include/php/ext/date/lib -DHAVE_CONFIG_H -g -O2 -D_GNU_SOURCE -DZEND_COMPILE_DL_EXT=1 -c /build/php-8.3.36/ext/calendar/gregor.c -MMD -MF gregor.dep -MT gregor.lo -fPIC -DPIC -o .libs/gregor.o127 gcc -I. -I/build/php-8.3.36/ext/calendar -I/build/php-8.3.36/ext/calendar/include -I/build/php-8.3.36/ext/calendar/main -I/build/php-8.3.36/ext/calendar -I/nix/store/cs7yhhbml8l7zna37kq4nf147z9aivf3-php-8.3.36-dev/include/php -I/nix/store/cs7yhhbml8l7zna37kq4nf147z9aivf3-php-8.3.36-dev/include/php/main -I/nix/store/cs7yhhbml8l7zna37kq4nf147z9aivf3-php-8.3.36-dev/include/php/TSRM -I/nix/store/cs7yhhbml8l7zna37kq4nf147z9aivf3-php-8.3.36-dev/include/php/Zend -I/nix/store/cs7yhhbml8l7zna37kq4nf147z9aivf3-php-8.3.36-dev/include/php/ext -I/nix/store/cs7yhhbml8l7zna37kq4nf147z9aivf3-php-8.3.36-dev/include/php/ext/date/lib -DHAVE_CONFIG_H -g -O2 -D_GNU_SOURCE -DZEND_COMPILE_DL_EXT=1 -c /build/php-8.3.36/ext/calendar/dow.c -MMD -MF dow.dep -MT dow.lo -fPIC -DPIC -o .libs/dow.o128 gcc -I. -I/build/php-8.3.36/ext/calendar -I/build/php-8.3.36/ext/calendar/include -I/build/php-8.3.36/ext/calendar/main -I/build/php-8.3.36/ext/calendar -I/nix/store/cs7yhhbml8l7zna37kq4nf147z9aivf3-php-8.3.36-dev/include/php -I/nix/store/cs7yhhbml8l7zna37kq4nf147z9aivf3-php-8.3.36-dev/include/php/main -I/nix/store/cs7yhhbml8l7zna37kq4nf147z9aivf3-php-8.3.36-dev/include/php/TSRM -I/nix/store/cs7yhhbml8l7zna37kq4nf147z9aivf3-php-8.3.36-dev/include/php/Zend -I/nix/store/cs7yhhbml8l7zna37kq4nf147z9aivf3-php-8.3.36-dev/include/php/ext -I/nix/store/cs7yhhbml8l7zna37kq4nf147z9aivf3-php-8.3.36-dev/include/php/ext/date/lib -DHAVE_CONFIG_H -g -O2 -D_GNU_SOURCE -DZEND_COMPILE_DL_EXT=1 -c /build/php-8.3.36/ext/calendar/cal_unix.c -MMD -MF cal_unix.dep -MT cal_unix.lo -fPIC -DPIC -o .libs/cal_unix.o129 gcc -I. -I/build/php-8.3.36/ext/calendar -I/build/php-8.3.36/ext/calendar/include -I/build/php-8.3.36/ext/calendar/main -I/build/php-8.3.36/ext/calendar -I/nix/store/cs7yhhbml8l7zna37kq4nf147z9aivf3-php-8.3.36-dev/include/php -I/nix/store/cs7yhhbml8l7zna37kq4nf147z9aivf3-php-8.3.36-dev/include/php/main -I/nix/store/cs7yhhbml8l7zna37kq4nf147z9aivf3-php-8.3.36-dev/include/php/TSRM -I/nix/store/cs7yhhbml8l7zna37kq4nf147z9aivf3-php-8.3.36-dev/include/php/Zend -I/nix/store/cs7yhhbml8l7zna37kq4nf147z9aivf3-php-8.3.36-dev/include/php/ext -I/nix/store/cs7yhhbml8l7zna37kq4nf147z9aivf3-php-8.3.36-dev/include/php/ext/date/lib -DHAVE_CONFIG_H -g -O2 -D_GNU_SOURCE -DZEND_COMPILE_DL_EXT=1 -c /build/php-8.3.36/ext/calendar/french.c -MMD -MF french.dep -MT french.lo -fPIC -DPIC -o .libs/french.o130 gcc -I. -I/build/php-8.3.36/ext/calendar -I/build/php-8.3.36/ext/calendar/include -I/build/php-8.3.36/ext/calendar/main -I/build/php-8.3.36/ext/calendar -I/nix/store/cs7yhhbml8l7zna37kq4nf147z9aivf3-php-8.3.36-dev/include/php -I/nix/store/cs7yhhbml8l7zna37kq4nf147z9aivf3-php-8.3.36-dev/include/php/main -I/nix/store/cs7yhhbml8l7zna37kq4nf147z9aivf3-php-8.3.36-dev/include/php/TSRM -I/nix/store/cs7yhhbml8l7zna37kq4nf147z9aivf3-php-8.3.36-dev/include/php/Zend -I/nix/store/cs7yhhbml8l7zna37kq4nf147z9aivf3-php-8.3.36-dev/include/php/ext -I/nix/store/cs7yhhbml8l7zna37kq4nf147z9aivf3-php-8.3.36-dev/include/php/ext/date/lib -DHAVE_CONFIG_H -g -O2 -D_GNU_SOURCE -DZEND_COMPILE_DL_EXT=1 -c /build/php-8.3.36/ext/calendar/calendar.c -MMD -MF calendar.dep -MT calendar.lo -fPIC -DPIC -o .libs/calendar.o131 gcc -I. -I/build/php-8.3.36/ext/calendar -I/build/php-8.3.36/ext/calendar/include -I/build/php-8.3.36/ext/calendar/main -I/build/php-8.3.36/ext/calendar -I/nix/store/cs7yhhbml8l7zna37kq4nf147z9aivf3-php-8.3.36-dev/include/php -I/nix/store/cs7yhhbml8l7zna37kq4nf147z9aivf3-php-8.3.36-dev/include/php/main -I/nix/store/cs7yhhbml8l7zna37kq4nf147z9aivf3-php-8.3.36-dev/include/php/TSRM -I/nix/store/cs7yhhbml8l7zna37kq4nf147z9aivf3-php-8.3.36-dev/include/php/Zend -I/nix/store/cs7yhhbml8l7zna37kq4nf147z9aivf3-php-8.3.36-dev/include/php/ext -I/nix/store/cs7yhhbml8l7zna37kq4nf147z9aivf3-php-8.3.36-dev/include/php/ext/date/lib -DHAVE_CONFIG_H -g -O2 -D_GNU_SOURCE -DZEND_COMPILE_DL_EXT=1 -c /build/php-8.3.36/ext/calendar/easter.c -MMD -MF easter.dep -MT easter.lo -fPIC -DPIC -o .libs/easter.o132/nix/store/nnm9gdr70ihc6zc9298mzz8jpcgaciql-bash-5.3p20/bin/bash /build/php-8.3.36/ext/calendar/libtool --tag=CC --mode=link gcc -shared -I/build/php-8.3.36/ext/calendar/include -I/build/php-8.3.36/ext/calendar/main -I/build/php-8.3.36/ext/calendar -I/nix/store/cs7yhhbml8l7zna37kq4nf147z9aivf3-php-8.3.36-dev/include/php -I/nix/store/cs7yhhbml8l7zna37kq4nf147z9aivf3-php-8.3.36-dev/include/php/main -I/nix/store/cs7yhhbml8l7zna37kq4nf147z9aivf3-php-8.3.36-dev/include/php/TSRM -I/nix/store/cs7yhhbml8l7zna37kq4nf147z9aivf3-php-8.3.36-dev/include/php/Zend -I/nix/store/cs7yhhbml8l7zna37kq4nf147z9aivf3-php-8.3.36-dev/include/php/ext -I/nix/store/cs7yhhbml8l7zna37kq4nf147z9aivf3-php-8.3.36-dev/include/php/ext/date/lib -DHAVE_CONFIG_H -g -O2 -D_GNU_SOURCE -o calendar.la -export-dynamic -avoid-version -prefer-pic -module -rpath /build/php-8.3.36/ext/calendar/modules calendar.lo dow.lo french.lo gregor.lo jewish.lo julian.lo easter.lo cal_unix.lo 133gcc -shared .libs/calendar.o .libs/dow.o .libs/french.o .libs/gregor.o .libs/jewish.o .libs/julian.o .libs/easter.o .libs/cal_unix.o -Wl,-soname -Wl,calendar.so -o .libs/calendar.so134creating calendar.la135(cd .libs && rm -f calendar.la && ln -s ../calendar.la calendar.la)136/nix/store/nnm9gdr70ihc6zc9298mzz8jpcgaciql-bash-5.3p20/bin/bash /build/php-8.3.36/ext/calendar/libtool --tag=CC --mode=install cp ./calendar.la /build/php-8.3.36/ext/calendar/modules137cp ./.libs/calendar.so /build/php-8.3.36/ext/calendar/modules/calendar.so138cp ./.libs/calendar.lai /build/php-8.3.36/ext/calendar/modules/calendar.la139PATH="$PATH:/sbin" ldconfig -n /build/php-8.3.36/ext/calendar/modules140----------------------------------------------------------------------141Libraries have been installed in:142 /build/php-8.3.36/ext/calendar/modules143144If you ever happen to want to link against installed libraries145in a given directory, LIBDIR, you must either use libtool, and146specify the full pathname of the library, or use the `-LLIBDIR'147flag during linking and do at least one of the following:148 - add LIBDIR to the `LD_LIBRARY_PATH' environment variable149 during execution150 - add LIBDIR to the `LD_RUN_PATH' environment variable151 during linking152 - use the `-Wl,--rpath -Wl,LIBDIR' linker flag153154See any operating system documentation about shared libraries for155more information, such as the ld(1) and ld.so(8) manual pages.156----------------------------------------------------------------------157158Build complete.159Don't forget to run 'make test'.160checkPhase
161162Build complete.163Don't forget to run 'make test'.164165166=====================================================================167PHP : /nix/store/wpnr7wiy682rqqbb0i58pn9n6lm9w1cl-php-8.3.36/bin/php 168PHP_SAPI : cli169PHP_VERSION : 8.3.36170ZEND_VERSION: 4.3.36171PHP_OS : Linux - Linux localhost 6.11.0 #1-NixOS SMP PREEMPT_DYNAMIC Mon Aug 24 01:44:40 UTC 2026 x86_64172INI actual : /build/php-8.3.36/ext/calendar/tmp-php.ini173More .INIs : 174---------------------------------------------------------------------175PHP : /nix/store/wpnr7wiy682rqqbb0i58pn9n6lm9w1cl-php-8.3.36/bin/php-cgi 176PHP_SAPI : cgi-fcgi177PHP_VERSION : 8.3.36178ZEND_VERSION: 4.3.36179PHP_OS : Linux - Linux localhost 6.11.0 #1-NixOS SMP PREEMPT_DYNAMIC Mon Aug 24 01:44:40 UTC 2026 x86_64180INI actual : /build/php-8.3.36/ext/calendar/tmp-php.ini181More .INIs : 182--------------------------------------------------------------------- 183---------------------------------------------------------------------184PHP : /nix/store/wpnr7wiy682rqqbb0i58pn9n6lm9w1cl-php-8.3.36/bin/phpdbg 185PHP_SAPI : phpdbg186PHP_VERSION : 8.3.36187ZEND_VERSION: 4.3.36188PHP_OS : Linux - Linux localhost 6.11.0 #1-NixOS SMP PREEMPT_DYNAMIC Mon Aug 24 01:44:40 UTC 2026 x86_64189INI actual : /build/php-8.3.36/ext/calendar/tmp-php.ini190More .INIs : 191---------------------------------------------------------------------192CWD : /build/php-8.3.36/ext/calendar193Extra dirs : 194VALGRIND : Not used195=====================================================================196TIME START 2026-10-21 19:57:56197=====================================================================198PASS Bug #52744 (cal_days_in_month incorrect for December 1 BCE) [tests/bug52744.phpt] 199SKIP Bug #53574 (Integer overflow in SdnToJulian; leads to segfault) [tests/bug53574_1.phpt] reason: this test is for 32bit platform only200PASS Bug #53574 (Integer overflow in SdnToJulian; leads to segfault) [tests/bug53574_2.phpt] 201PASS Bug #54254 (cal_days_in_month incompatible with jdtojewish in non-leap-years) [tests/bug54254.phpt] 202SKIP Bug #55797: Integer overflow in SdnToGregorian leads to segfault (in optimized builds) [tests/bug55797_1.phpt] reason: this test is for 32bit platform only203PASS Bug #55797: Integer overflow in SdnToGregorian leads to segfault (in optimized builds) [tests/bug55797_2.phpt] 204PASS Bug #67976 (cal_days_month() fails for final month of the French calendar) [tests/bug67976.phpt] 205PASS Bug #71894 (AddressSanitizer: global-buffer-overflow in zif_cal_from_jd) [tests/bug71894.phpt] 206PASS Bug #80185 (jdtounix() fails after 2037) [tests/bug80185.phpt] 207SKIP Bug #80185 (jdtounix() fails after 2037) [tests/bug80185_32bit.phpt] reason: for 32bit platforms only208PASS cal_days_in_month() [tests/cal_days_in_month.phpt] 209PASS Test cal_days_in_month() function : error conditions [tests/cal_days_in_month_error1.phpt] 210PASS cal_from_jd() [tests/cal_from_jd.phpt] 211PASS Test cal_from_jd() function : error conditions [tests/cal_from_jd_error1.phpt] 212PASS cal_info() [tests/cal_info.phpt] 213PASS cal_to_jd() [tests/cal_to_jd.phpt] 214PASS Test cal_to_jd() function : error conditions [tests/cal_to_jd_error1.phpt] 215SKIP Test easter_date() on 32bit systems [tests/easter_date_32bit.phpt] reason: 32-bit only216PASS Test easter_date() on 64bit systems [tests/easter_date_64bit.phpt] 217SKIP Test easter_date() on 32bit systems checks the upper year limit [tests/easter_date_checks_upper_bound_32bit.phpt] reason: 32-bit only218PASS Test easter_date() on 64bit systems checks the upper year limit [tests/easter_date_checks_upper_bound_64bit.phpt] 219PASS easter_days() [tests/easter_days.phpt] 220PASS frenchtojd() [tests/frenchtojd.phpt] 221PASS GH-16228 (easter_days, Overflow on year argument) [tests/gh16228.phpt] 222PASS GH-16231 (jdtounix argument overflow) [tests/gh16231.phpt] 223PASS GH-16234 jewishtojd overflow on year argument [tests/gh16234.phpt] 224PASS GH-16234 jewishtojd overflow on year argument [tests/gh16234_2.phpt] 225PASS GH-16234 jewishtojd overflow on year argument [tests/gh16234_2_64.phpt] 226PASS GH-16235 (jdtogregorian overflow on argument) [tests/gh16235.phpt] 227PASS GH-16258 (jddayofweek overflow on argument) [tests/gh16258.phpt] 228PASS GH-16834 (cal_from_jd from julian_day argument) [tests/gh16834.phpt] 229PASS GH-19371 (integer overflow in calendar.c) [tests/gh19371.phpt] 230PASS gregoriantojd() [tests/gregoriantojd.phpt] 231PASS gregoriantojd() [tests/gregoriantojd_overflow.phpt] 232PASS jddayofweek() [tests/jddayofweek.phpt] 233PASS jdmonthname() [tests/jdmonthname.phpt] 234PASS jdtofrench() [tests/jdtofrench.phpt] 235PASS jdtogregorian() [tests/jdtogregorian.phpt] 236SKIP jdtogregorian(): test overflow [tests/jdtogregorian_overflow.phpt] reason: this test is for 32bit platforms only237PASS jdtojewish() function [tests/jdtojewish.phpt] 238PASS Bug #64895: Integer overflow in SndToJewish [tests/jdtojewish64.phpt] 239PASS Test all hebrew month names [tests/jdtojewish_hebrew.phpt] 240PASS jdtojewish(): test overflow [tests/jdtojewish_overflow.phpt] 241PASS jdtojulian() [tests/jdtojulian.phpt] 242PASS jdtomonthname() test [tests/jdtomonthname.phpt] 243PASS jdtounix() [tests/jdtounix.phpt] 244PASS Test jdtounix() function : error conditions [tests/jdtounix_error1.phpt] 245PASS jewishtojd() [tests/jewishtojd.phpt] 246PASS juliantojd() [tests/juliantojd.phpt] 247PASS juliantojd() [tests/juliantojd_overflow.phpt] 248PASS unixtojd() [tests/unixtojd.phpt] 249PASS Test unixtojd() function : error conditions [tests/unixtojd_error1.phpt] 250=====================================================================251TIME END 2026-10-21 19:57:57252253=====================================================================254TEST RESULT SUMMARY255---------------------------------------------------------------------256Exts skipped : 0257Exts tested : 12258---------------------------------------------------------------------259260Number of tests : 52 46261Tests skipped : 6 ( 11.5%) --------262Tests warned : 0 ( 0.0%) ( 0.0%)263Tests failed : 0 ( 0.0%) ( 0.0%)264Tests passed : 46 ( 88.5%) (100.0%)265---------------------------------------------------------------------266Time taken : 1 seconds267=====================================================================fixupPhase
268shrinking RPATHs of ELF executables and libraries in /nix/store/sjbwj10bmbwdd6hhvdgbnlqhdvynkq5y-php-calendar-8.3.36269shrinking /nix/store/sjbwj10bmbwdd6hhvdgbnlqhdvynkq5y-php-calendar-8.3.36/lib/php/extensions/calendar.so270checking for references to /build/ in /nix/store/sjbwj10bmbwdd6hhvdgbnlqhdvynkq5y-php-calendar-8.3.36...271patching script interpreter paths in /nix/store/sjbwj10bmbwdd6hhvdgbnlqhdvynkq5y-php-calendar-8.3.36272stripping (with command strip and flags -S -p) in /nix/store/sjbwj10bmbwdd6hhvdgbnlqhdvynkq5y-php-calendar-8.3.36/lib273shrinking RPATHs of ELF executables and libraries in /nix/store/p45pkla01pa7q126cv8dwaj9q017n16n-php-calendar-8.3.36-dev274checking for references to /build/ in /nix/store/p45pkla01pa7q126cv8dwaj9q017n16n-php-calendar-8.3.36-dev...275patching script interpreter paths in /nix/store/p45pkla01pa7q126cv8dwaj9q017n16n-php-calendar-8.3.36-dev