nixbot

builds

failed harmonia-clippy-3.2.0 checks.aarch64-darwin.clippy · build #493 · raw

unpackPhase
1unpacking source archive /nix/store/g4l0a50pcx4z2lqx76lxz2mns9lkwca5-source2source root is source
patchPhase
3Executing configureCargoCommonVars4decompressing cargo artifacts from /nix/store/pkivcad5a2fcfa8imf131apk4k5asdvc-harmonia-deps-3.2.0/target.tar.zst to target
configurePhase
5will append /nix/var/nix/builds/nix-70047-3171544707/source/.cargo-home/config.toml with contents of /nix/store/rry4y47m7wzb4mz24xd9irn7bs8hlm2v-vendor-cargo-deps/config.toml6default configurePhase, nothing to do
buildPhase
7+++ command cargo --version8cargo 1.97.0 (c980f4866 2026-06-30)9+++ command cargo clippy --release --locked --all-targets --all-features -- -D warnings10 Checking harmonia-utils-base-encoding v0.0.0-alpha.0 (/nix/var/nix/builds/nix-70047-3171544707/source/harmonia-utils-base-encoding)11 Checking harmonia-utils-test v0.0.0-alpha.0 (/nix/var/nix/builds/nix-70047-3171544707/source/harmonia-utils-test)12 Checking harmonia-file-core v3.2.0 (/nix/var/nix/builds/nix-70047-3171544707/source/harmonia-file-core)13 Compiling harmonia-protocol-derive v3.2.0 (/nix/var/nix/builds/nix-70047-3171544707/source/harmonia-protocol-derive)14 Checking harmonia-ssh-store v3.2.0 (/nix/var/nix/builds/nix-70047-3171544707/source/harmonia-ssh-store)15 Checking harmonia-client v3.2.0 (/nix/var/nix/builds/nix-70047-3171544707/source/harmonia-client)16 Checking harmonia-utils-hash v0.0.0-alpha.0 (/nix/var/nix/builds/nix-70047-3171544707/source/harmonia-utils-hash)17 Checking harmonia-utils-signature v3.2.0 (/nix/var/nix/builds/nix-70047-3171544707/source/harmonia-utils-signature)18 Checking harmonia-store-path v3.2.0 (/nix/var/nix/builds/nix-70047-3171544707/source/harmonia-store-path)19 Checking harmonia-utils-io v0.0.0-alpha.0 (/nix/var/nix/builds/nix-70047-3171544707/source/harmonia-utils-io)20 Checking harmonia-store-content-address v3.2.0 (/nix/var/nix/builds/nix-70047-3171544707/source/harmonia-store-content-address)21 Checking harmonia-store-fs v3.2.0 (/nix/var/nix/builds/nix-70047-3171544707/source/harmonia-store-fs)22 Checking harmonia-store-ref-scan v0.0.0-alpha.0 (/nix/var/nix/builds/nix-70047-3171544707/source/harmonia-store-ref-scan)23 Checking harmonia-bench v3.2.0 (/nix/var/nix/builds/nix-70047-3171544707/source/harmonia-bench)24 Checking harmonia-store-derivation v0.0.0-alpha.0 (/nix/var/nix/builds/nix-70047-3171544707/source/harmonia-store-derivation)25 Checking harmonia-store-path-info v3.2.0 (/nix/var/nix/builds/nix-70047-3171544707/source/harmonia-store-path-info)26 Checking harmonia-store-nar-info v3.2.0 (/nix/var/nix/builds/nix-70047-3171544707/source/harmonia-store-nar-info)27 Checking harmonia-store-db v3.2.0 (/nix/var/nix/builds/nix-70047-3171544707/source/harmonia-store-db)28 Checking harmonia-store-aterm v0.0.0-alpha.0 (/nix/var/nix/builds/nix-70047-3171544707/source/harmonia-store-aterm)29 Checking harmonia-store-build-result v3.2.0 (/nix/var/nix/builds/nix-70047-3171544707/source/harmonia-store-build-result)30 Checking harmonia-file-nar v3.2.0 (/nix/var/nix/builds/nix-70047-3171544707/source/harmonia-file-nar)31 Checking harmonia-store-gc v3.2.0 (/nix/var/nix/builds/nix-70047-3171544707/source/harmonia-store-gc)32 Checking harmonia-cache v3.2.0 (/nix/var/nix/builds/nix-70047-3171544707/source/harmonia-cache)33 Checking harmonia-protocol v3.2.0 (/nix/var/nix/builds/nix-70047-3171544707/source/harmonia-protocol)34error[E0599]: no associated function or constant named `open_async` found for struct `actix_files::NamedFile` in the current scope35 --> harmonia-cache/src/buildlog.rs:89:2636 |37 89 | let log = NamedFile::open_async(&build_log)38 | ^^^^^^^^^^ associated function or constant not found in `actix_files::NamedFile`39 |40note: if you're trying to build a new `actix_files::NamedFile` consider using one of the following associated functions:41 actix_files::NamedFile::from_file42 actix_files::NamedFile::open43 --> /nix/store/rry4y47m7wzb4mz24xd9irn7bs8hlm2v-vendor-cargo-deps/c19b7c6f923b580ac259164a89f2577984ad5ab09ee9d583b888f934adbbe8d0/actix-files-0.7.0/src/named.rs:181:544 |45181 | pub fn from_file<P: AsRef<Path>>(file: File, path: P) -> io::Result<NamedFile> {46 | ^^^^^^^^^^^^^^^^^^^^^^^^^^^^^^^^^^^^^^^^^^^^^^^^^^^^^^^^^^^^^^^^^^^^^^^^^^^^^^47...48214 | pub fn open<P: AsRef<Path>>(path: P) -> io::Result<NamedFile> {49 | ^^^^^^^^^^^^^^^^^^^^^^^^^^^^^^^^^^^^^^^^^^^^^^^^^^^^^^^^^^^^^5051 Checking harmonia-store-remote v3.2.0 (/nix/var/nix/builds/nix-70047-3171544707/source/harmonia-store-remote)52 Checking harmonia-daemon v3.2.0 (/nix/var/nix/builds/nix-70047-3171544707/source/harmonia-daemon)53error[E0599]: no associated function or constant named `open_async` found for struct `actix_files::NamedFile` in the current scope54 --> harmonia-cache/src/serve.rs:160:3455 |56160 | return Ok(NamedFile::open_async(&index_file)57 | ^^^^^^^^^^ associated function or constant not found in `actix_files::NamedFile`58 |59note: if you're trying to build a new `actix_files::NamedFile` consider using one of the following associated functions:60 actix_files::NamedFile::from_file61 actix_files::NamedFile::open62 --> /nix/store/rry4y47m7wzb4mz24xd9irn7bs8hlm2v-vendor-cargo-deps/c19b7c6f923b580ac259164a89f2577984ad5ab09ee9d583b888f934adbbe8d0/actix-files-0.7.0/src/named.rs:181:563 |64181 | pub fn from_file<P: AsRef<Path>>(file: File, path: P) -> io::Result<NamedFile> {65 | ^^^^^^^^^^^^^^^^^^^^^^^^^^^^^^^^^^^^^^^^^^^^^^^^^^^^^^^^^^^^^^^^^^^^^^^^^^^^^^66...67214 | pub fn open<P: AsRef<Path>>(path: P) -> io::Result<NamedFile> {68 | ^^^^^^^^^^^^^^^^^^^^^^^^^^^^^^^^^^^^^^^^^^^^^^^^^^^^^^^^^^^^^6970error[E0599]: no associated function or constant named `open_async` found for struct `actix_files::NamedFile` in the current scope71 --> harmonia-cache/src/serve.rs:174:2372 |73174 | Ok(NamedFile::open_async(&full_path)74 | ^^^^^^^^^^ associated function or constant not found in `actix_files::NamedFile`75 |76note: if you're trying to build a new `actix_files::NamedFile` consider using one of the following associated functions:77 actix_files::NamedFile::from_file78 actix_files::NamedFile::open79 --> /nix/store/rry4y47m7wzb4mz24xd9irn7bs8hlm2v-vendor-cargo-deps/c19b7c6f923b580ac259164a89f2577984ad5ab09ee9d583b888f934adbbe8d0/actix-files-0.7.0/src/named.rs:181:580 |81181 | pub fn from_file<P: AsRef<Path>>(file: File, path: P) -> io::Result<NamedFile> {82 | ^^^^^^^^^^^^^^^^^^^^^^^^^^^^^^^^^^^^^^^^^^^^^^^^^^^^^^^^^^^^^^^^^^^^^^^^^^^^^^83...84214 | pub fn open<P: AsRef<Path>>(path: P) -> io::Result<NamedFile> {85 | ^^^^^^^^^^^^^^^^^^^^^^^^^^^^^^^^^^^^^^^^^^^^^^^^^^^^^^^^^^^^^8687For more information about this error, try `rustc --explain E0599`.88error: could not compile `harmonia-cache` (bin "harmonia-cache") due to 3 previous errors89warning: build failed, waiting for other jobs to finish...90error: could not compile `harmonia-cache` (bin "harmonia-cache" test) due to 3 previous errors