harmonia-llvm-cov-3.2.0
checks.aarch64-darwin.tests
· build #493
· raw
unpackPhase
1unpacking source archive /nix/store/g4l0a50pcx4z2lqx76lxz2mns9lkwca5-source2source root is sourcepatchPhase
3Executing configureCargoCommonVars4decompressing cargo artifacts from /nix/store/rr9l7x4vzjxdazymnvqvwph77c51dlx0-harmonia-deps-3.2.0/target.tar.zst to targetconfigurePhase
5will append /nix/var/nix/builds/nix-63086-1250584807/source/.cargo-home/config.toml with contents of /nix/store/rry4y47m7wzb4mz24xd9irn7bs8hlm2v-vendor-cargo-deps/config.toml6default configurePhase, nothing to dobuildPhase
7+++ command cargo --version8cargo 1.97.0 (c980f4866 2026-06-30)9+++ command cargo build --workspace10 Compiling harmonia-utils-base-encoding v0.0.0-alpha.0 (/nix/var/nix/builds/nix-63086-1250584807/source/harmonia-utils-base-encoding)11 Compiling harmonia-file-core v3.2.0 (/nix/var/nix/builds/nix-63086-1250584807/source/harmonia-file-core)12 Compiling harmonia-protocol-derive v3.2.0 (/nix/var/nix/builds/nix-63086-1250584807/source/harmonia-protocol-derive)13 Compiling harmonia-client v3.2.0 (/nix/var/nix/builds/nix-63086-1250584807/source/harmonia-client)14 Compiling harmonia-ssh-store v3.2.0 (/nix/var/nix/builds/nix-63086-1250584807/source/harmonia-ssh-store)15 Compiling harmonia-utils-test v0.0.0-alpha.0 (/nix/var/nix/builds/nix-63086-1250584807/source/harmonia-utils-test)16 Compiling harmonia-utils-hash v0.0.0-alpha.0 (/nix/var/nix/builds/nix-63086-1250584807/source/harmonia-utils-hash)17 Compiling harmonia-utils-signature v3.2.0 (/nix/var/nix/builds/nix-63086-1250584807/source/harmonia-utils-signature)18 Compiling harmonia-store-path v3.2.0 (/nix/var/nix/builds/nix-63086-1250584807/source/harmonia-store-path)19 Compiling harmonia-utils-io v0.0.0-alpha.0 (/nix/var/nix/builds/nix-63086-1250584807/source/harmonia-utils-io)20 Compiling harmonia-store-content-address v3.2.0 (/nix/var/nix/builds/nix-63086-1250584807/source/harmonia-store-content-address)21 Compiling harmonia-store-fs v3.2.0 (/nix/var/nix/builds/nix-63086-1250584807/source/harmonia-store-fs)22 Compiling harmonia-store-ref-scan v0.0.0-alpha.0 (/nix/var/nix/builds/nix-63086-1250584807/source/harmonia-store-ref-scan)23 Compiling harmonia-store-derivation v0.0.0-alpha.0 (/nix/var/nix/builds/nix-63086-1250584807/source/harmonia-store-derivation)24 Compiling harmonia-store-path-info v3.2.0 (/nix/var/nix/builds/nix-63086-1250584807/source/harmonia-store-path-info)25 Compiling harmonia-file-nar v3.2.0 (/nix/var/nix/builds/nix-63086-1250584807/source/harmonia-file-nar)26 Compiling harmonia-store-nar-info v3.2.0 (/nix/var/nix/builds/nix-63086-1250584807/source/harmonia-store-nar-info)27 Compiling harmonia-store-db v3.2.0 (/nix/var/nix/builds/nix-63086-1250584807/source/harmonia-store-db)28 Compiling harmonia-store-aterm v0.0.0-alpha.0 (/nix/var/nix/builds/nix-63086-1250584807/source/harmonia-store-aterm)29 Compiling harmonia-store-build-result v3.2.0 (/nix/var/nix/builds/nix-63086-1250584807/source/harmonia-store-build-result)30 Compiling harmonia-store-gc v3.2.0 (/nix/var/nix/builds/nix-63086-1250584807/source/harmonia-store-gc)31 Compiling harmonia-protocol v3.2.0 (/nix/var/nix/builds/nix-63086-1250584807/source/harmonia-protocol)32 Compiling harmonia-cache v3.2.0 (/nix/var/nix/builds/nix-63086-1250584807/source/harmonia-cache)33error[E0599]: no associated function or constant named `open_async` found for struct `NamedFile` in the current scope34 --> harmonia-cache/src/buildlog.rs:89:2635 |36 89 | let log = NamedFile::open_async(&build_log)37 | ^^^^^^^^^^ associated function or constant not found in `NamedFile`38 |39note: if you're trying to build a new `NamedFile` consider using one of the following associated functions:40 NamedFile::from_file41 NamedFile::open42 --> /nix/store/rry4y47m7wzb4mz24xd9irn7bs8hlm2v-vendor-cargo-deps/c19b7c6f923b580ac259164a89f2577984ad5ab09ee9d583b888f934adbbe8d0/actix-files-0.7.0/src/named.rs:181:543 |44181 | pub fn from_file<P: AsRef<Path>>(file: File, path: P) -> io::Result<NamedFile> {45 | ^^^^^^^^^^^^^^^^^^^^^^^^^^^^^^^^^^^^^^^^^^^^^^^^^^^^^^^^^^^^^^^^^^^^^^^^^^^^^^46...47214 | pub fn open<P: AsRef<Path>>(path: P) -> io::Result<NamedFile> {48 | ^^^^^^^^^^^^^^^^^^^^^^^^^^^^^^^^^^^^^^^^^^^^^^^^^^^^^^^^^^^^^4950error[E0599]: no associated function or constant named `open_async` found for struct `NamedFile` in the current scope51 --> harmonia-cache/src/serve.rs:160:3452 |53160 | return Ok(NamedFile::open_async(&index_file)54 | ^^^^^^^^^^ associated function or constant not found in `NamedFile`55 |56note: if you're trying to build a new `NamedFile` consider using one of the following associated functions:57 NamedFile::from_file58 NamedFile::open59 --> /nix/store/rry4y47m7wzb4mz24xd9irn7bs8hlm2v-vendor-cargo-deps/c19b7c6f923b580ac259164a89f2577984ad5ab09ee9d583b888f934adbbe8d0/actix-files-0.7.0/src/named.rs:181:560 |61181 | pub fn from_file<P: AsRef<Path>>(file: File, path: P) -> io::Result<NamedFile> {62 | ^^^^^^^^^^^^^^^^^^^^^^^^^^^^^^^^^^^^^^^^^^^^^^^^^^^^^^^^^^^^^^^^^^^^^^^^^^^^^^63...64214 | pub fn open<P: AsRef<Path>>(path: P) -> io::Result<NamedFile> {65 | ^^^^^^^^^^^^^^^^^^^^^^^^^^^^^^^^^^^^^^^^^^^^^^^^^^^^^^^^^^^^^6667error[E0599]: no associated function or constant named `open_async` found for struct `NamedFile` in the current scope68 --> harmonia-cache/src/serve.rs:174:2369 |70174 | Ok(NamedFile::open_async(&full_path)71 | ^^^^^^^^^^ associated function or constant not found in `NamedFile`72 |73note: if you're trying to build a new `NamedFile` consider using one of the following associated functions:74 NamedFile::from_file75 NamedFile::open76 --> /nix/store/rry4y47m7wzb4mz24xd9irn7bs8hlm2v-vendor-cargo-deps/c19b7c6f923b580ac259164a89f2577984ad5ab09ee9d583b888f934adbbe8d0/actix-files-0.7.0/src/named.rs:181:577 |78181 | pub fn from_file<P: AsRef<Path>>(file: File, path: P) -> io::Result<NamedFile> {79 | ^^^^^^^^^^^^^^^^^^^^^^^^^^^^^^^^^^^^^^^^^^^^^^^^^^^^^^^^^^^^^^^^^^^^^^^^^^^^^^80...81214 | pub fn open<P: AsRef<Path>>(path: P) -> io::Result<NamedFile> {82 | ^^^^^^^^^^^^^^^^^^^^^^^^^^^^^^^^^^^^^^^^^^^^^^^^^^^^^^^^^^^^^8384For more information about this error, try `rustc --explain E0599`.85error: could not compile `harmonia-cache` (bin "harmonia-cache") due to 3 previous errors86warning: build failed, waiting for other jobs to finish...