harmonia-clippy-3.2.0
checks.aarch64-linux.clippy
· build #493
· raw
1tribuchet: building on eliza
unpackPhase
2unpacking source archive /nix/store/g4l0a50pcx4z2lqx76lxz2mns9lkwca5-source3source root is sourcepatchPhase
4Executing configureCargoCommonVars5decompressing cargo artifacts from /nix/store/x6ld2c4049qwdv2wsjhhgw4b1q6a2kh3-harmonia-deps-3.2.0/target.tar.zst to targetconfigurePhase
6will append /build/source/.cargo-home/config.toml with contents of /nix/store/25ydaax9rjabjjcvb3h12jfzpis09h51-vendor-cargo-deps/config.toml7default configurePhase, nothing to dobuildPhase
8+++ command cargo --version9cargo 1.97.0 (c980f4866 2026-06-30)10+++ command cargo clippy --release --locked --all-targets --all-features -- -D warnings11 Checking harmonia-utils-base-encoding v0.0.0-alpha.0 (/build/source/harmonia-utils-base-encoding)12 Checking harmonia-file-core v3.2.0 (/build/source/harmonia-file-core)13 Checking harmonia-utils-test v0.0.0-alpha.0 (/build/source/harmonia-utils-test)14 Compiling harmonia-protocol-derive v3.2.0 (/build/source/harmonia-protocol-derive)15 Checking harmonia-client v3.2.0 (/build/source/harmonia-client)16 Checking harmonia-ssh-store v3.2.0 (/build/source/harmonia-ssh-store)17 Checking harmonia-utils-hash v0.0.0-alpha.0 (/build/source/harmonia-utils-hash)18 Checking harmonia-utils-signature v3.2.0 (/build/source/harmonia-utils-signature)19 Checking harmonia-store-path v3.2.0 (/build/source/harmonia-store-path)20 Checking harmonia-utils-io v0.0.0-alpha.0 (/build/source/harmonia-utils-io)21 Checking harmonia-store-content-address v3.2.0 (/build/source/harmonia-store-content-address)22 Checking harmonia-store-fs v3.2.0 (/build/source/harmonia-store-fs)23 Checking harmonia-store-ref-scan v0.0.0-alpha.0 (/build/source/harmonia-store-ref-scan)24 Checking harmonia-file-nar v3.2.0 (/build/source/harmonia-file-nar)25 Checking harmonia-bench v3.2.0 (/build/source/harmonia-bench)26 Checking harmonia-store-derivation v0.0.0-alpha.0 (/build/source/harmonia-store-derivation)27 Checking harmonia-store-path-info v3.2.0 (/build/source/harmonia-store-path-info)28 Checking harmonia-store-nar-info v3.2.0 (/build/source/harmonia-store-nar-info)29 Checking harmonia-store-db v3.2.0 (/build/source/harmonia-store-db)30 Checking harmonia-store-aterm v0.0.0-alpha.0 (/build/source/harmonia-store-aterm)31 Checking harmonia-store-build-result v3.2.0 (/build/source/harmonia-store-build-result)32 Checking harmonia-store-gc v3.2.0 (/build/source/harmonia-store-gc)33 Checking harmonia-protocol v3.2.0 (/build/source/harmonia-protocol)34 Checking harmonia-cache v3.2.0 (/build/source/harmonia-cache)35error[E0599]: no associated function or constant named `open_async` found for struct `actix_files::NamedFile` in the current scope36 --> harmonia-cache/src/buildlog.rs:89:2637 |38 89 | let log = NamedFile::open_async(&build_log)39 | ^^^^^^^^^^ associated function or constant not found in `actix_files::NamedFile`40 |41note: if you're trying to build a new `actix_files::NamedFile` consider using one of the following associated functions:42 actix_files::NamedFile::from_file43 actix_files::NamedFile::open44 --> /nix/store/25ydaax9rjabjjcvb3h12jfzpis09h51-vendor-cargo-deps/c19b7c6f923b580ac259164a89f2577984ad5ab09ee9d583b888f934adbbe8d0/actix-files-0.7.0/src/named.rs:181:545 |46181 | pub fn from_file<P: AsRef<Path>>(file: File, path: P) -> io::Result<NamedFile> {47 | ^^^^^^^^^^^^^^^^^^^^^^^^^^^^^^^^^^^^^^^^^^^^^^^^^^^^^^^^^^^^^^^^^^^^^^^^^^^^^^48...49214 | pub fn open<P: AsRef<Path>>(path: P) -> io::Result<NamedFile> {50 | ^^^^^^^^^^^^^^^^^^^^^^^^^^^^^^^^^^^^^^^^^^^^^^^^^^^^^^^^^^^^^5152error[E0599]: no associated function or constant named `open_async` found for struct `actix_files::NamedFile` in the current scope53 --> harmonia-cache/src/serve.rs:160:3454 |55160 | return Ok(NamedFile::open_async(&index_file)56 | ^^^^^^^^^^ associated function or constant not found in `actix_files::NamedFile`57 |58note: if you're trying to build a new `actix_files::NamedFile` consider using one of the following associated functions:59 actix_files::NamedFile::from_file60 actix_files::NamedFile::open61 --> /nix/store/25ydaax9rjabjjcvb3h12jfzpis09h51-vendor-cargo-deps/c19b7c6f923b580ac259164a89f2577984ad5ab09ee9d583b888f934adbbe8d0/actix-files-0.7.0/src/named.rs:181:562 |63181 | pub fn from_file<P: AsRef<Path>>(file: File, path: P) -> io::Result<NamedFile> {64 | ^^^^^^^^^^^^^^^^^^^^^^^^^^^^^^^^^^^^^^^^^^^^^^^^^^^^^^^^^^^^^^^^^^^^^^^^^^^^^^65...66214 | pub fn open<P: AsRef<Path>>(path: P) -> io::Result<NamedFile> {67 | ^^^^^^^^^^^^^^^^^^^^^^^^^^^^^^^^^^^^^^^^^^^^^^^^^^^^^^^^^^^^^6869error[E0599]: no associated function or constant named `open_async` found for struct `actix_files::NamedFile` in the current scope70 --> harmonia-cache/src/serve.rs:174:2371 |72174 | Ok(NamedFile::open_async(&full_path)73 | ^^^^^^^^^^ associated function or constant not found in `actix_files::NamedFile`74 |75note: if you're trying to build a new `actix_files::NamedFile` consider using one of the following associated functions:76 actix_files::NamedFile::from_file77 actix_files::NamedFile::open78 --> /nix/store/25ydaax9rjabjjcvb3h12jfzpis09h51-vendor-cargo-deps/c19b7c6f923b580ac259164a89f2577984ad5ab09ee9d583b888f934adbbe8d0/actix-files-0.7.0/src/named.rs:181:579 |80181 | pub fn from_file<P: AsRef<Path>>(file: File, path: P) -> io::Result<NamedFile> {81 | ^^^^^^^^^^^^^^^^^^^^^^^^^^^^^^^^^^^^^^^^^^^^^^^^^^^^^^^^^^^^^^^^^^^^^^^^^^^^^^82...83214 | pub fn open<P: AsRef<Path>>(path: P) -> io::Result<NamedFile> {84 | ^^^^^^^^^^^^^^^^^^^^^^^^^^^^^^^^^^^^^^^^^^^^^^^^^^^^^^^^^^^^^8586For more information about this error, try `rustc --explain E0599`.87error: could not compile `harmonia-cache` (bin "harmonia-cache") due to 3 previous errors88warning: build failed, waiting for other jobs to finish...89error: could not compile `harmonia-cache` (bin "harmonia-cache" test) due to 3 previous errors