harmonia-3.2.0
checks.aarch64-linux.package-default
· build #493
· raw
1tribuchet: building on eliza
unpackPhase
2unpacking source archive /nix/store/g4l0a50pcx4z2lqx76lxz2mns9lkwca5-source3source root is sourcepatchPhase
4Executing configureCargoCommonVars5decompressing cargo artifacts from /nix/store/x6ld2c4049qwdv2wsjhhgw4b1q6a2kh3-harmonia-deps-3.2.0/target.tar.zst to targetconfigurePhase
6will append /build/source/.cargo-home/config.toml with contents of /nix/store/25ydaax9rjabjjcvb3h12jfzpis09h51-vendor-cargo-deps/config.toml7default configurePhase, nothing to dobuildPhase
8+++ command cargo --version9cargo 1.97.0 (c980f4866 2026-06-30)10+++ command cargo build --release --message-format json-render-diagnostics --locked11 Compiling harmonia-utils-base-encoding v0.0.0-alpha.0 (/build/source/harmonia-utils-base-encoding)12 Compiling harmonia-file-core v3.2.0 (/build/source/harmonia-file-core)13 Compiling harmonia-protocol-derive v3.2.0 (/build/source/harmonia-protocol-derive)14 Compiling harmonia-client v3.2.0 (/build/source/harmonia-client)15 Compiling harmonia-ssh-store v3.2.0 (/build/source/harmonia-ssh-store)16 Compiling harmonia-utils-test v0.0.0-alpha.0 (/build/source/harmonia-utils-test)17 Compiling harmonia-utils-hash v0.0.0-alpha.0 (/build/source/harmonia-utils-hash)18 Compiling harmonia-utils-signature v3.2.0 (/build/source/harmonia-utils-signature)19 Compiling harmonia-store-path v3.2.0 (/build/source/harmonia-store-path)20 Compiling harmonia-utils-io v0.0.0-alpha.0 (/build/source/harmonia-utils-io)21 Compiling harmonia-store-content-address v3.2.0 (/build/source/harmonia-store-content-address)22 Compiling harmonia-store-fs v3.2.0 (/build/source/harmonia-store-fs)23 Compiling harmonia-store-ref-scan v0.0.0-alpha.0 (/build/source/harmonia-store-ref-scan)24 Compiling harmonia-file-nar v3.2.0 (/build/source/harmonia-file-nar)25 Compiling harmonia-store-derivation v0.0.0-alpha.0 (/build/source/harmonia-store-derivation)26 Compiling harmonia-store-path-info v3.2.0 (/build/source/harmonia-store-path-info)27 Compiling harmonia-store-nar-info v3.2.0 (/build/source/harmonia-store-nar-info)28 Compiling harmonia-store-db v3.2.0 (/build/source/harmonia-store-db)29 Compiling harmonia-store-aterm v0.0.0-alpha.0 (/build/source/harmonia-store-aterm)30 Compiling harmonia-store-build-result v3.2.0 (/build/source/harmonia-store-build-result)31 Compiling harmonia-protocol v3.2.0 (/build/source/harmonia-protocol)32 Compiling harmonia-store-gc v3.2.0 (/build/source/harmonia-store-gc)33 Compiling harmonia-cache v3.2.0 (/build/source/harmonia-cache)34error[E0599]: no associated function or constant named `open_async` found for struct `NamedFile` in the current scope35 --> harmonia-cache/src/buildlog.rs:89:2636 |37 89 | let log = NamedFile::open_async(&build_log)38 | ^^^^^^^^^^ associated function or constant not found in `NamedFile`39 |40note: if you're trying to build a new `NamedFile` consider using one of the following associated functions:41 NamedFile::from_file42 NamedFile::open43 --> /nix/store/25ydaax9rjabjjcvb3h12jfzpis09h51-vendor-cargo-deps/c19b7c6f923b580ac259164a89f2577984ad5ab09ee9d583b888f934adbbe8d0/actix-files-0.7.0/src/named.rs:181:544 |45181 | pub fn from_file<P: AsRef<Path>>(file: File, path: P) -> io::Result<NamedFile> {46 | ^^^^^^^^^^^^^^^^^^^^^^^^^^^^^^^^^^^^^^^^^^^^^^^^^^^^^^^^^^^^^^^^^^^^^^^^^^^^^^47...48214 | pub fn open<P: AsRef<Path>>(path: P) -> io::Result<NamedFile> {49 | ^^^^^^^^^^^^^^^^^^^^^^^^^^^^^^^^^^^^^^^^^^^^^^^^^^^^^^^^^^^^^5051error[E0599]: no associated function or constant named `open_async` found for struct `NamedFile` in the current scope52 --> harmonia-cache/src/serve.rs:160:3453 |54160 | return Ok(NamedFile::open_async(&index_file)55 | ^^^^^^^^^^ associated function or constant not found in `NamedFile`56 |57note: if you're trying to build a new `NamedFile` consider using one of the following associated functions:58 NamedFile::from_file59 NamedFile::open60 --> /nix/store/25ydaax9rjabjjcvb3h12jfzpis09h51-vendor-cargo-deps/c19b7c6f923b580ac259164a89f2577984ad5ab09ee9d583b888f934adbbe8d0/actix-files-0.7.0/src/named.rs:181:561 |62181 | pub fn from_file<P: AsRef<Path>>(file: File, path: P) -> io::Result<NamedFile> {63 | ^^^^^^^^^^^^^^^^^^^^^^^^^^^^^^^^^^^^^^^^^^^^^^^^^^^^^^^^^^^^^^^^^^^^^^^^^^^^^^64...65214 | pub fn open<P: AsRef<Path>>(path: P) -> io::Result<NamedFile> {66 | ^^^^^^^^^^^^^^^^^^^^^^^^^^^^^^^^^^^^^^^^^^^^^^^^^^^^^^^^^^^^^6768error[E0599]: no associated function or constant named `open_async` found for struct `NamedFile` in the current scope69 --> harmonia-cache/src/serve.rs:174:2370 |71174 | Ok(NamedFile::open_async(&full_path)72 | ^^^^^^^^^^ associated function or constant not found in `NamedFile`73 |74note: if you're trying to build a new `NamedFile` consider using one of the following associated functions:75 NamedFile::from_file76 NamedFile::open77 --> /nix/store/25ydaax9rjabjjcvb3h12jfzpis09h51-vendor-cargo-deps/c19b7c6f923b580ac259164a89f2577984ad5ab09ee9d583b888f934adbbe8d0/actix-files-0.7.0/src/named.rs:181:578 |79181 | pub fn from_file<P: AsRef<Path>>(file: File, path: P) -> io::Result<NamedFile> {80 | ^^^^^^^^^^^^^^^^^^^^^^^^^^^^^^^^^^^^^^^^^^^^^^^^^^^^^^^^^^^^^^^^^^^^^^^^^^^^^^81...82214 | pub fn open<P: AsRef<Path>>(path: P) -> io::Result<NamedFile> {83 | ^^^^^^^^^^^^^^^^^^^^^^^^^^^^^^^^^^^^^^^^^^^^^^^^^^^^^^^^^^^^^8485For more information about this error, try `rustc --explain E0599`.86error: could not compile `harmonia-cache` (bin "harmonia-cache") due to 3 previous errors87warning: build failed, waiting for other jobs to finish...