nixbot

builds

failed harmonia-llvm-cov-3.3.0 checks.aarch64-darwin.tests · build #568 · raw

1tribuchet: building on mac02
unpackPhase
2unpacking source archive /nix/store/5rfbjixxwyqpxcxnscrmbd2p5wjsadfi-source3source root is source
patchPhase
4Executing configureCargoCommonVars5decompressing cargo artifacts from /nix/store/50pxkjn65mncysq0f9n6jcd2bwmf7xsb-harmonia-deps-3.3.0/target.tar.zst to target
configurePhase
6will append /private/var/lib/tribuchet/a5/scratch/01f36b367d8f3bdd/build/source/.cargo-home/config.toml with contents of /nix/store/j43lravs1ndjdm0ciaky607mc3rq0a9v-vendor-cargo-deps/config.toml7default configurePhase, nothing to do
buildPhase
8+++ command cargo --version9cargo 1.98.0 (797e8a9bc 2026-08-05)10+++ command cargo build --workspace11 Compiling harmonia-utils-base-encoding v0.0.0-alpha.0 (/private/var/lib/tribuchet/a5/scratch/01f36b367d8f3bdd/build/source/harmonia-utils-base-encoding)12 Compiling harmonia-file-core v3.3.0 (/private/var/lib/tribuchet/a5/scratch/01f36b367d8f3bdd/build/source/harmonia-file-core)13 Compiling harmonia-protocol-derive v3.3.0 (/private/var/lib/tribuchet/a5/scratch/01f36b367d8f3bdd/build/source/harmonia-protocol-derive)14 Compiling harmonia-ssh-store v3.3.0 (/private/var/lib/tribuchet/a5/scratch/01f36b367d8f3bdd/build/source/harmonia-ssh-store)15 Compiling harmonia-client v3.3.0 (/private/var/lib/tribuchet/a5/scratch/01f36b367d8f3bdd/build/source/harmonia-client)16 Compiling harmonia-bench v3.3.0 (/private/var/lib/tribuchet/a5/scratch/01f36b367d8f3bdd/build/source/harmonia-bench)17 Compiling harmonia-utils-test v0.0.0-alpha.0 (/private/var/lib/tribuchet/a5/scratch/01f36b367d8f3bdd/build/source/harmonia-utils-test)18 Compiling harmonia-utils-hash v0.0.0-alpha.0 (/private/var/lib/tribuchet/a5/scratch/01f36b367d8f3bdd/build/source/harmonia-utils-hash)19 Compiling harmonia-utils-signature v3.3.0 (/private/var/lib/tribuchet/a5/scratch/01f36b367d8f3bdd/build/source/harmonia-utils-signature)20 Compiling harmonia-store-path v3.3.0 (/private/var/lib/tribuchet/a5/scratch/01f36b367d8f3bdd/build/source/harmonia-store-path)21 Compiling harmonia-utils-io v0.0.0-alpha.0 (/private/var/lib/tribuchet/a5/scratch/01f36b367d8f3bdd/build/source/harmonia-utils-io)22 Compiling harmonia-store-content-address v3.3.0 (/private/var/lib/tribuchet/a5/scratch/01f36b367d8f3bdd/build/source/harmonia-store-content-address)23 Compiling harmonia-store-fs v3.3.0 (/private/var/lib/tribuchet/a5/scratch/01f36b367d8f3bdd/build/source/harmonia-store-fs)24 Compiling harmonia-store-ref-scan v0.0.0-alpha.0 (/private/var/lib/tribuchet/a5/scratch/01f36b367d8f3bdd/build/source/harmonia-store-ref-scan)25 Compiling harmonia-store-derivation v0.0.0-alpha.0 (/private/var/lib/tribuchet/a5/scratch/01f36b367d8f3bdd/build/source/harmonia-store-derivation)26 Compiling harmonia-store-path-info v3.3.0 (/private/var/lib/tribuchet/a5/scratch/01f36b367d8f3bdd/build/source/harmonia-store-path-info)27 Compiling harmonia-file-nar v3.3.0 (/private/var/lib/tribuchet/a5/scratch/01f36b367d8f3bdd/build/source/harmonia-file-nar)28 Compiling harmonia-store-nar-info v3.3.0 (/private/var/lib/tribuchet/a5/scratch/01f36b367d8f3bdd/build/source/harmonia-store-nar-info)29 Compiling harmonia-store-db v3.3.0 (/private/var/lib/tribuchet/a5/scratch/01f36b367d8f3bdd/build/source/harmonia-store-db)30 Compiling harmonia-store-build-result v3.3.0 (/private/var/lib/tribuchet/a5/scratch/01f36b367d8f3bdd/build/source/harmonia-store-build-result)31 Compiling harmonia-store-aterm v0.0.0-alpha.0 (/private/var/lib/tribuchet/a5/scratch/01f36b367d8f3bdd/build/source/harmonia-store-aterm)32 Compiling harmonia-store-gc v3.3.0 (/private/var/lib/tribuchet/a5/scratch/01f36b367d8f3bdd/build/source/harmonia-store-gc)33 Compiling harmonia-protocol v3.3.0 (/private/var/lib/tribuchet/a5/scratch/01f36b367d8f3bdd/build/source/harmonia-protocol)34 Compiling harmonia-cache v3.3.0 (/private/var/lib/tribuchet/a5/scratch/01f36b367d8f3bdd/build/source/harmonia-cache)35 Compiling harmonia-daemon v3.3.0 (/private/var/lib/tribuchet/a5/scratch/01f36b367d8f3bdd/build/source/harmonia-daemon)36 Compiling harmonia-store-remote v3.3.0 (/private/var/lib/tribuchet/a5/scratch/01f36b367d8f3bdd/build/source/harmonia-store-remote)37 Finished `dev` profile [unoptimized + debuginfo] target(s) in 14.20s38+++ command cargo nextest run --workspace39 Compiling harmonia-utils-test v0.0.0-alpha.0 (/private/var/lib/tribuchet/a5/scratch/01f36b367d8f3bdd/build/source/harmonia-utils-test)40 Compiling harmonia-utils-signature v3.3.0 (/private/var/lib/tribuchet/a5/scratch/01f36b367d8f3bdd/build/source/harmonia-utils-signature)41 Compiling harmonia-utils-hash v0.0.0-alpha.0 (/private/var/lib/tribuchet/a5/scratch/01f36b367d8f3bdd/build/source/harmonia-utils-hash)42 Compiling harmonia-protocol-derive v3.3.0 (/private/var/lib/tribuchet/a5/scratch/01f36b367d8f3bdd/build/source/harmonia-protocol-derive)43 Compiling harmonia-utils-base-encoding v0.0.0-alpha.0 (/private/var/lib/tribuchet/a5/scratch/01f36b367d8f3bdd/build/source/harmonia-utils-base-encoding)44 Compiling harmonia-ssh-store v3.3.0 (/private/var/lib/tribuchet/a5/scratch/01f36b367d8f3bdd/build/source/harmonia-ssh-store)45 Compiling harmonia-client v3.3.0 (/private/var/lib/tribuchet/a5/scratch/01f36b367d8f3bdd/build/source/harmonia-client)46 Compiling harmonia-bench v3.3.0 (/private/var/lib/tribuchet/a5/scratch/01f36b367d8f3bdd/build/source/harmonia-bench)47 Compiling harmonia-file-core v3.3.0 (/private/var/lib/tribuchet/a5/scratch/01f36b367d8f3bdd/build/source/harmonia-file-core)48 Compiling harmonia-store-path v3.3.0 (/private/var/lib/tribuchet/a5/scratch/01f36b367d8f3bdd/build/source/harmonia-store-path)49 Compiling harmonia-utils-io v0.0.0-alpha.0 (/private/var/lib/tribuchet/a5/scratch/01f36b367d8f3bdd/build/source/harmonia-utils-io)50 Compiling harmonia-store-content-address v3.3.0 (/private/var/lib/tribuchet/a5/scratch/01f36b367d8f3bdd/build/source/harmonia-store-content-address)51 Compiling harmonia-store-fs v3.3.0 (/private/var/lib/tribuchet/a5/scratch/01f36b367d8f3bdd/build/source/harmonia-store-fs)52 Compiling harmonia-store-ref-scan v0.0.0-alpha.0 (/private/var/lib/tribuchet/a5/scratch/01f36b367d8f3bdd/build/source/harmonia-store-ref-scan)53 Compiling harmonia-file-nar v3.3.0 (/private/var/lib/tribuchet/a5/scratch/01f36b367d8f3bdd/build/source/harmonia-file-nar)54 Compiling harmonia-store-derivation v0.0.0-alpha.0 (/private/var/lib/tribuchet/a5/scratch/01f36b367d8f3bdd/build/source/harmonia-store-derivation)55 Compiling harmonia-store-path-info v3.3.0 (/private/var/lib/tribuchet/a5/scratch/01f36b367d8f3bdd/build/source/harmonia-store-path-info)56 Compiling harmonia-store-nar-info v3.3.0 (/private/var/lib/tribuchet/a5/scratch/01f36b367d8f3bdd/build/source/harmonia-store-nar-info)57 Compiling harmonia-store-db v3.3.0 (/private/var/lib/tribuchet/a5/scratch/01f36b367d8f3bdd/build/source/harmonia-store-db)58 Compiling harmonia-store-aterm v0.0.0-alpha.0 (/private/var/lib/tribuchet/a5/scratch/01f36b367d8f3bdd/build/source/harmonia-store-aterm)59 Compiling harmonia-store-build-result v3.3.0 (/private/var/lib/tribuchet/a5/scratch/01f36b367d8f3bdd/build/source/harmonia-store-build-result)60 Compiling harmonia-protocol v3.3.0 (/private/var/lib/tribuchet/a5/scratch/01f36b367d8f3bdd/build/source/harmonia-protocol)61 Compiling harmonia-store-gc v3.3.0 (/private/var/lib/tribuchet/a5/scratch/01f36b367d8f3bdd/build/source/harmonia-store-gc)62 Compiling harmonia-cache v3.3.0 (/private/var/lib/tribuchet/a5/scratch/01f36b367d8f3bdd/build/source/harmonia-cache)63 Compiling harmonia-store-remote v3.3.0 (/private/var/lib/tribuchet/a5/scratch/01f36b367d8f3bdd/build/source/harmonia-store-remote)64 Compiling harmonia-daemon v3.3.0 (/private/var/lib/tribuchet/a5/scratch/01f36b367d8f3bdd/build/source/harmonia-daemon)65 Finished `test` profile [unoptimized + debuginfo] target(s) in 30.61s66────────────67 Nextest run ID 3b031ebb-b34e-43d4-87d2-55117d7de462 with nextest profile: default68 Starting 2457 tests across 56 binaries69 FAIL [ 0.026s] ( 1/2457) harmonia-cache::endpoints test_root_endpoint70 stdout ───7172 running 1 test73 test test_root_endpoint ... FAILED7475 failures:7677 failures:78 test_root_endpoint7980 test result: FAILED. 0 passed; 1 failed; 0 ignored; 0 measured; 2 filtered out; finished in 0.01s8182 stderr ───83 Error: "No available ports"8485 Cancelling due to test failure: 9 tests still running86 FAIL [ 0.033s] ( 2/2457) harmonia-cache::security_paths malformed_hash_is_4xx_not_5xx87 stdout ───8889 running 1 test90 test malformed_hash_is_4xx_not_5xx ... FAILED9192 failures:9394 failures:95 malformed_hash_is_4xx_not_5xx9697 test result: FAILED. 0 passed; 1 failed; 0 ignored; 0 measured; 0 filtered out; finished in 0.00s9899 stderr ───100 Error: "No available ports"101102 FAIL [ 0.033s] ( 3/2457) harmonia-cache::endpoints test_root_endpoint_with_signing_keys103 stdout ───104105 running 1 test106 test test_root_endpoint_with_signing_keys ... FAILED107108 failures:109110 failures:111 test_root_endpoint_with_signing_keys112113 test result: FAILED. 0 passed; 1 failed; 0 ignored; 0 measured; 2 filtered out; finished in 0.00s114115 stderr ───116 Error: "No available ports"117118 FAIL [ 0.033s] ( 4/2457) harmonia-cache::prometheus test_prometheus_metrics119 stdout ───120121 running 1 test122 test test_prometheus_metrics ... FAILED123124 failures:125126 failures:127 test_prometheus_metrics128129 test result: FAILED. 0 passed; 1 failed; 0 ignored; 0 measured; 0 filtered out; finished in 0.00s130131 stderr ───132 Error: "No available ports"133134 FAIL [ 0.033s] ( 5/2457) harmonia-cache::endpoints test_health_endpoint135 stdout ───136137 running 1 test138 test test_health_endpoint ... FAILED139140 failures:141142 failures:143 test_health_endpoint144145 test result: FAILED. 0 passed; 1 failed; 0 ignored; 0 measured; 2 filtered out; finished in 0.00s146147 stderr ───148 Error: "No available ports"149150 FAIL [ 0.033s] ( 6/2457) harmonia-cache::realisations test_build_trace_endpoint151 stdout ───152153 running 1 test154 test test_build_trace_endpoint ... FAILED155156 failures:157158 failures:159 test_build_trace_endpoint160161 test result: FAILED. 0 passed; 1 failed; 0 ignored; 0 measured; 0 filtered out; finished in 0.00s162163 stderr ───164 Error: "No available ports"165166 FAIL [ 0.334s] ( 7/2457) harmonia-cache::error_responses serve_missing_file_does_not_leak_fs_path167 stdout ───168169 running 1 test170 test serve_missing_file_does_not_leak_fs_path ... FAILED171172 failures:173174 failures:175 serve_missing_file_does_not_leak_fs_path176177 test result: FAILED. 0 passed; 1 failed; 0 ignored; 0 measured; 0 filtered out; finished in 0.30s178179 stderr ───180 Error: "no free port"181182 FAIL [ 0.335s] ( 8/2457) harmonia-cache::retry test_download_retry_over_flaky_connection183 stdout ───184185 running 1 test186 test test_download_retry_over_flaky_connection ... FAILED187188 failures:189190 failures:191 test_download_retry_over_flaky_connection192193 test result: FAILED. 0 passed; 1 failed; 0 ignored; 0 measured; 0 filtered out; finished in 0.31s194195 stderr ───196 Error: "No port"197198 FAIL [ 0.412s] ( 9/2457) harmonia-cache::chroot test_chroot199 stdout ───200201 running 1 test202 Added file to store: /private/var/lib/tribuchet/a5/scratch/01f36b367d8f3bdd/build/.tmpv1swej/guest/nix/store/c2wcn8vmgpph17fpryhvr186qr8s6xx9-my-file203 Added directory to store: /private/var/lib/tribuchet/a5/scratch/01f36b367d8f3bdd/build/.tmpv1swej/guest/nix/store/061mnkh021b86rsy4hvvafyblfm0a55m-my-dir204 test test_chroot ... FAILED205206 failures:207208 failures:209 test_chroot210211 test result: FAILED. 0 passed; 1 failed; 0 ignored; 0 measured; 0 filtered out; finished in 0.38s212213 stderr ───214 Error: "No available ports"215216 FAIL [ 0.775s] ( 10/2457) harmonia-cache::log test_build_log_endpoint217 stdout ───218219 running 1 test220 Built derivation: 0rhcryfyjg7yk1014c72ff5nzix8vaaq-test-log.drv221 Log found at: /private/var/lib/tribuchet/a5/scratch/01f36b367d8f3bdd/build/.tmpbVn4pm/var/log/nix/drvs/0r/hcryfyjg7yk1014c72ff5nzix8vaaq-test-log.drv.bz2222 test test_build_log_endpoint ... FAILED223224 failures:225226 failures:227 test_build_log_endpoint228229 test result: FAILED. 0 passed; 1 failed; 0 ignored; 0 measured; 0 filtered out; finished in 0.75s230231 stderr ───232 Error: "No available ports"233234────────────235 Summary [ 0.776s] 10/2457 tests run: 0 passed, 10 failed, 0 skipped236 FAIL [ 0.026s] ( 1/2457) harmonia-cache::endpoints test_root_endpoint237 FAIL [ 0.033s] ( 2/2457) harmonia-cache::security_paths malformed_hash_is_4xx_not_5xx238 FAIL [ 0.033s] ( 3/2457) harmonia-cache::endpoints test_root_endpoint_with_signing_keys239 FAIL [ 0.033s] ( 4/2457) harmonia-cache::prometheus test_prometheus_metrics240 FAIL [ 0.033s] ( 5/2457) harmonia-cache::endpoints test_health_endpoint241 FAIL [ 0.033s] ( 6/2457) harmonia-cache::realisations test_build_trace_endpoint242 FAIL [ 0.334s] ( 7/2457) harmonia-cache::error_responses serve_missing_file_does_not_leak_fs_path243 FAIL [ 0.335s] ( 8/2457) harmonia-cache::retry test_download_retry_over_flaky_connection244 FAIL [ 0.412s] ( 9/2457) harmonia-cache::chroot test_chroot245 FAIL [ 0.775s] ( 10/2457) harmonia-cache::log test_build_log_endpoint246warning: 2447/2457 tests were not run due to test failure (run with --no-fail-fast to run all tests, or run with --max-fail)247error: test run failed