nixbot

builds

failed harmonia-llvm-cov-3.3.0 checks.aarch64-darwin.tests · build #570 · raw

1tribuchet: building on mac02
unpackPhase
2unpacking source archive /nix/store/5rfbjixxwyqpxcxnscrmbd2p5wjsadfi-source3source root is source
patchPhase
4Executing configureCargoCommonVars5decompressing cargo artifacts from /nix/store/50pxkjn65mncysq0f9n6jcd2bwmf7xsb-harmonia-deps-3.3.0/target.tar.zst to target
configurePhase
6will append /private/var/lib/tribuchet/a7/scratch/5a03053136b3c71d/build/source/.cargo-home/config.toml with contents of /nix/store/j43lravs1ndjdm0ciaky607mc3rq0a9v-vendor-cargo-deps/config.toml7default configurePhase, nothing to do
buildPhase
8+++ command cargo --version9cargo 1.98.0 (797e8a9bc 2026-08-05)10+++ command cargo build --workspace11 Compiling harmonia-utils-base-encoding v0.0.0-alpha.0 (/private/var/lib/tribuchet/a7/scratch/5a03053136b3c71d/build/source/harmonia-utils-base-encoding)12 Compiling harmonia-file-core v3.3.0 (/private/var/lib/tribuchet/a7/scratch/5a03053136b3c71d/build/source/harmonia-file-core)13 Compiling harmonia-protocol-derive v3.3.0 (/private/var/lib/tribuchet/a7/scratch/5a03053136b3c71d/build/source/harmonia-protocol-derive)14 Compiling harmonia-client v3.3.0 (/private/var/lib/tribuchet/a7/scratch/5a03053136b3c71d/build/source/harmonia-client)15 Compiling harmonia-ssh-store v3.3.0 (/private/var/lib/tribuchet/a7/scratch/5a03053136b3c71d/build/source/harmonia-ssh-store)16 Compiling harmonia-bench v3.3.0 (/private/var/lib/tribuchet/a7/scratch/5a03053136b3c71d/build/source/harmonia-bench)17 Compiling harmonia-utils-test v0.0.0-alpha.0 (/private/var/lib/tribuchet/a7/scratch/5a03053136b3c71d/build/source/harmonia-utils-test)18 Compiling harmonia-utils-hash v0.0.0-alpha.0 (/private/var/lib/tribuchet/a7/scratch/5a03053136b3c71d/build/source/harmonia-utils-hash)19 Compiling harmonia-utils-signature v3.3.0 (/private/var/lib/tribuchet/a7/scratch/5a03053136b3c71d/build/source/harmonia-utils-signature)20 Compiling harmonia-store-path v3.3.0 (/private/var/lib/tribuchet/a7/scratch/5a03053136b3c71d/build/source/harmonia-store-path)21 Compiling harmonia-utils-io v0.0.0-alpha.0 (/private/var/lib/tribuchet/a7/scratch/5a03053136b3c71d/build/source/harmonia-utils-io)22 Compiling harmonia-store-content-address v3.3.0 (/private/var/lib/tribuchet/a7/scratch/5a03053136b3c71d/build/source/harmonia-store-content-address)23 Compiling harmonia-store-fs v3.3.0 (/private/var/lib/tribuchet/a7/scratch/5a03053136b3c71d/build/source/harmonia-store-fs)24 Compiling harmonia-store-ref-scan v0.0.0-alpha.0 (/private/var/lib/tribuchet/a7/scratch/5a03053136b3c71d/build/source/harmonia-store-ref-scan)25 Compiling harmonia-store-derivation v0.0.0-alpha.0 (/private/var/lib/tribuchet/a7/scratch/5a03053136b3c71d/build/source/harmonia-store-derivation)26 Compiling harmonia-store-path-info v3.3.0 (/private/var/lib/tribuchet/a7/scratch/5a03053136b3c71d/build/source/harmonia-store-path-info)27 Compiling harmonia-file-nar v3.3.0 (/private/var/lib/tribuchet/a7/scratch/5a03053136b3c71d/build/source/harmonia-file-nar)28 Compiling harmonia-store-nar-info v3.3.0 (/private/var/lib/tribuchet/a7/scratch/5a03053136b3c71d/build/source/harmonia-store-nar-info)29 Compiling harmonia-store-db v3.3.0 (/private/var/lib/tribuchet/a7/scratch/5a03053136b3c71d/build/source/harmonia-store-db)30 Compiling harmonia-store-build-result v3.3.0 (/private/var/lib/tribuchet/a7/scratch/5a03053136b3c71d/build/source/harmonia-store-build-result)31 Compiling harmonia-store-aterm v0.0.0-alpha.0 (/private/var/lib/tribuchet/a7/scratch/5a03053136b3c71d/build/source/harmonia-store-aterm)32 Compiling harmonia-store-gc v3.3.0 (/private/var/lib/tribuchet/a7/scratch/5a03053136b3c71d/build/source/harmonia-store-gc)33 Compiling harmonia-protocol v3.3.0 (/private/var/lib/tribuchet/a7/scratch/5a03053136b3c71d/build/source/harmonia-protocol)34 Compiling harmonia-cache v3.3.0 (/private/var/lib/tribuchet/a7/scratch/5a03053136b3c71d/build/source/harmonia-cache)35 Compiling harmonia-daemon v3.3.0 (/private/var/lib/tribuchet/a7/scratch/5a03053136b3c71d/build/source/harmonia-daemon)36 Compiling harmonia-store-remote v3.3.0 (/private/var/lib/tribuchet/a7/scratch/5a03053136b3c71d/build/source/harmonia-store-remote)37 Finished `dev` profile [unoptimized + debuginfo] target(s) in 6.03s38+++ command cargo nextest run --workspace39 Compiling harmonia-utils-test v0.0.0-alpha.0 (/private/var/lib/tribuchet/a7/scratch/5a03053136b3c71d/build/source/harmonia-utils-test)40 Compiling harmonia-utils-signature v3.3.0 (/private/var/lib/tribuchet/a7/scratch/5a03053136b3c71d/build/source/harmonia-utils-signature)41 Compiling harmonia-utils-hash v0.0.0-alpha.0 (/private/var/lib/tribuchet/a7/scratch/5a03053136b3c71d/build/source/harmonia-utils-hash)42 Compiling harmonia-protocol-derive v3.3.0 (/private/var/lib/tribuchet/a7/scratch/5a03053136b3c71d/build/source/harmonia-protocol-derive)43 Compiling harmonia-utils-base-encoding v0.0.0-alpha.0 (/private/var/lib/tribuchet/a7/scratch/5a03053136b3c71d/build/source/harmonia-utils-base-encoding)44 Compiling harmonia-ssh-store v3.3.0 (/private/var/lib/tribuchet/a7/scratch/5a03053136b3c71d/build/source/harmonia-ssh-store)45 Compiling harmonia-client v3.3.0 (/private/var/lib/tribuchet/a7/scratch/5a03053136b3c71d/build/source/harmonia-client)46 Compiling harmonia-bench v3.3.0 (/private/var/lib/tribuchet/a7/scratch/5a03053136b3c71d/build/source/harmonia-bench)47 Compiling harmonia-file-core v3.3.0 (/private/var/lib/tribuchet/a7/scratch/5a03053136b3c71d/build/source/harmonia-file-core)48 Compiling harmonia-store-path v3.3.0 (/private/var/lib/tribuchet/a7/scratch/5a03053136b3c71d/build/source/harmonia-store-path)49 Compiling harmonia-utils-io v0.0.0-alpha.0 (/private/var/lib/tribuchet/a7/scratch/5a03053136b3c71d/build/source/harmonia-utils-io)50 Compiling harmonia-store-content-address v3.3.0 (/private/var/lib/tribuchet/a7/scratch/5a03053136b3c71d/build/source/harmonia-store-content-address)51 Compiling harmonia-store-fs v3.3.0 (/private/var/lib/tribuchet/a7/scratch/5a03053136b3c71d/build/source/harmonia-store-fs)52 Compiling harmonia-store-ref-scan v0.0.0-alpha.0 (/private/var/lib/tribuchet/a7/scratch/5a03053136b3c71d/build/source/harmonia-store-ref-scan)53 Compiling harmonia-file-nar v3.3.0 (/private/var/lib/tribuchet/a7/scratch/5a03053136b3c71d/build/source/harmonia-file-nar)54 Compiling harmonia-store-derivation v0.0.0-alpha.0 (/private/var/lib/tribuchet/a7/scratch/5a03053136b3c71d/build/source/harmonia-store-derivation)55 Compiling harmonia-store-path-info v3.3.0 (/private/var/lib/tribuchet/a7/scratch/5a03053136b3c71d/build/source/harmonia-store-path-info)56 Compiling harmonia-store-nar-info v3.3.0 (/private/var/lib/tribuchet/a7/scratch/5a03053136b3c71d/build/source/harmonia-store-nar-info)57 Compiling harmonia-store-db v3.3.0 (/private/var/lib/tribuchet/a7/scratch/5a03053136b3c71d/build/source/harmonia-store-db)58 Compiling harmonia-store-aterm v0.0.0-alpha.0 (/private/var/lib/tribuchet/a7/scratch/5a03053136b3c71d/build/source/harmonia-store-aterm)59 Compiling harmonia-store-build-result v3.3.0 (/private/var/lib/tribuchet/a7/scratch/5a03053136b3c71d/build/source/harmonia-store-build-result)60 Compiling harmonia-protocol v3.3.0 (/private/var/lib/tribuchet/a7/scratch/5a03053136b3c71d/build/source/harmonia-protocol)61 Compiling harmonia-store-gc v3.3.0 (/private/var/lib/tribuchet/a7/scratch/5a03053136b3c71d/build/source/harmonia-store-gc)62 Compiling harmonia-cache v3.3.0 (/private/var/lib/tribuchet/a7/scratch/5a03053136b3c71d/build/source/harmonia-cache)63 Compiling harmonia-store-remote v3.3.0 (/private/var/lib/tribuchet/a7/scratch/5a03053136b3c71d/build/source/harmonia-store-remote)64 Compiling harmonia-daemon v3.3.0 (/private/var/lib/tribuchet/a7/scratch/5a03053136b3c71d/build/source/harmonia-daemon)65 Finished `test` profile [unoptimized + debuginfo] target(s) in 20.65s66────────────67 Nextest run ID 975ef612-d2c5-4da9-9191-7bfa5fa17dd8 with nextest profile: default68 Starting 2457 tests across 56 binaries69 PASS [ 1.603s] ( 1/2457) harmonia-cache::error_responses serve_missing_file_does_not_leak_fs_path70 PASS [ 1.604s] ( 2/2457) harmonia-cache::log test_build_log_endpoint71 PASS [ 1.606s] ( 3/2457) harmonia-cache::security_paths malformed_hash_is_4xx_not_5xx72 PASS [ 1.663s] ( 4/2457) harmonia-cache::endpoints test_root_endpoint73 PASS [ 1.663s] ( 5/2457) harmonia-cache::endpoints test_root_endpoint_with_signing_keys74 PASS [ 1.708s] ( 6/2457) harmonia-cache::realisations test_build_trace_endpoint75 PASS [ 1.737s] ( 7/2457) harmonia-cache::endpoints test_health_endpoint76 PASS [ 1.737s] ( 8/2457) harmonia-cache::prometheus test_prometheus_metrics77 PASS [ 1.738s] ( 9/2457) harmonia-cache::chroot test_chroot78 PASS [ 0.012s] ( 10/2457) harmonia-cache::bin/harmonia-cache config::tests::default_uses_serde_defaults79 PASS [ 0.013s] ( 11/2457) harmonia-cache::bin/harmonia-cache template::tests::render_is_single_pass80 PASS [ 0.017s] ( 12/2457) harmonia-cache::bin/harmonia-cache tls::tests::flags_group_or_other_readable81 PASS [ 0.009s] ( 13/2457) harmonia-cache::bin/harmonia-cache tls::tests::skips_files_under_credentials_directory82 PASS [ 0.056s] ( 14/2457) harmonia-cache::bin/harmonia-cache nar::test::test_dump_store83 PASS [ 0.008s] ( 15/2457) harmonia-cache::bin/harmonia-cache tls::tests::still_warns_outside_credentials_directory84 PASS [ 0.007s] ( 16/2457) harmonia-cache::bin/harmonia-cache zstd_body::tests::accept_encoding_parse85 PASS [ 0.007s] ( 17/2457) harmonia-cache::bin/harmonia-cache zstd_body::tests::large_encoder_slots_gate_only_large_bodies86 PASS [ 0.007s] ( 18/2457) harmonia-cache::bin/harmonia-cache zstd_body::tests::middleware_integration87 PASS [ 0.091s] ( 19/2457) harmonia-cache::bin/harmonia-cache narlist::test::test_get_nar_list88 PASS [ 0.037s] ( 20/2457) harmonia-cache::bin/harmonia-cache zstd_body::tests::round_trip89 PASS [ 0.009s] ( 21/2457) harmonia-daemon tests::add_to_store_scanning::client_requires_negotiated_feature90 PASS [ 0.008s] ( 22/2457) harmonia-daemon tests::add_to_store_scanning::server_rejects_unnegotiated_scanning_op91 PASS [ 0.038s] ( 23/2457) harmonia-client::bin/harmonia tests::test_run_with_version92 PASS [ 0.011s] ( 24/2457) harmonia-daemon tests::nar_from_path_error_keeps_connection_in_sync93 PASS [ 0.015s] ( 25/2457) harmonia-daemon tests::sqlite_nix_store::test_handler_query_realisation94 PASS [ 0.067s] ( 26/2457) harmonia-daemon tests::sqlite_nix_store::test_handler_with_nix_store95 PASS [ 0.093s] ( 27/2457) harmonia-daemon tests::sqlite_nix_store::test_sqlite_with_nix_initialized_store96 PASS [ 0.012s] ( 28/2457) harmonia-daemon tests::submit_output::client_requires_negotiated_feature97 PASS [ 0.008s] ( 29/2457) harmonia-daemon tests::submit_output::server_accepts_submit_output98 PASS [ 0.007s] ( 30/2457) harmonia-daemon tests::submit_output::server_rejects_unnegotiated_submit_output99 PASS [ 0.006s] ( 31/2457) harmonia-file-core::json_upstream memory_source_accessor_complex::from_json100 PASS [ 0.006s] ( 32/2457) harmonia-file-core::json_upstream memory_source_accessor_complex::to_json101 PASS [ 0.006s] ( 33/2457) harmonia-file-core::json_upstream memory_source_accessor_simple::from_json102 PASS [ 0.006s] ( 34/2457) harmonia-file-core::json_upstream memory_source_accessor_simple::to_json103 PASS [ 0.006s] ( 35/2457) harmonia-file-core::json_upstream nar_listing_deep::from_json104 PASS [ 0.006s] ( 36/2457) harmonia-file-core::json_upstream nar_listing_deep::to_json105 PASS [ 0.006s] ( 37/2457) harmonia-file-core::json_upstream nar_listing_shallow::from_json106 PASS [ 0.104s] ( 38/2457) harmonia-daemon tests::sqlite_nix_store::test_stock_nix_client_can_talk_to_daemon107 PASS [ 0.006s] ( 39/2457) harmonia-file-core::json_upstream nar_listing_shallow::to_json108 PASS [ 0.008s] ( 40/2457) harmonia-file-nar archive::byte_stream::tests::byte_stream_matches_nar_writer109 PASS [ 0.007s] ( 41/2457) harmonia-file-nar archive::byte_stream::tests::byte_stream_single_file110 PASS [ 0.007s] ( 42/2457) harmonia-file-nar archive::dumper::unittests::test_dump_dir111 PASS [ 0.007s] ( 43/2457) harmonia-file-nar archive::dumper::unittests::test_dump_empty_file112 PASS [ 0.008s] ( 44/2457) harmonia-file-nar archive::dumper::unittests::test_dump_exec_file113 PASS [ 0.044s] ( 45/2457) harmonia-file-nar archive::byte_stream::tests::byte_stream_large_file_matches_nix_store_dump114 PASS [ 0.007s] ( 46/2457) harmonia-file-nar archive::dumper::unittests::test_dump_symlink115 PASS [ 0.008s] ( 47/2457) harmonia-file-nar archive::dumper::unittests::test_dump_text_file116 PASS [ 0.436s] ( 48/2457) harmonia-cache::socket_activation test_socket_activation_tcp117 PASS [ 0.007s] ( 49/2457) harmonia-file-nar archive::parser::unittests::parse_written::case_1_text_file118 PASS [ 0.008s] ( 50/2457) harmonia-file-nar archive::parser::unittests::parse_written::case_2_exec_file119 PASS [ 0.007s] ( 51/2457) harmonia-file-nar archive::parser::unittests::parse_written::case_3_empty_file120 PASS [ 0.007s] ( 52/2457) harmonia-file-nar archive::parser::unittests::parse_written::case_4_empty_file_in_dir121 PASS [ 0.306s] ( 53/2457) harmonia-cache::bin/harmonia-cache zstd_body::tests::non_nar_stream_fits_browser_window122 PASS [ 0.008s] ( 54/2457) harmonia-file-nar archive::parser::unittests::parse_written::case_5_symlink123 PASS [ 0.007s] ( 55/2457) harmonia-file-nar archive::parser::unittests::parse_written::case_7_empty_dir_in_dir124 PASS [ 0.009s] ( 56/2457) harmonia-file-nar archive::parser::unittests::parse_written::case_6_empty_dir125 PASS [ 0.008s] ( 57/2457) harmonia-file-nar archive::parser::unittests::parse_written::case_8_dir_example126 PASS [ 0.007s] ( 58/2457) harmonia-file-nar archive::parser::unittests::reject_duplicate_or_unsorted_entries::case_1_duplicate127 PASS [ 0.009s] ( 59/2457) harmonia-file-nar archive::parser::unittests::reject_duplicate_or_unsorted_entries::case_2_unsorted128 PASS [ 0.007s] ( 60/2457) harmonia-file-nar archive::parser::unittests::reject_invalid_entry_name::case_1_dot_dot129 PASS [ 0.006s] ( 61/2457) harmonia-file-nar archive::parser::unittests::reject_invalid_entry_name::case_3_slash130 PASS [ 0.008s] ( 62/2457) harmonia-file-nar archive::parser::unittests::reject_invalid_entry_name::case_2_dot131 PASS [ 0.007s] ( 63/2457) harmonia-file-nar archive::parser::unittests::reject_invalid_entry_name::case_5_empty132 PASS [ 0.009s] ( 64/2457) harmonia-file-nar archive::parser::unittests::reject_invalid_entry_name::case_4_nul133 PASS [ 0.007s] ( 65/2457) harmonia-file-nar archive::parser::unittests::reject_nonzero_padding::chunk_size_1_1134 PASS [ 0.008s] ( 66/2457) harmonia-file-nar archive::parser::unittests::reject_nonzero_padding::chunk_size_2_3135 PASS [ 0.007s] ( 67/2457) harmonia-file-nar archive::parser::unittests::reject_nonzero_padding::chunk_size_3_8136 PASS [ 0.007s] ( 68/2457) harmonia-file-nar archive::parser::unittests::reject_nonzero_padding::chunk_size_4_64_000137 PASS [ 0.008s] ( 69/2457) harmonia-file-nar archive::parser::unittests::reject_oversized_length::case_1_symlink_huge138 PASS [ 0.007s] ( 70/2457) harmonia-file-nar archive::parser::unittests::reject_oversized_length::case_2_symlink_wrap139 PASS [ 0.007s] ( 71/2457) harmonia-file-nar archive::parser::unittests::reject_oversized_length::case_3_name_huge140 PASS [ 0.006s] ( 72/2457) harmonia-file-nar archive::parser::unittests::reject_oversized_length::case_4_name_wrap141 PASS [ 0.007s] ( 73/2457) harmonia-file-nar archive::parser::unittests::test_parse_nar::case_1_dir_example142 PASS [ 0.007s] ( 74/2457) harmonia-file-nar archive::parser::unittests::test_parse_nar::case_2_exec_file143 PASS [ 0.007s] ( 75/2457) harmonia-file-nar archive::radix_tree::unittests::insert144 PASS [ 0.008s] ( 76/2457) harmonia-file-nar archive::parser::unittests::test_parse_nar::case_3_text_file145 PASS [ 0.007s] ( 77/2457) harmonia-file-nar archive::radix_tree::unittests::insert_error::case_1146 PASS [ 0.008s] ( 78/2457) harmonia-file-nar archive::radix_tree::unittests::insert_error::case_2147 PASS [ 0.010s] ( 79/2457) harmonia-file-nar archive::radix_tree::unittests::lookup_needs_more::case_1148 PASS [ 0.009s] ( 80/2457) harmonia-file-nar archive::radix_tree::unittests::lookup_needs_more::case_2149 PASS [ 0.014s] ( 81/2457) harmonia-file-nar archive::radix_tree::unittests::insert_error::case_4150 PASS [ 0.014s] ( 82/2457) harmonia-file-nar archive::radix_tree::unittests::insert_error::case_3151 PASS [ 0.007s] ( 83/2457) harmonia-file-nar archive::radix_tree::unittests::lookup_test::case_1_full_match152 PASS [ 0.007s] ( 84/2457) harmonia-file-nar archive::radix_tree::unittests::lookup_test::case_2_partial_match153 PASS [ 0.008s] ( 85/2457) harmonia-file-nar archive::radix_tree::unittests::lookup_needs_more::case_3154 PASS [ 0.009s] ( 86/2457) harmonia-file-nar archive::radix_tree::unittests::lookup_test::case_3_mismatch_branch155 PASS [ 0.007s] ( 87/2457) harmonia-file-nar archive::radix_tree::unittests::lookup_test::case_6_needs_more_edge156 PASS [ 0.008s] ( 88/2457) harmonia-file-nar archive::radix_tree::unittests::lookup_test::case_4_mismatch_edge157 PASS [ 0.008s] ( 89/2457) harmonia-file-nar archive::radix_tree::unittests::lookup_test::case_5_needs_more_branch158 PASS [ 0.007s] ( 90/2457) harmonia-file-nar archive::read_nar::unittests::read_nar::case_1_text_file::postfix_1_Ok__b_________::chunk_size_03_3159 PASS [ 0.009s] ( 91/2457) harmonia-file-nar archive::read_nar::unittests::read_nar::case_1_text_file::postfix_1_Ok__b_________::chunk_size_01_1160 PASS [ 0.009s] ( 92/2457) harmonia-file-nar archive::read_nar::unittests::read_nar::case_1_text_file::postfix_1_Ok__b_________::chunk_size_02_2161 PASS [ 0.593s] ( 93/2457) harmonia-cache::security_xss landing_page_escapes_host_and_proto_headers162 PASS [ 0.008s] ( 94/2457) harmonia-file-nar archive::read_nar::unittests::read_nar::case_1_text_file::postfix_1_Ok__b_________::chunk_size_04_4163 PASS [ 0.007s] ( 95/2457) harmonia-file-nar archive::read_nar::unittests::read_nar::case_1_text_file::postfix_1_Ok__b_________::chunk_size_05_5164 PASS [ 0.009s] ( 96/2457) harmonia-file-nar archive::read_nar::unittests::read_nar::case_1_text_file::postfix_1_Ok__b_________::chunk_size_06_6165 PASS [ 0.008s] ( 97/2457) harmonia-file-nar archive::read_nar::unittests::read_nar::case_1_text_file::postfix_1_Ok__b_________::chunk_size_09_9166 PASS [ 0.008s] ( 98/2457) harmonia-file-nar archive::read_nar::unittests::read_nar::case_1_text_file::postfix_1_Ok__b_________::chunk_size_07_7167 PASS [ 0.009s] ( 99/2457) harmonia-file-nar archive::read_nar::unittests::read_nar::case_1_text_file::postfix_1_Ok__b_________::chunk_size_08_8168 PASS [ 0.008s] ( 100/2457) harmonia-file-nar archive::read_nar::unittests::read_nar::case_1_text_file::postfix_1_Ok__b_________::chunk_size_10_10169 PASS [ 0.008s] ( 101/2457) harmonia-file-nar archive::read_nar::unittests::read_nar::case_1_text_file::postfix_1_Ok__b_________::chunk_size_11_11170 PASS [ 0.009s] ( 102/2457) harmonia-file-nar archive::read_nar::unittests::read_nar::case_1_text_file::postfix_1_Ok__b_________::chunk_size_12_51171 PASS [ 0.009s] ( 103/2457) harmonia-file-nar archive::read_nar::unittests::read_nar::case_1_text_file::postfix_1_Ok__b_________::chunk_size_13_64_000172 PASS [ 0.010s] ( 104/2457) harmonia-file-nar archive::read_nar::unittests::read_nar::case_1_text_file::postfix_2_Ok__b__more_______::chunk_size_01_1173 PASS [ 0.008s] ( 105/2457) harmonia-file-nar archive::read_nar::unittests::read_nar::case_1_text_file::postfix_2_Ok__b__more_______::chunk_size_05_5174 PASS [ 0.011s] ( 106/2457) harmonia-file-nar archive::read_nar::unittests::read_nar::case_1_text_file::postfix_2_Ok__b__more_______::chunk_size_02_2175 PASS [ 0.010s] ( 107/2457) harmonia-file-nar archive::read_nar::unittests::read_nar::case_1_text_file::postfix_2_Ok__b__more_______::chunk_size_04_4176 PASS [ 0.011s] ( 108/2457) harmonia-file-nar archive::read_nar::unittests::read_nar::case_1_text_file::postfix_2_Ok__b__more_______::chunk_size_03_3177 PASS [ 0.008s] ( 109/2457) harmonia-file-nar archive::read_nar::unittests::read_nar::case_1_text_file::postfix_2_Ok__b__more_______::chunk_size_07_7178 PASS [ 0.008s] ( 110/2457) harmonia-file-nar archive::read_nar::unittests::read_nar::case_1_text_file::postfix_2_Ok__b__more_______::chunk_size_06_6179 PASS [ 0.009s] ( 111/2457) harmonia-file-nar archive::read_nar::unittests::read_nar::case_1_text_file::postfix_2_Ok__b__more_______::chunk_size_08_8180 PASS [ 0.008s] ( 112/2457) harmonia-file-nar archive::read_nar::unittests::read_nar::case_1_text_file::postfix_2_Ok__b__more_______::chunk_size_09_9181 PASS [ 0.526s] ( 113/2457) harmonia-cache::unix test_unix_socket182 PASS [ 0.008s] ( 114/2457) harmonia-file-nar archive::read_nar::unittests::read_nar::case_1_text_file::postfix_2_Ok__b__more_______::chunk_size_12_51183 PASS [ 0.009s] ( 115/2457) harmonia-file-nar archive::read_nar::unittests::read_nar::case_1_text_file::postfix_2_Ok__b__more_______::chunk_size_11_11184 PASS [ 0.009s] ( 116/2457) harmonia-file-nar archive::read_nar::unittests::read_nar::case_1_text_file::postfix_2_Ok__b__more_______::chunk_size_10_10185 PASS [ 0.009s] ( 117/2457) harmonia-file-nar archive::read_nar::unittests::read_nar::case_1_text_file::postfix_2_Ok__b__more_______::chunk_size_13_64_000186 PASS [ 0.009s] ( 118/2457) harmonia-file-nar archive::read_nar::unittests::read_nar::case_1_text_file::postfix_3_Err_io__ErrorKind__StorageFull_::chunk_size_01_1187 PASS [ 0.008s] ( 119/2457) harmonia-file-nar archive::read_nar::unittests::read_nar::case_1_text_file::postfix_3_Err_io__ErrorKind__StorageFull_::chunk_size_03_3188 PASS [ 0.008s] ( 120/2457) harmonia-file-nar archive::read_nar::unittests::read_nar::case_1_text_file::postfix_3_Err_io__ErrorKind__StorageFull_::chunk_size_02_2189 PASS [ 0.007s] ( 121/2457) harmonia-file-nar archive::read_nar::unittests::read_nar::case_1_text_file::postfix_3_Err_io__ErrorKind__StorageFull_::chunk_size_05_5190 PASS [ 0.009s] ( 122/2457) harmonia-file-nar archive::read_nar::unittests::read_nar::case_1_text_file::postfix_3_Err_io__ErrorKind__StorageFull_::chunk_size_04_4191 PASS [ 0.009s] ( 123/2457) harmonia-file-nar archive::read_nar::unittests::read_nar::case_1_text_file::postfix_3_Err_io__ErrorKind__StorageFull_::chunk_size_06_6192 PASS [ 0.007s] ( 124/2457) harmonia-file-nar archive::read_nar::unittests::read_nar::case_1_text_file::postfix_3_Err_io__ErrorKind__StorageFull_::chunk_size_09_9193 PASS [ 0.008s] ( 125/2457) harmonia-file-nar archive::read_nar::unittests::read_nar::case_1_text_file::postfix_3_Err_io__ErrorKind__StorageFull_::chunk_size_07_7194 PASS [ 0.009s] ( 126/2457) harmonia-file-nar archive::read_nar::unittests::read_nar::case_1_text_file::postfix_3_Err_io__ErrorKind__StorageFull_::chunk_size_08_8195 PASS [ 0.008s] ( 127/2457) harmonia-file-nar archive::read_nar::unittests::read_nar::case_1_text_file::postfix_3_Err_io__ErrorKind__StorageFull_::chunk_size_10_10196 PASS [ 0.007s] ( 128/2457) harmonia-file-nar archive::read_nar::unittests::read_nar::case_1_text_file::postfix_3_Err_io__ErrorKind__StorageFull_::chunk_size_11_11197 PASS [ 0.007s] ( 129/2457) harmonia-file-nar archive::read_nar::unittests::read_nar::case_2_exec_file::postfix_1_Ok__b_________::chunk_size_02_2198 PASS [ 0.009s] ( 130/2457) harmonia-file-nar archive::read_nar::unittests::read_nar::case_1_text_file::postfix_3_Err_io__ErrorKind__StorageFull_::chunk_size_12_51199 PASS [ 0.008s] ( 131/2457) harmonia-file-nar archive::read_nar::unittests::read_nar::case_2_exec_file::postfix_1_Ok__b_________::chunk_size_01_1200 PASS [ 0.009s] ( 132/2457) harmonia-file-nar archive::read_nar::unittests::read_nar::case_1_text_file::postfix_3_Err_io__ErrorKind__StorageFull_::chunk_size_13_64_000201 PASS [ 0.008s] ( 133/2457) harmonia-file-nar archive::read_nar::unittests::read_nar::case_2_exec_file::postfix_1_Ok__b_________::chunk_size_03_3202 PASS [ 0.008s] ( 134/2457) harmonia-file-nar archive::read_nar::unittests::read_nar::case_2_exec_file::postfix_1_Ok__b_________::chunk_size_04_4203 PASS [ 0.008s] ( 135/2457) harmonia-file-nar archive::read_nar::unittests::read_nar::case_2_exec_file::postfix_1_Ok__b_________::chunk_size_05_5204 PASS [ 0.008s] ( 136/2457) harmonia-file-nar archive::read_nar::unittests::read_nar::case_2_exec_file::postfix_1_Ok__b_________::chunk_size_08_8205 PASS [ 0.009s] ( 137/2457) harmonia-file-nar archive::read_nar::unittests::read_nar::case_2_exec_file::postfix_1_Ok__b_________::chunk_size_07_7206 PASS [ 0.009s] ( 138/2457) harmonia-file-nar archive::read_nar::unittests::read_nar::case_2_exec_file::postfix_1_Ok__b_________::chunk_size_06_6207 PASS [ 0.007s] ( 139/2457) harmonia-file-nar archive::read_nar::unittests::read_nar::case_2_exec_file::postfix_1_Ok__b_________::chunk_size_10_10208 PASS [ 0.008s] ( 140/2457) harmonia-file-nar archive::read_nar::unittests::read_nar::case_2_exec_file::postfix_1_Ok__b_________::chunk_size_09_9209 PASS [ 0.008s] ( 141/2457) harmonia-file-nar archive::read_nar::unittests::read_nar::case_2_exec_file::postfix_1_Ok__b_________::chunk_size_12_51210 PASS [ 0.009s] ( 142/2457) harmonia-file-nar archive::read_nar::unittests::read_nar::case_2_exec_file::postfix_1_Ok__b_________::chunk_size_11_11211 PASS [ 0.009s] ( 143/2457) harmonia-file-nar archive::read_nar::unittests::read_nar::case_2_exec_file::postfix_1_Ok__b_________::chunk_size_13_64_000212 PASS [ 0.008s] ( 144/2457) harmonia-file-nar archive::read_nar::unittests::read_nar::case_2_exec_file::postfix_2_Ok__b__more_______::chunk_size_02_2213 PASS [ 0.009s] ( 145/2457) harmonia-file-nar archive::read_nar::unittests::read_nar::case_2_exec_file::postfix_2_Ok__b__more_______::chunk_size_01_1214 PASS [ 0.007s] ( 146/2457) harmonia-file-nar archive::read_nar::unittests::read_nar::case_2_exec_file::postfix_2_Ok__b__more_______::chunk_size_05_5215 PASS [ 0.009s] ( 147/2457) harmonia-file-nar archive::read_nar::unittests::read_nar::case_2_exec_file::postfix_2_Ok__b__more_______::chunk_size_03_3216 PASS [ 0.010s] ( 148/2457) harmonia-file-nar archive::read_nar::unittests::read_nar::case_2_exec_file::postfix_2_Ok__b__more_______::chunk_size_04_4217 PASS [ 0.008s] ( 149/2457) harmonia-file-nar archive::read_nar::unittests::read_nar::case_2_exec_file::postfix_2_Ok__b__more_______::chunk_size_06_6218 PASS [ 0.008s] ( 150/2457) harmonia-file-nar archive::read_nar::unittests::read_nar::case_2_exec_file::postfix_2_Ok__b__more_______::chunk_size_07_7219 PASS [ 0.008s] ( 151/2457) harmonia-file-nar archive::read_nar::unittests::read_nar::case_2_exec_file::postfix_2_Ok__b__more_______::chunk_size_08_8220 PASS [ 0.008s] ( 152/2457) harmonia-file-nar archive::read_nar::unittests::read_nar::case_2_exec_file::postfix_2_Ok__b__more_______::chunk_size_09_9221 PASS [ 0.007s] ( 153/2457) harmonia-file-nar archive::read_nar::unittests::read_nar::case_2_exec_file::postfix_2_Ok__b__more_______::chunk_size_10_10222 PASS [ 0.009s] ( 154/2457) harmonia-file-nar archive::read_nar::unittests::read_nar::case_2_exec_file::postfix_2_Ok__b__more_______::chunk_size_11_11223 PASS [ 0.007s] ( 155/2457) harmonia-file-nar archive::read_nar::unittests::read_nar::case_2_exec_file::postfix_3_Err_io__ErrorKind__StorageFull_::chunk_size_01_1224 PASS [ 0.009s] ( 156/2457) harmonia-file-nar archive::read_nar::unittests::read_nar::case_2_exec_file::postfix_2_Ok__b__more_______::chunk_size_12_51225 PASS [ 0.009s] ( 157/2457) harmonia-file-nar archive::read_nar::unittests::read_nar::case_2_exec_file::postfix_2_Ok__b__more_______::chunk_size_13_64_000226 PASS [ 0.008s] ( 158/2457) harmonia-file-nar archive::read_nar::unittests::read_nar::case_2_exec_file::postfix_3_Err_io__ErrorKind__StorageFull_::chunk_size_02_2227 PASS [ 0.008s] ( 159/2457) harmonia-file-nar archive::read_nar::unittests::read_nar::case_2_exec_file::postfix_3_Err_io__ErrorKind__StorageFull_::chunk_size_03_3228 PASS [ 0.008s] ( 160/2457) harmonia-file-nar archive::read_nar::unittests::read_nar::case_2_exec_file::postfix_3_Err_io__ErrorKind__StorageFull_::chunk_size_05_5229 PASS [ 0.007s] ( 161/2457) harmonia-file-nar archive::read_nar::unittests::read_nar::case_2_exec_file::postfix_3_Err_io__ErrorKind__StorageFull_::chunk_size_07_7230 PASS [ 0.008s] ( 162/2457) harmonia-file-nar archive::read_nar::unittests::read_nar::case_2_exec_file::postfix_3_Err_io__ErrorKind__StorageFull_::chunk_size_06_6231 PASS [ 0.009s] ( 163/2457) harmonia-file-nar archive::read_nar::unittests::read_nar::case_2_exec_file::postfix_3_Err_io__ErrorKind__StorageFull_::chunk_size_04_4232 PASS [ 0.007s] ( 164/2457) harmonia-file-nar archive::read_nar::unittests::read_nar::case_2_exec_file::postfix_3_Err_io__ErrorKind__StorageFull_::chunk_size_08_8233 PASS [ 0.009s] ( 165/2457) harmonia-file-nar archive::read_nar::unittests::read_nar::case_2_exec_file::postfix_3_Err_io__ErrorKind__StorageFull_::chunk_size_09_9234 PASS [ 0.008s] ( 166/2457) harmonia-file-nar archive::read_nar::unittests::read_nar::case_2_exec_file::postfix_3_Err_io__ErrorKind__StorageFull_::chunk_size_11_11235 PASS [ 0.009s] ( 167/2457) harmonia-file-nar archive::read_nar::unittests::read_nar::case_2_exec_file::postfix_3_Err_io__ErrorKind__StorageFull_::chunk_size_10_10236 PASS [ 0.008s] ( 168/2457) harmonia-file-nar archive::read_nar::unittests::read_nar::case_2_exec_file::postfix_3_Err_io__ErrorKind__StorageFull_::chunk_size_12_51237 PASS [ 0.007s] ( 169/2457) harmonia-file-nar archive::read_nar::unittests::read_nar::case_3_empty_file::postfix_1_Ok__b_________::chunk_size_02_2238 PASS [ 0.009s] ( 170/2457) harmonia-file-nar archive::read_nar::unittests::read_nar::case_2_exec_file::postfix_3_Err_io__ErrorKind__StorageFull_::chunk_size_13_64_000239 PASS [ 0.008s] ( 171/2457) harmonia-file-nar archive::read_nar::unittests::read_nar::case_3_empty_file::postfix_1_Ok__b_________::chunk_size_01_1240 PASS [ 0.009s] ( 172/2457) harmonia-file-nar archive::read_nar::unittests::read_nar::case_3_empty_file::postfix_1_Ok__b_________::chunk_size_04_4241 PASS [ 0.010s] ( 173/2457) harmonia-file-nar archive::read_nar::unittests::read_nar::case_3_empty_file::postfix_1_Ok__b_________::chunk_size_03_3242 PASS [ 0.008s] ( 174/2457) harmonia-file-nar archive::read_nar::unittests::read_nar::case_3_empty_file::postfix_1_Ok__b_________::chunk_size_05_5243 PASS [ 0.008s] ( 175/2457) harmonia-file-nar archive::read_nar::unittests::read_nar::case_3_empty_file::postfix_1_Ok__b_________::chunk_size_06_6244 PASS [ 0.008s] ( 176/2457) harmonia-file-nar archive::read_nar::unittests::read_nar::case_3_empty_file::postfix_1_Ok__b_________::chunk_size_07_7245 PASS [ 0.007s] ( 177/2457) harmonia-file-nar archive::read_nar::unittests::read_nar::case_3_empty_file::postfix_1_Ok__b_________::chunk_size_08_8246 PASS [ 0.008s] ( 178/2457) harmonia-file-nar archive::read_nar::unittests::read_nar::case_3_empty_file::postfix_1_Ok__b_________::chunk_size_09_9247 PASS [ 0.740s] ( 179/2457) harmonia-cache::security_xss serve_directory_listing_escapes_filenames_in_href248 PASS [ 0.008s] ( 180/2457) harmonia-file-nar archive::read_nar::unittests::read_nar::case_3_empty_file::postfix_1_Ok__b_________::chunk_size_12_51249 PASS [ 0.685s] ( 181/2457) harmonia-cache::tls test_tls250 PASS [ 0.010s] ( 182/2457) harmonia-file-nar archive::read_nar::unittests::read_nar::case_3_empty_file::postfix_1_Ok__b_________::chunk_size_10_10251 PASS [ 0.010s] ( 183/2457) harmonia-file-nar archive::read_nar::unittests::read_nar::case_3_empty_file::postfix_1_Ok__b_________::chunk_size_11_11252 PASS [ 0.009s] ( 184/2457) harmonia-file-nar archive::read_nar::unittests::read_nar::case_3_empty_file::postfix_1_Ok__b_________::chunk_size_13_64_000253 PASS [ 0.009s] ( 185/2457) harmonia-file-nar archive::read_nar::unittests::read_nar::case_3_empty_file::postfix_2_Ok__b__more_______::chunk_size_01_1254 PASS [ 0.012s] ( 186/2457) harmonia-file-nar archive::read_nar::unittests::read_nar::case_3_empty_file::postfix_2_Ok__b__more_______::chunk_size_02_2255 PASS [ 0.009s] ( 187/2457) harmonia-file-nar archive::read_nar::unittests::read_nar::case_3_empty_file::postfix_2_Ok__b__more_______::chunk_size_03_3256 PASS [ 0.010s] ( 188/2457) harmonia-file-nar archive::read_nar::unittests::read_nar::case_3_empty_file::postfix_2_Ok__b__more_______::chunk_size_04_4257 PASS [ 0.009s] ( 189/2457) harmonia-file-nar archive::read_nar::unittests::read_nar::case_3_empty_file::postfix_2_Ok__b__more_______::chunk_size_06_6258 PASS [ 0.009s] ( 190/2457) harmonia-file-nar archive::read_nar::unittests::read_nar::case_3_empty_file::postfix_2_Ok__b__more_______::chunk_size_05_5259 PASS [ 0.010s] ( 191/2457) harmonia-file-nar archive::read_nar::unittests::read_nar::case_3_empty_file::postfix_2_Ok__b__more_______::chunk_size_07_7260 PASS [ 0.009s] ( 192/2457) harmonia-file-nar archive::read_nar::unittests::read_nar::case_3_empty_file::postfix_2_Ok__b__more_______::chunk_size_08_8261 PASS [ 0.010s] ( 193/2457) harmonia-file-nar archive::read_nar::unittests::read_nar::case_3_empty_file::postfix_2_Ok__b__more_______::chunk_size_09_9262 PASS [ 0.009s] ( 194/2457) harmonia-file-nar archive::read_nar::unittests::read_nar::case_3_empty_file::postfix_2_Ok__b__more_______::chunk_size_11_11263 PASS [ 0.010s] ( 195/2457) harmonia-file-nar archive::read_nar::unittests::read_nar::case_3_empty_file::postfix_2_Ok__b__more_______::chunk_size_10_10264 PASS [ 0.007s] ( 196/2457) harmonia-file-nar archive::read_nar::unittests::read_nar::case_3_empty_file::postfix_3_Err_io__ErrorKind__StorageFull_::chunk_size_01_1265 PASS [ 0.011s] ( 197/2457) harmonia-file-nar archive::read_nar::unittests::read_nar::case_3_empty_file::postfix_2_Ok__b__more_______::chunk_size_13_64_000266 PASS [ 0.011s] ( 198/2457) harmonia-file-nar archive::read_nar::unittests::read_nar::case_3_empty_file::postfix_2_Ok__b__more_______::chunk_size_12_51267 PASS [ 0.010s] ( 199/2457) harmonia-file-nar archive::read_nar::unittests::read_nar::case_3_empty_file::postfix_3_Err_io__ErrorKind__StorageFull_::chunk_size_02_2268 PASS [ 0.011s] ( 200/2457) harmonia-file-nar archive::read_nar::unittests::read_nar::case_3_empty_file::postfix_3_Err_io__ErrorKind__StorageFull_::chunk_size_03_3269 PASS [ 0.010s] ( 201/2457) harmonia-file-nar archive::read_nar::unittests::read_nar::case_3_empty_file::postfix_3_Err_io__ErrorKind__StorageFull_::chunk_size_04_4270 PASS [ 0.010s] ( 202/2457) harmonia-file-nar archive::read_nar::unittests::read_nar::case_3_empty_file::postfix_3_Err_io__ErrorKind__StorageFull_::chunk_size_05_5271 PASS [ 0.009s] ( 203/2457) harmonia-file-nar archive::read_nar::unittests::read_nar::case_3_empty_file::postfix_3_Err_io__ErrorKind__StorageFull_::chunk_size_07_7272 PASS [ 0.010s] ( 204/2457) harmonia-file-nar archive::read_nar::unittests::read_nar::case_3_empty_file::postfix_3_Err_io__ErrorKind__StorageFull_::chunk_size_06_6273 PASS [ 0.008s] ( 205/2457) harmonia-file-nar archive::read_nar::unittests::read_nar::case_3_empty_file::postfix_3_Err_io__ErrorKind__StorageFull_::chunk_size_09_9274 PASS [ 0.011s] ( 206/2457) harmonia-file-nar archive::read_nar::unittests::read_nar::case_3_empty_file::postfix_3_Err_io__ErrorKind__StorageFull_::chunk_size_08_8275 PASS [ 0.008s] ( 207/2457) harmonia-file-nar archive::read_nar::unittests::read_nar::case_3_empty_file::postfix_3_Err_io__ErrorKind__StorageFull_::chunk_size_12_51276 PASS [ 0.008s] ( 208/2457) harmonia-file-nar archive::read_nar::unittests::read_nar::case_3_empty_file::postfix_3_Err_io__ErrorKind__StorageFull_::chunk_size_13_64_000277 PASS [ 0.011s] ( 209/2457) harmonia-file-nar archive::read_nar::unittests::read_nar::case_3_empty_file::postfix_3_Err_io__ErrorKind__StorageFull_::chunk_size_10_10278 PASS [ 0.011s] ( 210/2457) harmonia-file-nar archive::read_nar::unittests::read_nar::case_3_empty_file::postfix_3_Err_io__ErrorKind__StorageFull_::chunk_size_11_11279 PASS [ 0.008s] ( 211/2457) harmonia-file-nar archive::read_nar::unittests::read_nar::case_4_empty_file_in_dir::postfix_1_Ok__b_________::chunk_size_02_2280 PASS [ 0.010s] ( 212/2457) harmonia-file-nar archive::read_nar::unittests::read_nar::case_4_empty_file_in_dir::postfix_1_Ok__b_________::chunk_size_01_1281 PASS [ 0.010s] ( 213/2457) harmonia-file-nar archive::read_nar::unittests::read_nar::case_4_empty_file_in_dir::postfix_1_Ok__b_________::chunk_size_03_3282 PASS [ 0.010s] ( 214/2457) harmonia-file-nar archive::read_nar::unittests::read_nar::case_4_empty_file_in_dir::postfix_1_Ok__b_________::chunk_size_04_4283 PASS [ 0.010s] ( 215/2457) harmonia-file-nar archive::read_nar::unittests::read_nar::case_4_empty_file_in_dir::postfix_1_Ok__b_________::chunk_size_05_5284 PASS [ 0.010s] ( 216/2457) harmonia-file-nar archive::read_nar::unittests::read_nar::case_4_empty_file_in_dir::postfix_1_Ok__b_________::chunk_size_06_6285 PASS [ 0.010s] ( 217/2457) harmonia-file-nar archive::read_nar::unittests::read_nar::case_4_empty_file_in_dir::postfix_1_Ok__b_________::chunk_size_08_8286 PASS [ 0.007s] ( 218/2457) harmonia-file-nar archive::read_nar::unittests::read_nar::case_4_empty_file_in_dir::postfix_1_Ok__b_________::chunk_size_10_10287 PASS [ 0.010s] ( 219/2457) harmonia-file-nar archive::read_nar::unittests::read_nar::case_4_empty_file_in_dir::postfix_1_Ok__b_________::chunk_size_07_7288 PASS [ 0.011s] ( 220/2457) harmonia-file-nar archive::read_nar::unittests::read_nar::case_4_empty_file_in_dir::postfix_1_Ok__b_________::chunk_size_09_9289 PASS [ 0.008s] ( 221/2457) harmonia-file-nar archive::read_nar::unittests::read_nar::case_4_empty_file_in_dir::postfix_1_Ok__b_________::chunk_size_13_64_000290 PASS [ 0.008s] ( 222/2457) harmonia-file-nar archive::read_nar::unittests::read_nar::case_4_empty_file_in_dir::postfix_2_Ok__b__more_______::chunk_size_01_1291 PASS [ 0.010s] ( 223/2457) harmonia-file-nar archive::read_nar::unittests::read_nar::case_4_empty_file_in_dir::postfix_1_Ok__b_________::chunk_size_11_11292 PASS [ 0.012s] ( 224/2457) harmonia-file-nar archive::read_nar::unittests::read_nar::case_4_empty_file_in_dir::postfix_1_Ok__b_________::chunk_size_12_51293 PASS [ 0.009s] ( 225/2457) harmonia-file-nar archive::read_nar::unittests::read_nar::case_4_empty_file_in_dir::postfix_2_Ok__b__more_______::chunk_size_04_4294 PASS [ 0.011s] ( 226/2457) harmonia-file-nar archive::read_nar::unittests::read_nar::case_4_empty_file_in_dir::postfix_2_Ok__b__more_______::chunk_size_03_3295 PASS [ 0.011s] ( 227/2457) harmonia-file-nar archive::read_nar::unittests::read_nar::case_4_empty_file_in_dir::postfix_2_Ok__b__more_______::chunk_size_02_2296 PASS [ 0.235s] ( 228/2457) harmonia-file-nar archive::read_nar::proptests::proptest_read_nar297 PASS [ 0.010s] ( 229/2457) harmonia-file-nar archive::read_nar::unittests::read_nar::case_4_empty_file_in_dir::postfix_2_Ok__b__more_______::chunk_size_05_5298 PASS [ 0.009s] ( 230/2457) harmonia-file-nar archive::read_nar::unittests::read_nar::case_4_empty_file_in_dir::postfix_2_Ok__b__more_______::chunk_size_07_7299 PASS [ 0.011s] ( 231/2457) harmonia-file-nar archive::read_nar::unittests::read_nar::case_4_empty_file_in_dir::postfix_2_Ok__b__more_______::chunk_size_06_6300 PASS [ 0.008s] ( 232/2457) harmonia-file-nar archive::read_nar::unittests::read_nar::case_4_empty_file_in_dir::postfix_2_Ok__b__more_______::chunk_size_08_8301 PASS [ 0.009s] ( 233/2457) harmonia-file-nar archive::read_nar::unittests::read_nar::case_4_empty_file_in_dir::postfix_2_Ok__b__more_______::chunk_size_09_9302 PASS [ 0.009s] ( 234/2457) harmonia-file-nar archive::read_nar::unittests::read_nar::case_4_empty_file_in_dir::postfix_2_Ok__b__more_______::chunk_size_11_11303 PASS [ 0.010s] ( 235/2457) harmonia-file-nar archive::read_nar::unittests::read_nar::case_4_empty_file_in_dir::postfix_2_Ok__b__more_______::chunk_size_12_51304 PASS [ 0.010s] ( 236/2457) harmonia-file-nar archive::read_nar::unittests::read_nar::case_4_empty_file_in_dir::postfix_2_Ok__b__more_______::chunk_size_10_10305 PASS [ 0.009s] ( 237/2457) harmonia-file-nar archive::read_nar::unittests::read_nar::case_4_empty_file_in_dir::postfix_3_Err_io__ErrorKind__StorageFull_::chunk_size_01_1306 PASS [ 0.009s] ( 238/2457) harmonia-file-nar archive::read_nar::unittests::read_nar::case_4_empty_file_in_dir::postfix_2_Ok__b__more_______::chunk_size_13_64_000307 PASS [ 0.008s] ( 239/2457) harmonia-file-nar archive::read_nar::unittests::read_nar::case_4_empty_file_in_dir::postfix_3_Err_io__ErrorKind__StorageFull_::chunk_size_04_4308 PASS [ 0.010s] ( 240/2457) harmonia-file-nar archive::read_nar::unittests::read_nar::case_4_empty_file_in_dir::postfix_3_Err_io__ErrorKind__StorageFull_::chunk_size_02_2309 PASS [ 0.009s] ( 241/2457) harmonia-file-nar archive::read_nar::unittests::read_nar::case_4_empty_file_in_dir::postfix_3_Err_io__ErrorKind__StorageFull_::chunk_size_06_6310 PASS [ 0.011s] ( 242/2457) harmonia-file-nar archive::read_nar::unittests::read_nar::case_4_empty_file_in_dir::postfix_3_Err_io__ErrorKind__StorageFull_::chunk_size_03_3311 PASS [ 0.010s] ( 243/2457) harmonia-file-nar archive::read_nar::unittests::read_nar::case_4_empty_file_in_dir::postfix_3_Err_io__ErrorKind__StorageFull_::chunk_size_05_5312 PASS [ 0.012s] ( 244/2457) harmonia-file-nar archive::read_nar::unittests::read_nar::case_4_empty_file_in_dir::postfix_3_Err_io__ErrorKind__StorageFull_::chunk_size_07_7313 PASS [ 0.008s] ( 245/2457) harmonia-file-nar archive::read_nar::unittests::read_nar::case_4_empty_file_in_dir::postfix_3_Err_io__ErrorKind__StorageFull_::chunk_size_08_8314 PASS [ 0.009s] ( 246/2457) harmonia-file-nar archive::read_nar::unittests::read_nar::case_4_empty_file_in_dir::postfix_3_Err_io__ErrorKind__StorageFull_::chunk_size_09_9315 PASS [ 0.009s] ( 247/2457) harmonia-file-nar archive::read_nar::unittests::read_nar::case_4_empty_file_in_dir::postfix_3_Err_io__ErrorKind__StorageFull_::chunk_size_10_10316 PASS [ 0.010s] ( 248/2457) harmonia-file-nar archive::read_nar::unittests::read_nar::case_4_empty_file_in_dir::postfix_3_Err_io__ErrorKind__StorageFull_::chunk_size_11_11317 PASS [ 0.009s] ( 249/2457) harmonia-file-nar archive::read_nar::unittests::read_nar::case_4_empty_file_in_dir::postfix_3_Err_io__ErrorKind__StorageFull_::chunk_size_12_51318 PASS [ 0.011s] ( 250/2457) harmonia-file-nar archive::read_nar::unittests::read_nar::case_4_empty_file_in_dir::postfix_3_Err_io__ErrorKind__StorageFull_::chunk_size_13_64_000319 PASS [ 0.010s] ( 251/2457) harmonia-file-nar archive::read_nar::unittests::read_nar::case_5_empty_dir::postfix_1_Ok__b_________::chunk_size_01_1320 PASS [ 0.008s] ( 252/2457) harmonia-file-nar archive::read_nar::unittests::read_nar::case_5_empty_dir::postfix_1_Ok__b_________::chunk_size_02_2321 PASS [ 0.008s] ( 253/2457) harmonia-file-nar archive::read_nar::unittests::read_nar::case_5_empty_dir::postfix_1_Ok__b_________::chunk_size_04_4322 PASS [ 0.009s] ( 254/2457) harmonia-file-nar archive::read_nar::unittests::read_nar::case_5_empty_dir::postfix_1_Ok__b_________::chunk_size_03_3323 PASS [ 0.011s] ( 255/2457) harmonia-file-nar archive::read_nar::unittests::read_nar::case_5_empty_dir::postfix_1_Ok__b_________::chunk_size_05_5324 PASS [ 0.010s] ( 256/2457) harmonia-file-nar archive::read_nar::unittests::read_nar::case_5_empty_dir::postfix_1_Ok__b_________::chunk_size_06_6325 PASS [ 0.010s] ( 257/2457) harmonia-file-nar archive::read_nar::unittests::read_nar::case_5_empty_dir::postfix_1_Ok__b_________::chunk_size_07_7326 PASS [ 0.008s] ( 258/2457) harmonia-file-nar archive::read_nar::unittests::read_nar::case_5_empty_dir::postfix_1_Ok__b_________::chunk_size_09_9327 PASS [ 0.009s] ( 259/2457) harmonia-file-nar archive::read_nar::unittests::read_nar::case_5_empty_dir::postfix_1_Ok__b_________::chunk_size_08_8328 PASS [ 0.009s] ( 260/2457) harmonia-file-nar archive::read_nar::unittests::read_nar::case_5_empty_dir::postfix_1_Ok__b_________::chunk_size_10_10329 PASS [ 0.009s] ( 261/2457) harmonia-file-nar archive::read_nar::unittests::read_nar::case_5_empty_dir::postfix_1_Ok__b_________::chunk_size_12_51330 PASS [ 0.010s] ( 262/2457) harmonia-file-nar archive::read_nar::unittests::read_nar::case_5_empty_dir::postfix_1_Ok__b_________::chunk_size_11_11331 PASS [ 0.009s] ( 263/2457) harmonia-file-nar archive::read_nar::unittests::read_nar::case_5_empty_dir::postfix_2_Ok__b__more_______::chunk_size_01_1332 PASS [ 0.009s] ( 264/2457) harmonia-file-nar archive::read_nar::unittests::read_nar::case_5_empty_dir::postfix_2_Ok__b__more_______::chunk_size_03_3333 PASS [ 0.010s] ( 265/2457) harmonia-file-nar archive::read_nar::unittests::read_nar::case_5_empty_dir::postfix_1_Ok__b_________::chunk_size_13_64_000334 PASS [ 0.009s] ( 266/2457) harmonia-file-nar archive::read_nar::unittests::read_nar::case_5_empty_dir::postfix_2_Ok__b__more_______::chunk_size_02_2335 PASS [ 0.010s] ( 267/2457) harmonia-file-nar archive::read_nar::unittests::read_nar::case_5_empty_dir::postfix_2_Ok__b__more_______::chunk_size_05_5336 PASS [ 0.008s] ( 268/2457) harmonia-file-nar archive::read_nar::unittests::read_nar::case_5_empty_dir::postfix_2_Ok__b__more_______::chunk_size_07_7337 PASS [ 0.012s] ( 269/2457) harmonia-file-nar archive::read_nar::unittests::read_nar::case_5_empty_dir::postfix_2_Ok__b__more_______::chunk_size_04_4338 PASS [ 0.010s] ( 270/2457) harmonia-file-nar archive::read_nar::unittests::read_nar::case_5_empty_dir::postfix_2_Ok__b__more_______::chunk_size_06_6339 PASS [ 0.009s] ( 271/2457) harmonia-file-nar archive::read_nar::unittests::read_nar::case_5_empty_dir::postfix_2_Ok__b__more_______::chunk_size_10_10340 PASS [ 0.010s] ( 272/2457) harmonia-file-nar archive::read_nar::unittests::read_nar::case_5_empty_dir::postfix_2_Ok__b__more_______::chunk_size_09_9341 PASS [ 0.009s] ( 273/2457) harmonia-file-nar archive::read_nar::unittests::read_nar::case_5_empty_dir::postfix_2_Ok__b__more_______::chunk_size_11_11342 PASS [ 0.011s] ( 274/2457) harmonia-file-nar archive::read_nar::unittests::read_nar::case_5_empty_dir::postfix_2_Ok__b__more_______::chunk_size_08_8343 PASS [ 0.009s] ( 275/2457) harmonia-file-nar archive::read_nar::unittests::read_nar::case_5_empty_dir::postfix_2_Ok__b__more_______::chunk_size_12_51344 PASS [ 0.009s] ( 276/2457) harmonia-file-nar archive::read_nar::unittests::read_nar::case_5_empty_dir::postfix_2_Ok__b__more_______::chunk_size_13_64_000345 PASS [ 0.009s] ( 277/2457) harmonia-file-nar archive::read_nar::unittests::read_nar::case_5_empty_dir::postfix_3_Err_io__ErrorKind__StorageFull_::chunk_size_02_2346 PASS [ 0.009s] ( 278/2457) harmonia-file-nar archive::read_nar::unittests::read_nar::case_5_empty_dir::postfix_3_Err_io__ErrorKind__StorageFull_::chunk_size_01_1347 PASS [ 0.008s] ( 279/2457) harmonia-file-nar archive::read_nar::unittests::read_nar::case_5_empty_dir::postfix_3_Err_io__ErrorKind__StorageFull_::chunk_size_04_4348 PASS [ 0.009s] ( 280/2457) harmonia-file-nar archive::read_nar::unittests::read_nar::case_5_empty_dir::postfix_3_Err_io__ErrorKind__StorageFull_::chunk_size_03_3349 PASS [ 0.010s] ( 281/2457) harmonia-file-nar archive::read_nar::unittests::read_nar::case_5_empty_dir::postfix_3_Err_io__ErrorKind__StorageFull_::chunk_size_06_6350 PASS [ 0.008s] ( 282/2457) harmonia-file-nar archive::read_nar::unittests::read_nar::case_5_empty_dir::postfix_3_Err_io__ErrorKind__StorageFull_::chunk_size_08_8351 PASS [ 0.011s] ( 283/2457) harmonia-file-nar archive::read_nar::unittests::read_nar::case_5_empty_dir::postfix_3_Err_io__ErrorKind__StorageFull_::chunk_size_05_5352 PASS [ 0.008s] ( 284/2457) harmonia-file-nar archive::read_nar::unittests::read_nar::case_5_empty_dir::postfix_3_Err_io__ErrorKind__StorageFull_::chunk_size_10_10353 PASS [ 0.010s] ( 285/2457) harmonia-file-nar archive::read_nar::unittests::read_nar::case_5_empty_dir::postfix_3_Err_io__ErrorKind__StorageFull_::chunk_size_07_7354 PASS [ 0.011s] ( 286/2457) harmonia-file-nar archive::read_nar::unittests::read_nar::case_5_empty_dir::postfix_3_Err_io__ErrorKind__StorageFull_::chunk_size_09_9355 PASS [ 0.009s] ( 287/2457) harmonia-file-nar archive::read_nar::unittests::read_nar::case_5_empty_dir::postfix_3_Err_io__ErrorKind__StorageFull_::chunk_size_12_51356 PASS [ 0.010s] ( 288/2457) harmonia-file-nar archive::read_nar::unittests::read_nar::case_5_empty_dir::postfix_3_Err_io__ErrorKind__StorageFull_::chunk_size_11_11357 PASS [ 0.008s] ( 289/2457) harmonia-file-nar archive::read_nar::unittests::read_nar::case_5_empty_dir::postfix_3_Err_io__ErrorKind__StorageFull_::chunk_size_13_64_000358 PASS [ 0.009s] ( 290/2457) harmonia-file-nar archive::read_nar::unittests::read_nar::case_6_empty_dir_in_dir::postfix_1_Ok__b_________::chunk_size_01_1359 PASS [ 0.008s] ( 291/2457) harmonia-file-nar archive::read_nar::unittests::read_nar::case_6_empty_dir_in_dir::postfix_1_Ok__b_________::chunk_size_04_4360 PASS [ 0.010s] ( 292/2457) harmonia-file-nar archive::read_nar::unittests::read_nar::case_6_empty_dir_in_dir::postfix_1_Ok__b_________::chunk_size_03_3361 PASS [ 0.010s] ( 293/2457) harmonia-file-nar archive::read_nar::unittests::read_nar::case_6_empty_dir_in_dir::postfix_1_Ok__b_________::chunk_size_05_5362 PASS [ 0.013s] ( 294/2457) harmonia-file-nar archive::read_nar::unittests::read_nar::case_6_empty_dir_in_dir::postfix_1_Ok__b_________::chunk_size_02_2363 PASS [ 0.008s] ( 295/2457) harmonia-file-nar archive::read_nar::unittests::read_nar::case_6_empty_dir_in_dir::postfix_1_Ok__b_________::chunk_size_08_8364 PASS [ 0.010s] ( 296/2457) harmonia-file-nar archive::read_nar::unittests::read_nar::case_6_empty_dir_in_dir::postfix_1_Ok__b_________::chunk_size_06_6365 PASS [ 0.009s] ( 297/2457) harmonia-file-nar archive::read_nar::unittests::read_nar::case_6_empty_dir_in_dir::postfix_1_Ok__b_________::chunk_size_10_10366 PASS [ 0.012s] ( 298/2457) harmonia-file-nar archive::read_nar::unittests::read_nar::case_6_empty_dir_in_dir::postfix_1_Ok__b_________::chunk_size_07_7367 PASS [ 0.011s] ( 299/2457) harmonia-file-nar archive::read_nar::unittests::read_nar::case_6_empty_dir_in_dir::postfix_1_Ok__b_________::chunk_size_09_9368 PASS [ 0.009s] ( 300/2457) harmonia-file-nar archive::read_nar::unittests::read_nar::case_6_empty_dir_in_dir::postfix_1_Ok__b_________::chunk_size_11_11369 PASS [ 0.008s] ( 301/2457) harmonia-file-nar archive::read_nar::unittests::read_nar::case_6_empty_dir_in_dir::postfix_1_Ok__b_________::chunk_size_13_64_000370 PASS [ 0.009s] ( 302/2457) harmonia-file-nar archive::read_nar::unittests::read_nar::case_6_empty_dir_in_dir::postfix_1_Ok__b_________::chunk_size_12_51371 PASS [ 0.008s] ( 303/2457) harmonia-file-nar archive::read_nar::unittests::read_nar::case_6_empty_dir_in_dir::postfix_2_Ok__b__more_______::chunk_size_02_2372 PASS [ 0.011s] ( 304/2457) harmonia-file-nar archive::read_nar::unittests::read_nar::case_6_empty_dir_in_dir::postfix_2_Ok__b__more_______::chunk_size_01_1373 PASS [ 0.009s] ( 305/2457) harmonia-file-nar archive::read_nar::unittests::read_nar::case_6_empty_dir_in_dir::postfix_2_Ok__b__more_______::chunk_size_04_4374 PASS [ 0.010s] ( 306/2457) harmonia-file-nar archive::read_nar::unittests::read_nar::case_6_empty_dir_in_dir::postfix_2_Ok__b__more_______::chunk_size_03_3375 PASS [ 0.009s] ( 307/2457) harmonia-file-nar archive::read_nar::unittests::read_nar::case_6_empty_dir_in_dir::postfix_2_Ok__b__more_______::chunk_size_05_5376 PASS [ 0.010s] ( 308/2457) harmonia-file-nar archive::read_nar::unittests::read_nar::case_6_empty_dir_in_dir::postfix_2_Ok__b__more_______::chunk_size_06_6377 PASS [ 0.010s] ( 309/2457) harmonia-file-nar archive::read_nar::unittests::read_nar::case_6_empty_dir_in_dir::postfix_2_Ok__b__more_______::chunk_size_08_8378 PASS [ 0.010s] ( 310/2457) harmonia-file-nar archive::read_nar::unittests::read_nar::case_6_empty_dir_in_dir::postfix_2_Ok__b__more_______::chunk_size_07_7379 PASS [ 0.010s] ( 311/2457) harmonia-file-nar archive::read_nar::unittests::read_nar::case_6_empty_dir_in_dir::postfix_2_Ok__b__more_______::chunk_size_09_9380 PASS [ 0.008s] ( 312/2457) harmonia-file-nar archive::read_nar::unittests::read_nar::case_6_empty_dir_in_dir::postfix_2_Ok__b__more_______::chunk_size_11_11381 PASS [ 0.009s] ( 313/2457) harmonia-file-nar archive::read_nar::unittests::read_nar::case_6_empty_dir_in_dir::postfix_2_Ok__b__more_______::chunk_size_12_51382 PASS [ 0.009s] ( 314/2457) harmonia-file-nar archive::read_nar::unittests::read_nar::case_6_empty_dir_in_dir::postfix_2_Ok__b__more_______::chunk_size_13_64_000383 PASS [ 0.011s] ( 315/2457) harmonia-file-nar archive::read_nar::unittests::read_nar::case_6_empty_dir_in_dir::postfix_2_Ok__b__more_______::chunk_size_10_10384 PASS [ 0.010s] ( 316/2457) harmonia-file-nar archive::read_nar::unittests::read_nar::case_6_empty_dir_in_dir::postfix_3_Err_io__ErrorKind__StorageFull_::chunk_size_01_1385 PASS [ 0.008s] ( 317/2457) harmonia-file-nar archive::read_nar::unittests::read_nar::case_6_empty_dir_in_dir::postfix_3_Err_io__ErrorKind__StorageFull_::chunk_size_03_3386 PASS [ 0.009s] ( 318/2457) harmonia-file-nar archive::read_nar::unittests::read_nar::case_6_empty_dir_in_dir::postfix_3_Err_io__ErrorKind__StorageFull_::chunk_size_02_2387 PASS [ 0.009s] ( 319/2457) harmonia-file-nar archive::read_nar::unittests::read_nar::case_6_empty_dir_in_dir::postfix_3_Err_io__ErrorKind__StorageFull_::chunk_size_04_4388 PASS [ 0.010s] ( 320/2457) harmonia-file-nar archive::read_nar::unittests::read_nar::case_6_empty_dir_in_dir::postfix_3_Err_io__ErrorKind__StorageFull_::chunk_size_05_5389 PASS [ 0.009s] ( 321/2457) harmonia-file-nar archive::read_nar::unittests::read_nar::case_6_empty_dir_in_dir::postfix_3_Err_io__ErrorKind__StorageFull_::chunk_size_08_8390 PASS [ 0.010s] ( 322/2457) harmonia-file-nar archive::read_nar::unittests::read_nar::case_6_empty_dir_in_dir::postfix_3_Err_io__ErrorKind__StorageFull_::chunk_size_06_6391 PASS [ 0.010s] ( 323/2457) harmonia-file-nar archive::read_nar::unittests::read_nar::case_6_empty_dir_in_dir::postfix_3_Err_io__ErrorKind__StorageFull_::chunk_size_07_7392 PASS [ 0.009s] ( 324/2457) harmonia-file-nar archive::read_nar::unittests::read_nar::case_6_empty_dir_in_dir::postfix_3_Err_io__ErrorKind__StorageFull_::chunk_size_09_9393 PASS [ 0.010s] ( 325/2457) harmonia-file-nar archive::read_nar::unittests::read_nar::case_6_empty_dir_in_dir::postfix_3_Err_io__ErrorKind__StorageFull_::chunk_size_10_10394 PASS [ 0.008s] ( 326/2457) harmonia-file-nar archive::read_nar::unittests::read_nar::case_6_empty_dir_in_dir::postfix_3_Err_io__ErrorKind__StorageFull_::chunk_size_12_51395 PASS [ 0.012s] ( 327/2457) harmonia-file-nar archive::read_nar::unittests::read_nar::case_6_empty_dir_in_dir::postfix_3_Err_io__ErrorKind__StorageFull_::chunk_size_11_11396 PASS [ 0.009s] ( 328/2457) harmonia-file-nar archive::read_nar::unittests::read_nar::case_7_symlink::postfix_1_Ok__b_________::chunk_size_01_1397 PASS [ 0.009s] ( 329/2457) harmonia-file-nar archive::read_nar::unittests::read_nar::case_7_symlink::postfix_1_Ok__b_________::chunk_size_02_2398 PASS [ 0.010s] ( 330/2457) harmonia-file-nar archive::read_nar::unittests::read_nar::case_6_empty_dir_in_dir::postfix_3_Err_io__ErrorKind__StorageFull_::chunk_size_13_64_000399 PASS [ 0.010s] ( 331/2457) harmonia-file-nar archive::read_nar::unittests::read_nar::case_7_symlink::postfix_1_Ok__b_________::chunk_size_03_3400 PASS [ 0.009s] ( 332/2457) harmonia-file-nar archive::read_nar::unittests::read_nar::case_7_symlink::postfix_1_Ok__b_________::chunk_size_04_4401 PASS [ 0.008s] ( 333/2457) harmonia-file-nar archive::read_nar::unittests::read_nar::case_7_symlink::postfix_1_Ok__b_________::chunk_size_06_6402 PASS [ 0.009s] ( 334/2457) harmonia-file-nar archive::read_nar::unittests::read_nar::case_7_symlink::postfix_1_Ok__b_________::chunk_size_05_5403 PASS [ 0.011s] ( 335/2457) harmonia-file-nar archive::read_nar::unittests::read_nar::case_7_symlink::postfix_1_Ok__b_________::chunk_size_07_7404 PASS [ 0.009s] ( 336/2457) harmonia-file-nar archive::read_nar::unittests::read_nar::case_7_symlink::postfix_1_Ok__b_________::chunk_size_08_8405 PASS [ 0.007s] ( 337/2457) harmonia-file-nar archive::read_nar::unittests::read_nar::case_7_symlink::postfix_1_Ok__b_________::chunk_size_12_51406 PASS [ 0.010s] ( 338/2457) harmonia-file-nar archive::read_nar::unittests::read_nar::case_7_symlink::postfix_1_Ok__b_________::chunk_size_11_11407 PASS [ 0.011s] ( 339/2457) harmonia-file-nar archive::read_nar::unittests::read_nar::case_7_symlink::postfix_1_Ok__b_________::chunk_size_10_10408 PASS [ 0.009s] ( 340/2457) harmonia-file-nar archive::read_nar::unittests::read_nar::case_7_symlink::postfix_1_Ok__b_________::chunk_size_13_64_000409 PASS [ 0.011s] ( 341/2457) harmonia-file-nar archive::read_nar::unittests::read_nar::case_7_symlink::postfix_1_Ok__b_________::chunk_size_09_9410 PASS [ 0.008s] ( 342/2457) harmonia-file-nar archive::read_nar::unittests::read_nar::case_7_symlink::postfix_2_Ok__b__more_______::chunk_size_01_1411 PASS [ 0.009s] ( 343/2457) harmonia-file-nar archive::read_nar::unittests::read_nar::case_7_symlink::postfix_2_Ok__b__more_______::chunk_size_04_4412 PASS [ 0.010s] ( 344/2457) harmonia-file-nar archive::read_nar::unittests::read_nar::case_7_symlink::postfix_2_Ok__b__more_______::chunk_size_02_2413 PASS [ 0.009s] ( 345/2457) harmonia-file-nar archive::read_nar::unittests::read_nar::case_7_symlink::postfix_2_Ok__b__more_______::chunk_size_05_5414 PASS [ 0.011s] ( 346/2457) harmonia-file-nar archive::read_nar::unittests::read_nar::case_7_symlink::postfix_2_Ok__b__more_______::chunk_size_03_3415 PASS [ 0.008s] ( 347/2457) harmonia-file-nar archive::read_nar::unittests::read_nar::case_7_symlink::postfix_2_Ok__b__more_______::chunk_size_09_9416 PASS [ 0.009s] ( 348/2457) harmonia-file-nar archive::read_nar::unittests::read_nar::case_7_symlink::postfix_2_Ok__b__more_______::chunk_size_06_6417 PASS [ 0.009s] ( 349/2457) harmonia-file-nar archive::read_nar::unittests::read_nar::case_7_symlink::postfix_2_Ok__b__more_______::chunk_size_07_7418 PASS [ 0.009s] ( 350/2457) harmonia-file-nar archive::read_nar::unittests::read_nar::case_7_symlink::postfix_2_Ok__b__more_______::chunk_size_08_8419 PASS [ 0.008s] ( 351/2457) harmonia-file-nar archive::read_nar::unittests::read_nar::case_7_symlink::postfix_2_Ok__b__more_______::chunk_size_10_10420 PASS [ 0.008s] ( 352/2457) harmonia-file-nar archive::read_nar::unittests::read_nar::case_7_symlink::postfix_2_Ok__b__more_______::chunk_size_13_64_000421 PASS [ 0.009s] ( 353/2457) harmonia-file-nar archive::read_nar::unittests::read_nar::case_7_symlink::postfix_2_Ok__b__more_______::chunk_size_12_51422 PASS [ 0.010s] ( 354/2457) harmonia-file-nar archive::read_nar::unittests::read_nar::case_7_symlink::postfix_2_Ok__b__more_______::chunk_size_11_11423 PASS [ 0.008s] ( 355/2457) harmonia-file-nar archive::read_nar::unittests::read_nar::case_7_symlink::postfix_3_Err_io__ErrorKind__StorageFull_::chunk_size_02_2424 PASS [ 0.010s] ( 356/2457) harmonia-file-nar archive::read_nar::unittests::read_nar::case_7_symlink::postfix_3_Err_io__ErrorKind__StorageFull_::chunk_size_03_3425 PASS [ 0.010s] ( 357/2457) harmonia-file-nar archive::read_nar::unittests::read_nar::case_7_symlink::postfix_3_Err_io__ErrorKind__StorageFull_::chunk_size_01_1426 PASS [ 0.010s] ( 358/2457) harmonia-file-nar archive::read_nar::unittests::read_nar::case_7_symlink::postfix_3_Err_io__ErrorKind__StorageFull_::chunk_size_04_4427 PASS [ 0.010s] ( 359/2457) harmonia-file-nar archive::read_nar::unittests::read_nar::case_7_symlink::postfix_3_Err_io__ErrorKind__StorageFull_::chunk_size_05_5428 PASS [ 0.009s] ( 360/2457) harmonia-file-nar archive::read_nar::unittests::read_nar::case_7_symlink::postfix_3_Err_io__ErrorKind__StorageFull_::chunk_size_06_6429 PASS [ 0.009s] ( 361/2457) harmonia-file-nar archive::read_nar::unittests::read_nar::case_7_symlink::postfix_3_Err_io__ErrorKind__StorageFull_::chunk_size_07_7430 PASS [ 0.009s] ( 362/2457) harmonia-file-nar archive::read_nar::unittests::read_nar::case_7_symlink::postfix_3_Err_io__ErrorKind__StorageFull_::chunk_size_09_9431 PASS [ 0.010s] ( 363/2457) harmonia-file-nar archive::read_nar::unittests::read_nar::case_7_symlink::postfix_3_Err_io__ErrorKind__StorageFull_::chunk_size_08_8432 PASS [ 0.009s] ( 364/2457) harmonia-file-nar archive::read_nar::unittests::read_nar::case_7_symlink::postfix_3_Err_io__ErrorKind__StorageFull_::chunk_size_10_10433 PASS [ 0.009s] ( 365/2457) harmonia-file-nar archive::read_nar::unittests::read_nar::case_7_symlink::postfix_3_Err_io__ErrorKind__StorageFull_::chunk_size_11_11434 PASS [ 0.010s] ( 366/2457) harmonia-file-nar archive::read_nar::unittests::read_nar::case_7_symlink::postfix_3_Err_io__ErrorKind__StorageFull_::chunk_size_12_51435 PASS [ 0.008s] ( 367/2457) harmonia-file-nar archive::read_nar::unittests::read_nar::case_8_dir_example::postfix_1_Ok__b_________::chunk_size_04_4436 PASS [ 0.010s] ( 368/2457) harmonia-file-nar archive::read_nar::unittests::read_nar::case_7_symlink::postfix_3_Err_io__ErrorKind__StorageFull_::chunk_size_13_64_000437 PASS [ 0.008s] ( 369/2457) harmonia-file-nar archive::read_nar::unittests::read_nar::case_8_dir_example::postfix_1_Ok__b_________::chunk_size_06_6438 PASS [ 0.011s] ( 370/2457) harmonia-file-nar archive::read_nar::unittests::read_nar::case_8_dir_example::postfix_1_Ok__b_________::chunk_size_01_1439 PASS [ 0.010s] ( 371/2457) harmonia-file-nar archive::read_nar::unittests::read_nar::case_8_dir_example::postfix_1_Ok__b_________::chunk_size_02_2440 PASS [ 0.009s] ( 372/2457) harmonia-file-nar archive::read_nar::unittests::read_nar::case_8_dir_example::postfix_1_Ok__b_________::chunk_size_05_5441 PASS [ 0.007s] ( 373/2457) harmonia-file-nar archive::read_nar::unittests::read_nar::case_8_dir_example::postfix_1_Ok__b_________::chunk_size_07_7442 PASS [ 0.013s] ( 374/2457) harmonia-file-nar archive::read_nar::unittests::read_nar::case_8_dir_example::postfix_1_Ok__b_________::chunk_size_03_3443 PASS [ 0.008s] ( 375/2457) harmonia-file-nar archive::read_nar::unittests::read_nar::case_8_dir_example::postfix_1_Ok__b_________::chunk_size_10_10444 PASS [ 0.010s] ( 376/2457) harmonia-file-nar archive::read_nar::unittests::read_nar::case_8_dir_example::postfix_1_Ok__b_________::chunk_size_08_8445 PASS [ 0.009s] ( 377/2457) harmonia-file-nar archive::read_nar::unittests::read_nar::case_8_dir_example::postfix_1_Ok__b_________::chunk_size_11_11446 PASS [ 0.010s] ( 378/2457) harmonia-file-nar archive::read_nar::unittests::read_nar::case_8_dir_example::postfix_1_Ok__b_________::chunk_size_09_9447 PASS [ 0.010s] ( 379/2457) harmonia-file-nar archive::read_nar::unittests::read_nar::case_8_dir_example::postfix_1_Ok__b_________::chunk_size_13_64_000448 PASS [ 0.010s] ( 380/2457) harmonia-file-nar archive::read_nar::unittests::read_nar::case_8_dir_example::postfix_2_Ok__b__more_______::chunk_size_01_1449 PASS [ 0.011s] ( 381/2457) harmonia-file-nar archive::read_nar::unittests::read_nar::case_8_dir_example::postfix_1_Ok__b_________::chunk_size_12_51450 PASS [ 0.010s] ( 382/2457) harmonia-file-nar archive::read_nar::unittests::read_nar::case_8_dir_example::postfix_2_Ok__b__more_______::chunk_size_02_2451 PASS [ 0.010s] ( 383/2457) harmonia-file-nar archive::read_nar::unittests::read_nar::case_8_dir_example::postfix_2_Ok__b__more_______::chunk_size_03_3452 PASS [ 0.009s] ( 384/2457) harmonia-file-nar archive::read_nar::unittests::read_nar::case_8_dir_example::postfix_2_Ok__b__more_______::chunk_size_04_4453 PASS [ 0.009s] ( 385/2457) harmonia-file-nar archive::read_nar::unittests::read_nar::case_8_dir_example::postfix_2_Ok__b__more_______::chunk_size_05_5454 PASS [ 0.010s] ( 386/2457) harmonia-file-nar archive::read_nar::unittests::read_nar::case_8_dir_example::postfix_2_Ok__b__more_______::chunk_size_06_6455 PASS [ 0.009s] ( 387/2457) harmonia-file-nar archive::read_nar::unittests::read_nar::case_8_dir_example::postfix_2_Ok__b__more_______::chunk_size_07_7456 PASS [ 0.009s] ( 388/2457) harmonia-file-nar archive::read_nar::unittests::read_nar::case_8_dir_example::postfix_2_Ok__b__more_______::chunk_size_08_8457 PASS [ 0.008s] ( 389/2457) harmonia-file-nar archive::read_nar::unittests::read_nar::case_8_dir_example::postfix_2_Ok__b__more_______::chunk_size_10_10458 PASS [ 0.012s] ( 390/2457) harmonia-file-nar archive::read_nar::unittests::read_nar::case_8_dir_example::postfix_2_Ok__b__more_______::chunk_size_09_9459 PASS [ 0.009s] ( 391/2457) harmonia-file-nar archive::read_nar::unittests::read_nar::case_8_dir_example::postfix_2_Ok__b__more_______::chunk_size_11_11460 PASS [ 0.008s] ( 392/2457) harmonia-file-nar archive::read_nar::unittests::read_nar::case_8_dir_example::postfix_2_Ok__b__more_______::chunk_size_13_64_000461 PASS [ 0.010s] ( 393/2457) harmonia-file-nar archive::read_nar::unittests::read_nar::case_8_dir_example::postfix_2_Ok__b__more_______::chunk_size_12_51462 PASS [ 0.009s] ( 394/2457) harmonia-file-nar archive::read_nar::unittests::read_nar::case_8_dir_example::postfix_3_Err_io__ErrorKind__StorageFull_::chunk_size_02_2463 PASS [ 0.011s] ( 395/2457) harmonia-file-nar archive::read_nar::unittests::read_nar::case_8_dir_example::postfix_3_Err_io__ErrorKind__StorageFull_::chunk_size_01_1464 PASS [ 0.009s] ( 396/2457) harmonia-file-nar archive::read_nar::unittests::read_nar::case_8_dir_example::postfix_3_Err_io__ErrorKind__StorageFull_::chunk_size_04_4465 PASS [ 0.012s] ( 397/2457) harmonia-file-nar archive::read_nar::unittests::read_nar::case_8_dir_example::postfix_3_Err_io__ErrorKind__StorageFull_::chunk_size_03_3466 PASS [ 0.009s] ( 398/2457) harmonia-file-nar archive::read_nar::unittests::read_nar::case_8_dir_example::postfix_3_Err_io__ErrorKind__StorageFull_::chunk_size_05_5467 PASS [ 0.008s] ( 399/2457) harmonia-file-nar archive::read_nar::unittests::read_nar::case_8_dir_example::postfix_3_Err_io__ErrorKind__StorageFull_::chunk_size_06_6468 PASS [ 0.010s] ( 400/2457) harmonia-file-nar archive::read_nar::unittests::read_nar::case_8_dir_example::postfix_3_Err_io__ErrorKind__StorageFull_::chunk_size_07_7469 PASS [ 0.011s] ( 401/2457) harmonia-file-nar archive::read_nar::unittests::read_nar::case_8_dir_example::postfix_3_Err_io__ErrorKind__StorageFull_::chunk_size_08_8470 PASS [ 0.009s] ( 402/2457) harmonia-file-nar archive::read_nar::unittests::read_nar::case_8_dir_example::postfix_3_Err_io__ErrorKind__StorageFull_::chunk_size_10_10471 PASS [ 0.009s] ( 403/2457) harmonia-file-nar archive::read_nar::unittests::read_nar::case_8_dir_example::postfix_3_Err_io__ErrorKind__StorageFull_::chunk_size_11_11472 PASS [ 0.012s] ( 404/2457) harmonia-file-nar archive::read_nar::unittests::read_nar::case_8_dir_example::postfix_3_Err_io__ErrorKind__StorageFull_::chunk_size_09_9473 PASS [ 0.009s] ( 405/2457) harmonia-file-nar archive::read_nar::unittests::read_nar::case_8_dir_example::postfix_3_Err_io__ErrorKind__StorageFull_::chunk_size_12_51474 PASS [ 0.011s] ( 406/2457) harmonia-file-nar archive::read_nar::unittests::read_nar::case_8_dir_example::postfix_3_Err_io__ErrorKind__StorageFull_::chunk_size_13_64_000475 PASS [ 0.009s] ( 407/2457) harmonia-file-nar archive::read_nar::unittests::reject_nonzero_padding::chunk_size_2_3476 PASS [ 0.011s] ( 408/2457) harmonia-file-nar archive::read_nar::unittests::reject_nonzero_padding::chunk_size_1_1477 PASS [ 0.008s] ( 409/2457) harmonia-file-nar archive::read_nar::unittests::reject_nonzero_padding::chunk_size_3_8478 PASS [ 0.008s] ( 410/2457) harmonia-file-nar archive::read_nar::unittests::reject_nonzero_padding::chunk_size_4_64_000479 PASS [ 0.010s] ( 411/2457) harmonia-file-nar archive::restorer::unittests::test_restore::case_2_exec_file480 PASS [ 0.010s] ( 412/2457) harmonia-file-nar archive::restorer::unittests::test_restore::case_1_text_file481 PASS [ 0.010s] ( 413/2457) harmonia-file-nar archive::restorer::unittests::test_restore::case_3_empty_file482 PASS [ 0.009s] ( 414/2457) harmonia-file-nar archive::restorer::unittests::test_restore::case_4_empty_file_in_dir483 PASS [ 0.010s] ( 415/2457) harmonia-file-nar archive::restorer::unittests::test_restore::case_5_empty_dir484 PASS [ 0.012s] ( 416/2457) harmonia-file-nar archive::restorer::unittests::test_restore::case_7_symlink485 PASS [ 0.012s] ( 417/2457) harmonia-file-nar archive::restorer::unittests::test_restore::case_6_empty_dir_in_dir486 PASS [ 0.012s] ( 418/2457) harmonia-file-nar archive::restorer::unittests::test_restore::case_8_dir_example487 PASS [ 0.011s] ( 419/2457) harmonia-file-nar archive::restorer::unittests::test_restore::case_9_case_hack_sorting488 PASS [ 0.011s] ( 420/2457) harmonia-file-nar archive::restorer::unittests::test_restore_data_budget489 FAIL [ 0.011s] ( 421/2457) harmonia-file-nar archive::restorer::unittests::test_restore_does_not_follow_symlink::case_2_file490 stdout ───491492 running 1 test493 test archive::restorer::unittests::test_restore_does_not_follow_symlink::case_2_file ... FAILED494495 failures:496497 failures:498 archive::restorer::unittests::test_restore_does_not_follow_symlink::case_2_file499500 test result: FAILED. 0 passed; 1 failed; 0 ignored; 0 measured; 423 filtered out; finished in 0.00s501502 stderr ───503504 thread 'archive::restorer::unittests::test_restore_does_not_follow_symlink::case_2_file' (93118220) panicked at harmonia-file-nar/src/archive/restorer.rs:627:14:505 called `Result::unwrap_err()` on an `Ok` value: ()506 note: run with `RUST_BACKTRACE=1` environment variable to display a backtrace507508 Cancelling due to test failure: 9 tests still running509 PASS [ 0.009s] ( 422/2457) harmonia-file-nar archive::restorer::unittests::test_restore_dropped510 FAIL [ 0.014s] ( 423/2457) harmonia-file-nar archive::restorer::unittests::test_restore_does_not_follow_symlink::case_1_dir511 stdout ───512513 running 1 test514 test archive::restorer::unittests::test_restore_does_not_follow_symlink::case_1_dir ... FAILED515516 failures:517518 failures:519 archive::restorer::unittests::test_restore_does_not_follow_symlink::case_1_dir520521 test result: FAILED. 0 passed; 1 failed; 0 ignored; 0 measured; 423 filtered out; finished in 0.00s522523 stderr ───524525 thread 'archive::restorer::unittests::test_restore_does_not_follow_symlink::case_1_dir' (93118223) panicked at harmonia-file-nar/src/archive/restorer.rs:627:14:526 called `Result::unwrap_err()` on an `Ok` value: ()527 note: run with `RUST_BACKTRACE=1` environment variable to display a backtrace528529 FAIL [ 0.011s] ( 424/2457) harmonia-file-nar archive::restorer::unittests::test_restore_does_not_follow_symlink::case_3_dangling_file530 stdout ───531532 running 1 test533 test archive::restorer::unittests::test_restore_does_not_follow_symlink::case_3_dangling_file ... FAILED534535 failures:536537 failures:538 archive::restorer::unittests::test_restore_does_not_follow_symlink::case_3_dangling_file539540 test result: FAILED. 0 passed; 1 failed; 0 ignored; 0 measured; 423 filtered out; finished in 0.00s541542 stderr ───543544 thread 'archive::restorer::unittests::test_restore_does_not_follow_symlink::case_3_dangling_file' (93118227) panicked at harmonia-file-nar/src/archive/restorer.rs:627:14:545 called `Result::unwrap_err()` on an `Ok` value: ()546 note: run with `RUST_BACKTRACE=1` environment variable to display a backtrace547548 PASS [ 0.010s] ( 425/2457) harmonia-file-nar archive::restorer::unittests::test_restore_errors549 PASS [ 0.008s] ( 426/2457) harmonia-file-nar archive::restorer::unittests::test_restore_rejects_escape::case_01_dotdot550 PASS [ 0.045s] ( 427/2457) harmonia-file-nar archive::restorer::unittests::test_restore_file_bigger_than_queue551 PASS [ 1.120s] ( 428/2457) harmonia-cache::signing test_signing552 PASS [ 1.705s] ( 429/2457) harmonia-file-nar archive::restorer::proptests::proptest_restore_dump553 PASS [ 26.718s] ( 430/2457) harmonia-cache::retry test_download_retry_over_flaky_connection554────────────555 Summary [ 26.719s] 430/2457 tests run: 427 passed, 3 failed, 0 skipped556 FAIL [ 0.011s] ( 421/2457) harmonia-file-nar archive::restorer::unittests::test_restore_does_not_follow_symlink::case_2_file557 FAIL [ 0.014s] ( 423/2457) harmonia-file-nar archive::restorer::unittests::test_restore_does_not_follow_symlink::case_1_dir558 FAIL [ 0.011s] ( 424/2457) harmonia-file-nar archive::restorer::unittests::test_restore_does_not_follow_symlink::case_3_dangling_file559warning: 2027/2457 tests were not run due to test failure (run with --no-fail-fast to run all tests, or run with --max-fail)560error: test run failed