nixbot

builds

nix-community/lila build #9 failed

branch main · PR #121 · commit 38463da0ff · · took 3m 36s · eval 6s

1 failed
failed attributes
status attribute duration
failed checks.x86_64-linux.packages.utils 2m 59s
nix-util-c-2.36pre20260912_203f85b2+1: FAILED: [code=1] libnixutilc.so.2.36.p/nix_api_util.cc.o g++ -Ilibnixutilc.so.2.36.p -I. -I.. -I/nix/store/2dh3xlnydq4wf …
nix-util-c-2.36pre20260912_203f85b2+1:
FAILED: [code=1] libnixutilc.so.2.36.p/nix_api_util.cc.o 
g++ -Ilibnixutilc.so.2.36.p -I. -I.. -I/nix/store/2dh3xlnydq4wfg9pi31l67k359znq47b-nix-util-2.36pre20260912_203f85b2+1-dev/include -I/nix/store/hq8zqc1b5y0llk0h278b2vv2gxrz9mr5-libarchive-3.8.9-dev/include -I/nix/store/hl8ixlmpd3qzdqd0xy0j6rl665fgb2wy-nlohmann_json-3.12.0/include -fdiagnostics-color=always -D_FILE_OFFSET_BITS=64 -Wall -Winvalid-pch -std=c++23 -O3 -Wdeprecated-copy -Werror=suggest-override -Werror=switch -Werror=switch-enum -Werror=undef -Werror=unused-result -Werror=sign-compare -Werror=return-type -Werror=non-virtual-dtor -Wignored-qualifiers -Wimplicit-fallthrough -Wno-deprecated-declarations -Wno-interference-size -Wno-su…
../nix_api_util.cc:7:10: fatal error: nix/util/posix-source-accessor.hh: No such file or directory
    7 | #include "nix/util/posix-source-accessor.hh"
      |          ^~~~~~~~~~~~~~~~~~~~~~~~~~~~~~~~~~~
compilation terminated.
[2/4] Compiling C++ object libnixutilc.so.2.36.p/nix-meson-build-support_common_assert-fail_wrap-assert-fail.cc.o
ninja: build stopped: subcommand failed.
1 succeeded
succeeded attributes
status attribute duration
loading…