nixbot

builds

nix-community/nixos-anywhere build #139 failed

branch main · PR #711 · commit 0217f6f3a0 · · took 7m 46s · eval 1m 3s

8 failed
failed attributes
status attribute duration
failed checks.x86_64-linux.debian-kexec-test 6m 35s
libcap-ng-static-x86_64-unknown-linux-musl-0.9.5: make[3]: *** [Makefile:634: file_caps_test] Error 1 make[3]: *** Waiting for unfinished jobs.... make[3]: Leav …
libcap-ng-static-x86_64-unknown-linux-musl-0.9.5:
make[3]: *** [Makefile:634: file_caps_test] Error 1
make[3]: *** Waiting for unfinished jobs....
make[3]: Leaving directory '/build/source/src/test'
make[2]: *** [Makefile:995: check-am] Error 2
make[2]: Leaving directory '/build/source/src/test'
make[1]: *** [Makefile:622: check-recursive] Error 1
make[1]: Leaving directory '/build/source/src'
make: *** [Makefile:466: check-recursive] Error 1
failed checks.x86_64-linux.fedora-kexec-test 6m 11s
libcap-ng-static-x86_64-unknown-linux-musl-0.9.5: make[3]: *** [Makefile:634: file_caps_test] Error 1 make[3]: *** Waiting for unfinished jobs.... make[3]: Leav …
libcap-ng-static-x86_64-unknown-linux-musl-0.9.5:
make[3]: *** [Makefile:634: file_caps_test] Error 1
make[3]: *** Waiting for unfinished jobs....
make[3]: Leaving directory '/build/source/src/test'
make[2]: *** [Makefile:995: check-am] Error 2
make[2]: Leaving directory '/build/source/src/test'
make[1]: *** [Makefile:622: check-recursive] Error 1
make[1]: Leaving directory '/build/source/src'
make: *** [Makefile:466: check-recursive] Error 1
failed checks.x86_64-linux.from-nixos 4m 26s
libcap-ng-static-x86_64-unknown-linux-musl-0.9.5: make[3]: *** Waiting for unfinished jobs.... libtool: link: x86_64-unknown-linux-musl-gcc -g -O2 -o change_id_ …
libcap-ng-static-x86_64-unknown-linux-musl-0.9.5:
make[3]: *** Waiting for unfinished jobs....
libtool: link: x86_64-unknown-linux-musl-gcc -g -O2 -o change_id_test change_id_test.o  ../../src/.libs/libcap-ng.a
make[3]: Leaving directory '/build/source/src/test'
make[2]: *** [Makefile:995: check-am] Error 2
make[2]: Leaving directory '/build/source/src/test'
make[1]: *** [Makefile:622: check-recursive] Error 1
make[1]: Leaving directory '/build/source/src'
make: *** [Makefile:466: check-recursive] Error 1
failed checks.x86_64-linux.from-nixos-build-on-remote 4m 28s
libcap-ng-static-x86_64-unknown-linux-musl-0.9.5: make[3]: *** [Makefile:634: file_caps_test] Error 1 make[3]: *** Waiting for unfinished jobs.... make[3]: Leav …
libcap-ng-static-x86_64-unknown-linux-musl-0.9.5:
make[3]: *** [Makefile:634: file_caps_test] Error 1
make[3]: *** Waiting for unfinished jobs....
make[3]: Leaving directory '/build/source/src/test'
make[2]: *** [Makefile:995: check-am] Error 2
make[2]: Leaving directory '/build/source/src/test'
make[1]: *** [Makefile:622: check-recursive] Error 1
make[1]: Leaving directory '/build/source/src'
make: *** [Makefile:466: check-recursive] Error 1
failed checks.x86_64-linux.from-nixos-separated-phases 4m 25s
libcap-ng-static-x86_64-unknown-linux-musl-0.9.5: make[3]: *** [Makefile:634: file_caps_test] Error 1 make[3]: *** Waiting for unfinished jobs.... make[3]: Leav …
libcap-ng-static-x86_64-unknown-linux-musl-0.9.5:
make[3]: *** [Makefile:634: file_caps_test] Error 1
make[3]: *** Waiting for unfinished jobs....
make[3]: Leaving directory '/build/source/src/test'
make[2]: *** [Makefile:995: check-am] Error 2
make[2]: Leaving directory '/build/source/src/test'
make[1]: *** [Makefile:622: check-recursive] Error 1
make[1]: Leaving directory '/build/source/src'
make: *** [Makefile:466: check-recursive] Error 1
failed checks.x86_64-linux.from-nixos-with-generated-config 3m 39s
libcap-ng-static-x86_64-unknown-linux-musl-0.9.5: make[3]: *** [Makefile:634: file_caps_test] Error 1 make[3]: *** Waiting for unfinished jobs.... make[3]: Leav …
libcap-ng-static-x86_64-unknown-linux-musl-0.9.5:
make[3]: *** [Makefile:634: file_caps_test] Error 1
make[3]: *** Waiting for unfinished jobs....
make[3]: Leaving directory '/build/source/src/test'
make[2]: *** [Makefile:995: check-am] Error 2
make[2]: Leaving directory '/build/source/src/test'
make[1]: *** [Makefile:622: check-recursive] Error 1
make[1]: Leaving directory '/build/source/src'
make: *** [Makefile:466: check-recursive] Error 1
failed checks.x86_64-linux.from-nixos-with-sudo 3m 38s
libcap-ng-static-x86_64-unknown-linux-musl-0.9.5: make[3]: *** Waiting for unfinished jobs.... libtool: link: x86_64-unknown-linux-musl-gcc -g -O2 -o change_id_ …
libcap-ng-static-x86_64-unknown-linux-musl-0.9.5:
make[3]: *** Waiting for unfinished jobs....
libtool: link: x86_64-unknown-linux-musl-gcc -g -O2 -o change_id_test change_id_test.o  ../../src/.libs/libcap-ng.a
make[3]: Leaving directory '/build/source/src/test'
make[2]: *** [Makefile:995: check-am] Error 2
make[2]: Leaving directory '/build/source/src/test'
make[1]: *** [Makefile:622: check-recursive] Error 1
make[1]: Leaving directory '/build/source/src'
make: *** [Makefile:466: check-recursive] Error 1
failed checks.x86_64-linux.ubuntu-kexec-test 6m 18s
libcap-ng-static-x86_64-unknown-linux-musl-0.9.5: make[3]: *** Waiting for unfinished jobs.... libtool: link: x86_64-unknown-linux-musl-gcc -g -O2 -o change_id_ …
libcap-ng-static-x86_64-unknown-linux-musl-0.9.5:
make[3]: *** Waiting for unfinished jobs....
libtool: link: x86_64-unknown-linux-musl-gcc -g -O2 -o change_id_test change_id_test.o  ../../src/.libs/libcap-ng.a
make[3]: Leaving directory '/build/source/src/test'
make[2]: *** [Makefile:995: check-am] Error 2
make[2]: Leaving directory '/build/source/src/test'
make[1]: *** [Makefile:622: check-recursive] Error 1
make[1]: Leaving directory '/build/source/src'
make: *** [Makefile:466: check-recursive] Error 1
17 succeeded
succeeded attributes
status attribute duration
loading…