nixbot

builds

nix-community/nixos-anywhere build #141 failed

branch main · PR #711 · commit d772367c6a · · took 3m 11s · eval 55s

8 failed
failed attributes
status attribute duration
failed checks.x86_64-linux.debian-kexec-test 37s
libcap-ng-static-x86_64-unknown-linux-musl-0.9.5: make[3]: *** [Makefile:634: file_caps_test] Error 1 make[3]: *** Waiting for unfinished jobs.... make[3]: Leav …
libcap-ng-static-x86_64-unknown-linux-musl-0.9.5:
make[3]: *** [Makefile:634: file_caps_test] Error 1
make[3]: *** Waiting for unfinished jobs....
make[3]: Leaving directory '/build/source/src/test'
make[2]: *** [Makefile:995: check-am] Error 2
make[2]: Leaving directory '/build/source/src/test'
make[1]: *** [Makefile:622: check-recursive] Error 1
make[1]: Leaving directory '/build/source/src'
make: *** [Makefile:466: check-recursive] Error 1
failed checks.x86_64-linux.fedora-kexec-test 12s
libcap-ng-static-x86_64-unknown-linux-musl-0.9.5: make[3]: *** [Makefile:634: file_caps_test] Error 1 make[3]: *** Waiting for unfinished jobs.... make[3]: Leav …
libcap-ng-static-x86_64-unknown-linux-musl-0.9.5:
make[3]: *** [Makefile:634: file_caps_test] Error 1
make[3]: *** Waiting for unfinished jobs....
make[3]: Leaving directory '/build/source/src/test'
make[2]: *** [Makefile:995: check-am] Error 2
make[2]: Leaving directory '/build/source/src/test'
make[1]: *** [Makefile:622: check-recursive] Error 1
make[1]: Leaving directory '/build/source/src'
make: *** [Makefile:466: check-recursive] Error 1
failed checks.x86_64-linux.from-nixos 22s
libcap-ng-static-x86_64-unknown-linux-musl-0.9.5: make[3]: *** [Makefile:634: file_caps_test] Error 1 make[3]: *** Waiting for unfinished jobs.... make[3]: Leav …
libcap-ng-static-x86_64-unknown-linux-musl-0.9.5:
make[3]: *** [Makefile:634: file_caps_test] Error 1
make[3]: *** Waiting for unfinished jobs....
make[3]: Leaving directory '/build/source/src/test'
make[2]: *** [Makefile:995: check-am] Error 2
make[2]: Leaving directory '/build/source/src/test'
make[1]: *** [Makefile:622: check-recursive] Error 1
make[1]: Leaving directory '/build/source/src'
make: *** [Makefile:466: check-recursive] Error 1
failed checks.x86_64-linux.from-nixos-build-on-remote 48s
libcap-ng-static-x86_64-unknown-linux-musl-0.9.5: make[3]: *** Waiting for unfinished jobs.... libtool: link: x86_64-unknown-linux-musl-gcc -g -O2 -o change_id_ …
libcap-ng-static-x86_64-unknown-linux-musl-0.9.5:
make[3]: *** Waiting for unfinished jobs....
libtool: link: x86_64-unknown-linux-musl-gcc -g -O2 -o change_id_test change_id_test.o  ../../src/.libs/libcap-ng.a
make[3]: Leaving directory '/build/source/src/test'
make[2]: *** [Makefile:995: check-am] Error 2
make[2]: Leaving directory '/build/source/src/test'
make[1]: *** [Makefile:622: check-recursive] Error 1
make[1]: Leaving directory '/build/source/src'
make: *** [Makefile:466: check-recursive] Error 1
failed checks.x86_64-linux.from-nixos-separated-phases 1m 12s
libcap-ng-static-x86_64-unknown-linux-musl-0.9.5: make[3]: *** Waiting for unfinished jobs.... libtool: link: x86_64-unknown-linux-musl-gcc -g -O2 -o change_id_ …
libcap-ng-static-x86_64-unknown-linux-musl-0.9.5:
make[3]: *** Waiting for unfinished jobs....
libtool: link: x86_64-unknown-linux-musl-gcc -g -O2 -o change_id_test change_id_test.o  ../../src/.libs/libcap-ng.a
make[3]: Leaving directory '/build/source/src/test'
make[2]: *** [Makefile:995: check-am] Error 2
make[2]: Leaving directory '/build/source/src/test'
make[1]: *** [Makefile:622: check-recursive] Error 1
make[1]: Leaving directory '/build/source/src'
make: *** [Makefile:466: check-recursive] Error 1
failed checks.x86_64-linux.from-nixos-with-generated-config 27s
libcap-ng-static-x86_64-unknown-linux-musl-0.9.5: make[3]: *** Waiting for unfinished jobs.... libtool: link: x86_64-unknown-linux-musl-gcc -g -O2 -o change_id_ …
libcap-ng-static-x86_64-unknown-linux-musl-0.9.5:
make[3]: *** Waiting for unfinished jobs....
libtool: link: x86_64-unknown-linux-musl-gcc -g -O2 -o change_id_test change_id_test.o  ../../src/.libs/libcap-ng.a
make[3]: Leaving directory '/build/source/src/test'
make[2]: *** [Makefile:995: check-am] Error 2
make[2]: Leaving directory '/build/source/src/test'
make[1]: *** [Makefile:622: check-recursive] Error 1
make[1]: Leaving directory '/build/source/src'
make: *** [Makefile:466: check-recursive] Error 1
failed checks.x86_64-linux.from-nixos-with-sudo 42s
libcap-ng-static-x86_64-unknown-linux-musl-0.9.5: make[3]: *** Waiting for unfinished jobs.... libtool: link: x86_64-unknown-linux-musl-gcc -g -O2 -o change_id_ …
libcap-ng-static-x86_64-unknown-linux-musl-0.9.5:
make[3]: *** Waiting for unfinished jobs....
libtool: link: x86_64-unknown-linux-musl-gcc -g -O2 -o change_id_test change_id_test.o  ../../src/.libs/libcap-ng.a
make[3]: Leaving directory '/build/source/src/test'
make[2]: *** [Makefile:995: check-am] Error 2
make[2]: Leaving directory '/build/source/src/test'
make[1]: *** [Makefile:622: check-recursive] Error 1
make[1]: Leaving directory '/build/source/src'
make: *** [Makefile:466: check-recursive] Error 1
failed checks.x86_64-linux.ubuntu-kexec-test 1m 18s
libcap-ng-static-x86_64-unknown-linux-musl-0.9.5: make[3]: *** Waiting for unfinished jobs.... libtool: link: x86_64-unknown-linux-musl-gcc -g -O2 -o change_id_ …
libcap-ng-static-x86_64-unknown-linux-musl-0.9.5:
make[3]: *** Waiting for unfinished jobs....
libtool: link: x86_64-unknown-linux-musl-gcc -g -O2 -o change_id_test change_id_test.o  ../../src/.libs/libcap-ng.a
make[3]: Leaving directory '/build/source/src/test'
make[2]: *** [Makefile:995: check-am] Error 2
make[2]: Leaving directory '/build/source/src/test'
make[1]: *** [Makefile:622: check-recursive] Error 1
make[1]: Leaving directory '/build/source/src'
make: *** [Makefile:466: check-recursive] Error 1
8 succeeded
succeeded attributes
status attribute duration
loading…
9 already built
skipped attributes
status attribute duration
loading…