nixbot

builds

failed libcap-ng-static-x86_64-unknown-linux-musl-0.9.5 checks.x86_64-linux.from-nixos · build #142 · raw

1tribuchet: building on jamie2structuredAttrs is enabled
unpackPhase
3unpacking source archive /nix/store/1ms6h943w9p8whx8m71wzfd6bczn61ff-source4source root is source5setting SOURCE_DATE_EPOCH to timestamp 1787534266 of file "source/COPYING.LIB"
autoreconfPhase
6autoreconf: export WARNINGS=7autoreconf: Entering directory '.'8autoreconf: configure.ac: no obvious need to run autopoint9autoreconf: running: aclocal --force -I m410autoreconf: configure.ac: tracing11autoreconf: running: libtoolize --copy --force12libtoolize: putting auxiliary files in '.'.13libtoolize: copying file './ltmain.sh'14libtoolize: putting macros in AC_CONFIG_MACRO_DIRS, 'm4'.15libtoolize: copying file 'm4/libtool.m4'16libtoolize: copying file 'm4/ltoptions.m4'17libtoolize: copying file 'm4/ltsugar.m4'18libtoolize: copying file 'm4/ltversion.m4'19libtoolize: copying file 'm4/lt~obsolete.m4'20autoreconf: configure.ac: not using Intltool21autoreconf: configure.ac: not using Gtkdoc22autoreconf: configure.ac: no need to run autopoint (confirmed)23autoreconf: running: aclocal --force -I m424autoreconf: running: /nix/store/khvvqawiqhcz4i4frnxn7wjxchps7wj5-autoconf-2.73/bin/autoconf --force25autoreconf: running: /nix/store/khvvqawiqhcz4i4frnxn7wjxchps7wj5-autoconf-2.73/bin/autoheader --force26autoreconf: running: automake --add-missing --copy --force-missing27configure.ac:41: installing './compile'28configure.ac:39: installing './config.guess'29configure.ac:39: installing './config.sub'30configure.ac:40: installing './install-sh'31configure.ac:40: installing './missing'32bindings/python3/Makefile.am: installing './depcomp'33bindings/python3/Makefile.am:30: installing './py-compile'34parallel-tests: installing './test-driver'35utils/cap-audit/test/Makefile.am:24: warning: source file '${top_srcdir}/utils/cap-audit/cap_audit_event.c' is in a subdirectory,36utils/cap-audit/test/Makefile.am:24: but option 'subdir-objects' is disabled37automake: warning: possible forward-incompatibility.38automake: At least one source file is in a subdirectory, but the 'subdir-objects'39automake: automake option hasn't been enabled. For now, the corresponding output40automake: object file(s) will be placed in the top-level directory. However, this41automake: behavior may change in a future Automake major version, with object42automake: files being placed in the same subdirectory as the corresponding sources.43automake: You are advised to start using 'subdir-objects' option throughout your44automake: project, to avoid future incompatibility.45utils/cap-audit/test/Makefile.am:24: warning: source file '${top_srcdir}/utils/cap-audit/cap_audit_analyze.c' is in a subdirectory,46utils/cap-audit/test/Makefile.am:24: but option 'subdir-objects' is disabled47utils/cap-audit/test/Makefile.am:24: warning: source file '${top_srcdir}/utils/cap-audit/cap_audit_capset.c' is in a subdirectory,48utils/cap-audit/test/Makefile.am:24: but option 'subdir-objects' is disabled49utils/cap-audit/test/Makefile.am:24: warning: source file '${top_srcdir}/utils/cap-audit/cap_audit_outcome.c' is in a subdirectory,50utils/cap-audit/test/Makefile.am:24: but option 'subdir-objects' is disabled51utils/cap-audit/test/Makefile.am:29: warning: source file '${top_srcdir}/utils/cap-audit/cap_audit_event.c' is in a subdirectory,52utils/cap-audit/test/Makefile.am:29: but option 'subdir-objects' is disabled53utils/cap-audit/test/Makefile.am:29: warning: source file '${top_srcdir}/utils/cap-audit/cap_audit_analyze.c' is in a subdirectory,54utils/cap-audit/test/Makefile.am:29: but option 'subdir-objects' is disabled55utils/cap-audit/test/Makefile.am:29: warning: source file '${top_srcdir}/utils/cap-audit/cap_audit_capset.c' is in a subdirectory,56utils/cap-audit/test/Makefile.am:29: but option 'subdir-objects' is disabled57utils/cap-audit/test/Makefile.am:29: warning: source file '${top_srcdir}/utils/cap-audit/cap_audit_json.c' is in a subdirectory,58utils/cap-audit/test/Makefile.am:29: but option 'subdir-objects' is disabled59utils/cap-audit/test/Makefile.am:29: warning: source file '${top_srcdir}/utils/cap-audit/cap_audit_outcome.c' is in a subdirectory,60utils/cap-audit/test/Makefile.am:29: but option 'subdir-objects' is disabled61utils/cap-audit/test/Makefile.am:29: warning: source file '${top_srcdir}/utils/cap-audit/cap_audit_yaml.c' is in a subdirectory,62utils/cap-audit/test/Makefile.am:29: but option 'subdir-objects' is disabled63utils/cap-audit/test/Makefile.am:18: warning: source file '${top_srcdir}/utils/cap-audit/cap_audit_path.c' is in a subdirectory,64utils/cap-audit/test/Makefile.am:18: but option 'subdir-objects' is disabled65utils/cap-audit/test/Makefile.am:37: warning: source file '${top_srcdir}/utils/cap-audit/cap_audit_analyze.c' is in a subdirectory,66utils/cap-audit/test/Makefile.am:37: but option 'subdir-objects' is disabled67utils/cap-audit/test/Makefile.am:37: warning: source file '${top_srcdir}/utils/cap-audit/cap_audit_capset.c' is in a subdirectory,68utils/cap-audit/test/Makefile.am:37: but option 'subdir-objects' is disabled69utils/cap-audit/test/Makefile.am:37: warning: source file '${top_srcdir}/utils/cap-audit/cap_audit_outcome.c' is in a subdirectory,70utils/cap-audit/test/Makefile.am:37: but option 'subdir-objects' is disabled71utils/cap-audit/test/Makefile.am:41: warning: source file '${top_srcdir}/utils/cap-audit/cap_audit_service.c' is in a subdirectory,72utils/cap-audit/test/Makefile.am:41: but option 'subdir-objects' is disabled73utils/cap-audit/test/Makefile.am:15: warning: source file '${top_srcdir}/utils/cap-audit/classify_app.c' is in a subdirectory,74utils/cap-audit/test/Makefile.am:15: but option 'subdir-objects' is disabled75utils/test/Makefile.am:18: warning: source file '${top_srcdir}/utils/pscap.c' is in a subdirectory,76utils/test/Makefile.am:18: but option 'subdir-objects' is disabled77utils/test/Makefile.am:18: warning: source file '${top_srcdir}/utils/netcap.c' is in a subdirectory,78utils/test/Makefile.am:18: but option 'subdir-objects' is disabled79utils/test/Makefile.am:18: warning: source file '${top_srcdir}/utils/proc-account.c' is in a subdirectory,80utils/test/Makefile.am:18: but option 'subdir-objects' is disabled81utils/test/Makefile.am:18: warning: source file '${top_srcdir}/utils/proc-llist.c' is in a subdirectory,82utils/test/Makefile.am:18: but option 'subdir-objects' is disabled83utils/test/Makefile.am:18: warning: source file '${top_srcdir}/utils/proc-output.c' is in a subdirectory,84utils/test/Makefile.am:18: but option 'subdir-objects' is disabled85utils/test/Makefile.am:18: warning: source file '${top_srcdir}/utils/proc-sanitize.c' is in a subdirectory,86utils/test/Makefile.am:18: but option 'subdir-objects' is disabled87utils/test/Makefile.am:13: warning: source file '${top_srcdir}/utils/filecap-path.c' is in a subdirectory,88utils/test/Makefile.am:13: but option 'subdir-objects' is disabled89utils/test/Makefile.am:13: warning: source file '${top_srcdir}/utils/proc-account.c' is in a subdirectory,90utils/test/Makefile.am:13: but option 'subdir-objects' is disabled91utils/test/Makefile.am:13: warning: source file '${top_srcdir}/utils/proc-status.c' is in a subdirectory,92utils/test/Makefile.am:13: but option 'subdir-objects' is disabled93autoreconf: configure.ac: not running make: --make not given94autoreconf: Leaving directory '.'
updateAutotoolsGnuConfigScriptsPhase
95Updating Autotools / GNU config script to a newer upstream version: ./config.sub96Updating Autotools / GNU config script to a newer upstream version: ./config.guess97Updating Autotools / GNU config script to a newer upstream version: ./config.sub98Updating Autotools / GNU config script to a newer upstream version: ./config.guess
configurePhase
99fixing libtool script ./ltmain.sh100./configure101patching script interpreter paths in ./configure102./configure: interpreter directive changed from "#! /bin/sh" to "/nix/store/svx59425zxp552p2b8gm11qj5r09b56i-bash-5.3p15/bin/sh"103configure flags: --disable-dependency-tracking --prefix=/nix/store/80hfc2q0rq7zhw52llpdzasjwazd54kn-libcap-ng-static-x86_64-unknown-linux-musl-0.9.5 --bindir=/nix/store/80hfc2q0rq7zhw52llpdzasjwazd54kn-libcap-ng-static-x86_64-unknown-linux-musl-0.9.5/bin --sbindir=/nix/store/80hfc2q0rq7zhw52llpdzasjwazd54kn-libcap-ng-static-x86_64-unknown-linux-musl-0.9.5/sbin --includedir=/nix/store/34sqwbj5fhhaaka8zsg5zj9f0xirlqa7-libcap-ng-static-x86_64-unknown-linux-musl-0.9.5-dev/include --mandir=/nix/store/lhpgq61sf0fpmpmzzj2yjy9ycmdm14mf-libcap-ng-static-x86_64-unknown-linux-musl-0.9.5-man/share/man --infodir=/nix/store/80hfc2q0rq7zhw52llpdzasjwazd54kn-libcap-ng-static-x86_64-unknown-linux-musl-0.9.5/share/info --docdir=/nix/store/80hfc2q0rq7zhw52llpdzasjwazd54kn-libcap-ng-static-x86_64-unknown-linux-musl-0.9.5/share/doc/libcap-ng --libdir=/nix/store/80hfc2q0rq7zhw52llpdzasjwazd54kn-libcap-ng-static-x86_64-unknown-linux-musl-0.9.5/lib --libexecdir=/nix/store/80hfc2q0rq7zhw52llpdzasjwazd54kn-libcap-ng-static-x86_64-unknown-linux-musl-0.9.5/libexec --localedir=/nix/store/80hfc2q0rq7zhw52llpdzasjwazd54kn-libcap-ng-static-x86_64-unknown-linux-musl-0.9.5/share/locale --without-python --with-capability_header=\'/nix/store/vqvgrzwwpxwckalbxcl90wj05zx1xryf-linux-headers-static-7.2/include/linux/capability.h\' --enable-static --disable-shared --disable-shared --build=x86_64-unknown-linux-gnu --host=x86_64-unknown-linux-musl104Configuring libcap-ng105checking build system type... x86_64-unknown-linux-gnu106checking host system type... x86_64-unknown-linux-musl107checking target system type... x86_64-unknown-linux-musl108checking for a BSD-compatible install... /nix/store/xjl7p8dvyk2j53kqf7f43kdj4ypbxz7g-coreutils-9.11/bin/install -c109checking whether sleep supports fractional seconds... yes110checking filesystem timestamp resolution... 0.01111checking whether build environment is sane... yes112checking for x86_64-unknown-linux-musl-strip... x86_64-unknown-linux-musl-strip113checking for a race-free mkdir -p... /nix/store/xjl7p8dvyk2j53kqf7f43kdj4ypbxz7g-coreutils-9.11/bin/mkdir -p114checking for gawk... gawk115checking whether make sets $(MAKE)... yes116checking whether make supports nested variables... yes117checking xargs -n works... yes118checking whether UID '1000' is supported by ustar format... yes119checking whether GID '100' is supported by ustar format... yes120checking how to create a ustar tar archive... gnutar121checking how to print strings... printf122checking whether make supports the include directive... yes (GNU style)123checking for x86_64-unknown-linux-musl-gcc... x86_64-unknown-linux-musl-gcc124checking whether the C compiler works... yes125checking for C compiler default output file name... a.out126checking for suffix of executables... 127checking whether we are cross compiling... yes128checking for suffix of object files... o129checking whether the compiler supports GNU C... yes130checking whether x86_64-unknown-linux-musl-gcc accepts -g... yes131checking for x86_64-unknown-linux-musl-gcc option to enable C23 features... unsupported132checking for x86_64-unknown-linux-musl-gcc option to enable C11 features... none needed133checking whether x86_64-unknown-linux-musl-gcc understands -c and -o together... yes134checking dependency style of x86_64-unknown-linux-musl-gcc... none135checking for a sed that does not truncate output... /nix/store/qf2wzyq4irhgyhnq3s2hz0ldjq3w8a3x-gnused-4.10/bin/sed136checking for grep that handles long lines and -e... /nix/store/xmvbzzxm5snla5a2cyfhm7hjy9bifx7n-gnugrep-3.12/bin/grep137checking for egrep... /nix/store/xmvbzzxm5snla5a2cyfhm7hjy9bifx7n-gnugrep-3.12/bin/grep -E138checking for fgrep... /nix/store/xmvbzzxm5snla5a2cyfhm7hjy9bifx7n-gnugrep-3.12/bin/grep -F139checking for ld used by x86_64-unknown-linux-musl-gcc... x86_64-unknown-linux-musl-ld140checking if the linker (x86_64-unknown-linux-musl-ld) is GNU ld... yes141checking for BSD- or MS-compatible name lister (nm)... x86_64-unknown-linux-musl-nm142checking the name lister (x86_64-unknown-linux-musl-nm) interface... BSD nm143checking whether ln -s works... yes144checking the maximum length of command line arguments... 32768145checking how to convert x86_64-unknown-linux-gnu file names to x86_64-unknown-linux-musl format... func_convert_file_noop146checking how to convert x86_64-unknown-linux-gnu file names to toolchain format... func_convert_file_noop147checking for x86_64-unknown-linux-musl-ld option to reload object files... -r148checking for file... file149checking for x86_64-unknown-linux-musl-objdump... x86_64-unknown-linux-musl-objdump150checking how to recognize dependent libraries... (cached) pass_all151checking for x86_64-unknown-linux-musl-dlltool... no152checking for dlltool... no153checking how to associate runtime and link libraries... printf %s\n154checking for x86_64-unknown-linux-musl-ranlib... x86_64-unknown-linux-musl-ranlib155checking for x86_64-unknown-linux-musl-ar... x86_64-unknown-linux-musl-ar156checking for archiver @FILE support... @157checking for x86_64-unknown-linux-musl-strip... (cached) x86_64-unknown-linux-musl-strip158checking command to parse x86_64-unknown-linux-musl-nm output from x86_64-unknown-linux-musl-gcc object... ok159checking for sysroot... no160checking for a working dd... /nix/store/xjl7p8dvyk2j53kqf7f43kdj4ypbxz7g-coreutils-9.11/bin/dd161checking how to truncate binary pipes... /nix/store/xjl7p8dvyk2j53kqf7f43kdj4ypbxz7g-coreutils-9.11/bin/dd bs=4096 count=1162checking for x86_64-unknown-linux-musl-mt... no163checking for mt... no164checking if : is a manifest tool... no165checking for stdio.h... yes166checking for stdlib.h... yes167checking for string.h... yes168checking for inttypes.h... yes169checking for stdint.h... yes170checking for strings.h... yes171checking for sys/stat.h... yes172checking for sys/types.h... yes173checking for unistd.h... yes174checking for dlfcn.h... yes175checking which variant of shared library versioning to provide... (default) aix176checking for objdir... .libs177checking if x86_64-unknown-linux-musl-gcc supports -fno-rtti -fno-exceptions... no178checking for x86_64-unknown-linux-musl-gcc option to produce PIC... -fPIC -DPIC179checking if x86_64-unknown-linux-musl-gcc PIC flag -fPIC -DPIC works... yes180checking if x86_64-unknown-linux-musl-gcc static flag -static works... yes181checking if x86_64-unknown-linux-musl-gcc supports -c -o file.o... yes182checking if x86_64-unknown-linux-musl-gcc supports -c -o file.o... (cached) yes183checking whether the x86_64-unknown-linux-musl-gcc linker (x86_64-unknown-linux-musl-ld -m elf_x86_64) supports shared libraries... yes184checking dynamic linker characteristics... GNU/Linux ld.so185checking how to hardcode library paths into programs... immediate186checking whether stripping libraries is possible... yes187checking if libtool supports shared libraries... yes188checking whether to build shared libraries... no189checking whether to build static libraries... yes190checking pkg-config is at least version 0.9.0... yes191.192Checking for programs193checking for x86_64-unknown-linux-musl-gcc... (cached) x86_64-unknown-linux-musl-gcc194checking whether the compiler supports GNU C... (cached) yes195checking whether x86_64-unknown-linux-musl-gcc accepts -g... (cached) yes196checking for x86_64-unknown-linux-musl-gcc option to enable C23 features... (cached) unsupported197checking for x86_64-unknown-linux-musl-gcc option to enable C11 features... (cached) none needed198checking whether x86_64-unknown-linux-musl-gcc understands -c and -o together... (cached) yes199checking dependency style of x86_64-unknown-linux-musl-gcc... (cached) none200checking for gawk... (cached) gawk201checking for __atomic_load_n... yes202checking enable-deprecated... no203.204Checking for header files205checking for linux/capability.h... yes206checking for sys/xattr.h... yes207checking for linux/securebits.h... yes208checking for bluetooth/bluetooth.h... no209checking for bluetooth/hci.h... no210checking for linux/inet_diag.h... yes211checking for linux/netlink.h... yes212checking for linux/sock_diag.h... yes213checking for sys/socket.h... yes214checking for linux/vm_sockets.h... yes215checking for linux/vm_sockets_diag.h... yes216checking for pthread.h... yes217checking for library containing pthread_atfork... none required218checking for sys/vfs.h... yes219checking for linux/magic.h... yes220configure: netcap advanced mode enabled221checking __attr_dealloc_free support... no222checking for -Wformat-truncation... yes223checking for sys/syscall.h... yes224checking for x86_64-unknown-linux-musl-gcc options to detect undeclared functions... none needed225checking for x86_64-unknown-linux-musl-gcc options to ignore future-version functions... none needed226checking whether PR_CAP_AMBIENT is declared... yes227checking whether VFS_CAP_REVISION_2 is declared... yes228checking whether VFS_CAP_REVISION_3 is declared... yes229checking whether CAP_EPOLLWAKEUP is declared... no230checking whether CAP_WAKE_ALARM is declared... yes231checking whether CAP_BLOCK_SUSPEND is declared... yes232checking whether CAP_AUDIT_READ is declared... yes233checking whether CAP_PERFMON is declared... yes234checking whether CAP_BPF is declared... yes235checking whether CAP_CHECKPOINT_RESTORE is declared... yes236checking whether to create python3 bindings... no237checking that generated files are newer than configure... done238configure: creating ./config.status239config.status: creating Makefile240config.status: creating src/Makefile241config.status: creating src/libcap-ng.pc242config.status: creating src/test/Makefile243config.status: creating bindings/Makefile244config.status: creating bindings/python3/Makefile245config.status: creating bindings/src/Makefile246config.status: creating bindings/python3/test/Makefile247config.status: creating bindings/test/Makefile248config.status: creating utils/Makefile249config.status: creating utils/test/Makefile250config.status: creating utils/cap-audit/Makefile251config.status: creating utils/cap-audit/test/Makefile252config.status: creating m4/Makefile253config.status: creating docs/Makefile254config.status: creating config.h255config.status: executing depfiles commands256config.status: executing libtool commands257config.status: executing utils/netcap.8 commands258.259260261 libcap-ng Version: 0.9.5262 Target: x86_64-unknown-linux-musl263 Installation prefix: /nix/store/80hfc2q0rq7zhw52llpdzasjwazd54kn-libcap-ng-static-x86_64-unknown-linux-musl-0.9.5264 Build Kernel: 6.11.0265 Compiler: x86_64-unknown-linux-musl-gcc266 Compiler flags:267 -g -O2268 __attr_dealloc_free support: no269 netcap advanced mode: enabled270 netcap VSOCK support: enabled271 cap-audit vmlinux.h: n/a (cap-audit disabled)272
buildPhase
273build flags: -j24 SHELL=/nix/store/svx59425zxp552p2b8gm11qj5r09b56i-bash-5.3p15/bin/bash274make all-recursive275make[1]: Entering directory '/build/source'276Making all in src277make[2]: Entering directory '/build/source/src'278Making all in test279make[3]: Entering directory '/build/source/src/test'280make[3]: Nothing to be done for 'all'.281make[3]: Leaving directory '/build/source/src/test'282make[3]: Entering directory '/build/source/src'283/nix/store/svx59425zxp552p2b8gm11qj5r09b56i-bash-5.3p15/bin/bash ../libtool --tag=CC --mode=compile x86_64-unknown-linux-musl-gcc -DHAVE_CONFIG_H -I. -I.. -I. -I.. -fPIC -DPIC -W -Wall -Wshadow -Wno-format-truncation -Wundef -D_GNU_SOURCE -g -O2 -c -o cap-ng.lo cap-ng.c284/nix/store/svx59425zxp552p2b8gm11qj5r09b56i-bash-5.3p15/bin/bash ../libtool --tag=CC --mode=compile x86_64-unknown-linux-musl-gcc -DHAVE_CONFIG_H -I. -I.. -I. -I.. -fPIC -DPIC -W -Wall -Wshadow -Wno-format-truncation -Wundef -D_GNU_SOURCE -g -O2 -c -o lookup_table.lo lookup_table.c285/nix/store/svx59425zxp552p2b8gm11qj5r09b56i-bash-5.3p15/bin/bash ../libtool --tag=CC --mode=compile x86_64-unknown-linux-musl-gcc -DHAVE_CONFIG_H -I. -I.. -I. -I.. -fPIC -DPIC -W -Wall -Wshadow -Wno-format-truncation -Wundef -D_GNU_SOURCE -g -O2 -c -o libdrop_ambient.lo libdrop_ambient.c286libtool: compile: x86_64-unknown-linux-musl-gcc -DHAVE_CONFIG_H -I. -I.. -I. -I.. -fPIC -DPIC -W -Wall -Wshadow -Wno-format-truncation -Wundef -D_GNU_SOURCE -g -O2 -c lookup_table.c -o lookup_table.o287libtool: compile: x86_64-unknown-linux-musl-gcc -DHAVE_CONFIG_H -I. -I.. -I. -I.. -fPIC -DPIC -W -Wall -Wshadow -Wno-format-truncation -Wundef -D_GNU_SOURCE -g -O2 -c cap-ng.c -o cap-ng.o288libtool: compile: x86_64-unknown-linux-musl-gcc -DHAVE_CONFIG_H -I. -I.. -I. -I.. -fPIC -DPIC -W -Wall -Wshadow -Wno-format-truncation -Wundef -D_GNU_SOURCE -g -O2 -c libdrop_ambient.c -o libdrop_ambient.o289/nix/store/svx59425zxp552p2b8gm11qj5r09b56i-bash-5.3p15/bin/bash ../libtool --tag=CC --mode=link x86_64-unknown-linux-musl-gcc -fPIC -DPIC -W -Wall -Wshadow -Wno-format-truncation -Wundef -D_GNU_SOURCE -g -O2 -o libdrop_ambient.la -rpath /nix/store/80hfc2q0rq7zhw52llpdzasjwazd54kn-libcap-ng-static-x86_64-unknown-linux-musl-0.9.5/lib libdrop_ambient.lo 290libtool: link: x86_64-unknown-linux-musl-ar cr .libs/libdrop_ambient.a libdrop_ambient.o291libtool: link: x86_64-unknown-linux-musl-ranlib .libs/libdrop_ambient.a292libtool: link: ( cd ".libs" && rm -f "libdrop_ambient.la" && ln -s "../libdrop_ambient.la" "libdrop_ambient.la" )293/nix/store/svx59425zxp552p2b8gm11qj5r09b56i-bash-5.3p15/bin/bash ../libtool --tag=CC --mode=link x86_64-unknown-linux-musl-gcc -fPIC -DPIC -W -Wall -Wshadow -Wno-format-truncation -Wundef -D_GNU_SOURCE -g -O2 -Wl,-z,relro -Wl,-z,nodelete -o libcap-ng.la -rpath /nix/store/80hfc2q0rq7zhw52llpdzasjwazd54kn-libcap-ng-static-x86_64-unknown-linux-musl-0.9.5/lib cap-ng.lo lookup_table.lo 294libtool: link: x86_64-unknown-linux-musl-ar cr .libs/libcap-ng.a cap-ng.o lookup_table.o295libtool: link: x86_64-unknown-linux-musl-ranlib .libs/libcap-ng.a296libtool: link: ( cd ".libs" && rm -f "libcap-ng.la" && ln -s "../libcap-ng.la" "libcap-ng.la" )297make[3]: Leaving directory '/build/source/src'298make[2]: Leaving directory '/build/source/src'299Making all in utils300make[2]: Entering directory '/build/source/utils'301Making all in test302make[3]: Entering directory '/build/source/utils/test'303make[3]: Nothing to be done for 'all'.304make[3]: Leaving directory '/build/source/utils/test'305Making all in cap-audit306make[3]: Entering directory '/build/source/utils/cap-audit'307make all-recursive308make[4]: Entering directory '/build/source/utils/cap-audit'309Making all in test310make[5]: Entering directory '/build/source/utils/cap-audit/test'311make[5]: Nothing to be done for 'all'.312make[5]: Leaving directory '/build/source/utils/cap-audit/test'313make[5]: Entering directory '/build/source/utils/cap-audit'314make[5]: Nothing to be done for 'all-am'.315make[5]: Leaving directory '/build/source/utils/cap-audit'316make[4]: Leaving directory '/build/source/utils/cap-audit'317make[3]: Leaving directory '/build/source/utils/cap-audit'318make[3]: Entering directory '/build/source/utils'319x86_64-unknown-linux-musl-gcc -DHAVE_CONFIG_H -I. -I.. -I.. -I../src -W -Wall -Wshadow -Wno-format-truncation -Wundef -D_GNU_SOURCE -g -O2 -c -o pscap.o pscap.c320x86_64-unknown-linux-musl-gcc -DHAVE_CONFIG_H -I. -I.. -I.. -I../src -W -Wall -Wshadow -Wno-format-truncation -Wundef -D_GNU_SOURCE -g -O2 -c -o proc-account.o proc-account.c321x86_64-unknown-linux-musl-gcc -DHAVE_CONFIG_H -I. -I.. -I.. -I../src -W -Wall -Wshadow -Wno-format-truncation -Wundef -D_GNU_SOURCE -g -O2 -c -o proc-output.o proc-output.c322x86_64-unknown-linux-musl-gcc -DHAVE_CONFIG_H -I. -I.. -I.. -I../src -W -Wall -Wshadow -Wno-format-truncation -Wundef -D_GNU_SOURCE -g -O2 -c -o proc-sanitize.o proc-sanitize.c323x86_64-unknown-linux-musl-gcc -DHAVE_CONFIG_H -I. -I.. -I.. -I../src -W -Wall -Wshadow -Wno-format-truncation -Wundef -D_GNU_SOURCE -g -O2 -c -o proc-status.o proc-status.c324x86_64-unknown-linux-musl-gcc -DHAVE_CONFIG_H -I. -I.. -I.. -I../src -W -Wall -Wshadow -Wno-format-truncation -Wundef -D_GNU_SOURCE -g -O2 -c -o netcap.o netcap.c325x86_64-unknown-linux-musl-gcc -DHAVE_CONFIG_H -I. -I.. -I.. -I../src -W -Wall -Wshadow -Wno-format-truncation -Wundef -D_GNU_SOURCE -g -O2 -c -o proc-llist.o proc-llist.c326x86_64-unknown-linux-musl-gcc -DHAVE_CONFIG_H -I. -I.. -I.. -I../src -W -Wall -Wshadow -Wno-format-truncation -Wundef -D_GNU_SOURCE -g -O2 -c -o netcap-advanced.o netcap-advanced.c327x86_64-unknown-linux-musl-gcc -DHAVE_CONFIG_H -I. -I.. -I.. -I../src -W -Wall -Wshadow -Wno-format-truncation -Wundef -D_GNU_SOURCE -g -O2 -c -o filecap.o filecap.c328x86_64-unknown-linux-musl-gcc -DHAVE_CONFIG_H -I. -I.. -I.. -I../src -W -Wall -Wshadow -Wno-format-truncation -Wundef -D_GNU_SOURCE -g -O2 -c -o filecap-path.o filecap-path.c329In file included from gcc-attributes.h:7,330 from proc-account.h:17,331 from proc-account.c:22:332/nix/store/71ydp3bkg9c37kc3hngij1hyg7m61gvw-x86_64-unknown-linux-musl-gcc-15.3.0/x86_64-unknown-linux-musl/sys-include/sys/cdefs.h:1:2: warning: #warning usage of non-standard #include <sys/cdefs.h> is deprecated [-Wcpp]333 1 | #warning usage of non-standard #include <sys/cdefs.h> is deprecated334 | ^~~~~~~335In file included from gcc-attributes.h:7,336 from proc-status.h:16,337 from proc-status.c:16:338/nix/store/71ydp3bkg9c37kc3hngij1hyg7m61gvw-x86_64-unknown-linux-musl-gcc-15.3.0/x86_64-unknown-linux-musl/sys-include/sys/cdefs.h:1:2: warning: #warning usage of non-standard #include <sys/cdefs.h> is deprecated [-Wcpp]339 1 | #warning usage of non-standard #include <sys/cdefs.h> is deprecated340 | ^~~~~~~341In file included from gcc-attributes.h:7,342 from proc-sanitize.h:28,343 from proc-sanitize.c:29:344/nix/store/71ydp3bkg9c37kc3hngij1hyg7m61gvw-x86_64-unknown-linux-musl-gcc-15.3.0/x86_64-unknown-linux-musl/sys-include/sys/cdefs.h:1:2: warning: #warning usage of non-standard #include <sys/cdefs.h> is deprecated [-Wcpp]345 1 | #warning usage of non-standard #include <sys/cdefs.h> is deprecated346 | ^~~~~~~347In file included from gcc-attributes.h:7,348 from proc-output.h:16,349 from proc-output.c:19:350/nix/store/71ydp3bkg9c37kc3hngij1hyg7m61gvw-x86_64-unknown-linux-musl-gcc-15.3.0/x86_64-unknown-linux-musl/sys-include/sys/cdefs.h:1:2: warning: #warning usage of non-standard #include <sys/cdefs.h> is deprecated [-Wcpp]351 1 | #warning usage of non-standard #include <sys/cdefs.h> is deprecated352 | ^~~~~~~353In file included from gcc-attributes.h:7,354 from filecap-path.h:15,355 from filecap-path.c:22:356/nix/store/71ydp3bkg9c37kc3hngij1hyg7m61gvw-x86_64-unknown-linux-musl-gcc-15.3.0/x86_64-unknown-linux-musl/sys-include/sys/cdefs.h:1:2: warning: #warning usage of non-standard #include <sys/cdefs.h> is deprecated [-Wcpp]357 1 | #warning usage of non-standard #include <sys/cdefs.h> is deprecated358 | ^~~~~~~359In file included from gcc-attributes.h:7,360 from proc-llist.h:30,361 from proc-llist.c:28:362/nix/store/71ydp3bkg9c37kc3hngij1hyg7m61gvw-x86_64-unknown-linux-musl-gcc-15.3.0/x86_64-unknown-linux-musl/sys-include/sys/cdefs.h:1:2: warning: #warning usage of non-standard #include <sys/cdefs.h> is deprecated [-Wcpp]363 1 | #warning usage of non-standard #include <sys/cdefs.h> is deprecated364 | ^~~~~~~365In file included from gcc-attributes.h:7,366 from proc-account.h:17,367 from pscap.c:37:368/nix/store/71ydp3bkg9c37kc3hngij1hyg7m61gvw-x86_64-unknown-linux-musl-gcc-15.3.0/x86_64-unknown-linux-musl/sys-include/sys/cdefs.h:1:2: warning: #warning usage of non-standard #include <sys/cdefs.h> is deprecated [-Wcpp]369 1 | #warning usage of non-standard #include <sys/cdefs.h> is deprecated370 | ^~~~~~~371In file included from gcc-attributes.h:7,372 from proc-account.h:17,373 from netcap.c:53:374/nix/store/71ydp3bkg9c37kc3hngij1hyg7m61gvw-x86_64-unknown-linux-musl-gcc-15.3.0/x86_64-unknown-linux-musl/sys-include/sys/cdefs.h:1:2: warning: #warning usage of non-standard #include <sys/cdefs.h> is deprecated [-Wcpp]375 1 | #warning usage of non-standard #include <sys/cdefs.h> is deprecated376 | ^~~~~~~377In file included from gcc-attributes.h:7,378 from filecap-path.h:15,379 from filecap.c:32:380/nix/store/71ydp3bkg9c37kc3hngij1hyg7m61gvw-x86_64-unknown-linux-musl-gcc-15.3.0/x86_64-unknown-linux-musl/sys-include/sys/cdefs.h:1:2: warning: #warning usage of non-standard #include <sys/cdefs.h> is deprecated [-Wcpp]381 1 | #warning usage of non-standard #include <sys/cdefs.h> is deprecated382 | ^~~~~~~383In file included from gcc-attributes.h:7,384 from netcap-advanced.h:28,385 from netcap-advanced.c:63:386/nix/store/71ydp3bkg9c37kc3hngij1hyg7m61gvw-x86_64-unknown-linux-musl-gcc-15.3.0/x86_64-unknown-linux-musl/sys-include/sys/cdefs.h:1:2: warning: #warning usage of non-standard #include <sys/cdefs.h> is deprecated [-Wcpp]387 1 | #warning usage of non-standard #include <sys/cdefs.h> is deprecated388 | ^~~~~~~389/nix/store/svx59425zxp552p2b8gm11qj5r09b56i-bash-5.3p15/bin/bash ../libtool --tag=CC --mode=link x86_64-unknown-linux-musl-gcc -W -Wall -Wshadow -Wno-format-truncation -Wundef -D_GNU_SOURCE -g -O2 -o filecap filecap.o filecap-path.o ../src/libcap-ng.la 390/nix/store/svx59425zxp552p2b8gm11qj5r09b56i-bash-5.3p15/bin/bash ../libtool --tag=CC --mode=link x86_64-unknown-linux-musl-gcc -W -Wall -Wshadow -Wno-format-truncation -Wundef -D_GNU_SOURCE -g -O2 -o pscap pscap.o proc-account.o proc-output.o proc-sanitize.o proc-status.o ../src/libcap-ng.la 391libtool: link: x86_64-unknown-linux-musl-gcc -W -Wall -Wshadow -Wno-format-truncation -Wundef -D_GNU_SOURCE -g -O2 -o filecap filecap.o filecap-path.o ../src/.libs/libcap-ng.a392libtool: link: x86_64-unknown-linux-musl-gcc -W -Wall -Wshadow -Wno-format-truncation -Wundef -D_GNU_SOURCE -g -O2 -o pscap pscap.o proc-account.o proc-output.o proc-sanitize.o proc-status.o ../src/.libs/libcap-ng.a393/nix/store/svx59425zxp552p2b8gm11qj5r09b56i-bash-5.3p15/bin/bash ../libtool --tag=CC --mode=link x86_64-unknown-linux-musl-gcc -W -Wall -Wshadow -Wno-format-truncation -Wundef -D_GNU_SOURCE -g -O2 -o netcap netcap.o proc-llist.o proc-account.o proc-sanitize.o netcap-advanced.o proc-output.o proc-status.o ../src/libcap-ng.la 394libtool: link: x86_64-unknown-linux-musl-gcc -W -Wall -Wshadow -Wno-format-truncation -Wundef -D_GNU_SOURCE -g -O2 -o netcap netcap.o proc-llist.o proc-account.o proc-sanitize.o netcap-advanced.o proc-output.o proc-status.o ../src/.libs/libcap-ng.a395make[3]: Leaving directory '/build/source/utils'396make[2]: Leaving directory '/build/source/utils'397Making all in m4398make[2]: Entering directory '/build/source/m4'399make[2]: Nothing to be done for 'all'.400make[2]: Leaving directory '/build/source/m4'401Making all in docs402make[2]: Entering directory '/build/source/docs'403make[2]: Nothing to be done for 'all'.404make[2]: Leaving directory '/build/source/docs'405make[2]: Entering directory '/build/source'406make[2]: Leaving directory '/build/source'407make[1]: Leaving directory '/build/source'
checkPhase
408patching script interpreter paths in bindings/test bindings/python3/test409check flags: -j24 SHELL=/nix/store/svx59425zxp552p2b8gm11qj5r09b56i-bash-5.3p15/bin/bash VERBOSE=y check410Making check in src411make[1]: Entering directory '/build/source/src'412Making check in test413make[2]: Entering directory '/build/source/src/test'414make lib_test thread_test change_id_test file_caps_test securebits_test415make[3]: Entering directory '/build/source/src/test'416x86_64-unknown-linux-musl-gcc -DHAVE_CONFIG_H -I. -I../.. -I../.. -I../../src -g -O2 -c -o lib_test.o lib_test.c417x86_64-unknown-linux-musl-gcc -DHAVE_CONFIG_H -I. -I../.. -I../.. -I../../src -g -O2 -c -o thread_test.o thread_test.c418x86_64-unknown-linux-musl-gcc -DHAVE_CONFIG_H -I. -I../.. -I../.. -I../../src -g -O2 -c -o change_id_test.o change_id_test.c419x86_64-unknown-linux-musl-gcc -DHAVE_CONFIG_H -I. -I../.. -I../.. -I../../src -g -O2 -c -o file_caps_test.o file_caps_test.c420x86_64-unknown-linux-musl-gcc -DHAVE_CONFIG_H -I. -I../.. -I../.. -I../../src -g -O2 -c -o securebits_test.o securebits_test.c421/nix/store/svx59425zxp552p2b8gm11qj5r09b56i-bash-5.3p15/bin/bash ../../libtool --tag=CC --mode=link x86_64-unknown-linux-musl-gcc -g -O2 -o thread_test thread_test.o ../../src/libcap-ng.la -lpthread 422/nix/store/svx59425zxp552p2b8gm11qj5r09b56i-bash-5.3p15/bin/bash ../../libtool --tag=CC --mode=link x86_64-unknown-linux-musl-gcc -g -O2 -o securebits_test securebits_test.o ../../src/libcap-ng.la 423/nix/store/svx59425zxp552p2b8gm11qj5r09b56i-bash-5.3p15/bin/bash ../../libtool --tag=CC --mode=link x86_64-unknown-linux-musl-gcc -g -O2 -o file_caps_test file_caps_test.o ../../src/libcap-ng.la 424/nix/store/svx59425zxp552p2b8gm11qj5r09b56i-bash-5.3p15/bin/bash ../../libtool --tag=CC --mode=link x86_64-unknown-linux-musl-gcc -g -O2 -o lib_test lib_test.o ../../src/libcap-ng.la 425libtool: link: x86_64-unknown-linux-musl-gcc -g -O2 -o thread_test thread_test.o ../../src/.libs/libcap-ng.a -lpthread426libtool: link: x86_64-unknown-linux-musl-gcc -g -O2 -o securebits_test securebits_test.o ../../src/.libs/libcap-ng.a427libtool: link: x86_64-unknown-linux-musl-gcc -g -O2 -o file_caps_test file_caps_test.o ../../src/.libs/libcap-ng.a428/nix/store/svx59425zxp552p2b8gm11qj5r09b56i-bash-5.3p15/bin/bash ../../libtool --tag=CC --mode=link x86_64-unknown-linux-musl-gcc -g -O2 -o change_id_test change_id_test.o ../../src/libcap-ng.la 429/nix/store/60lv8wlcr99wv4ck3sk9fzcbb4jbk2n6-x86_64-unknown-linux-musl-binutils-2.46/bin/x86_64-unknown-linux-musl-ld.bfd: /nix/store/x3ga6nq5bxfnip0lz80zb2pi111y914a-musl-static-x86_64-unknown-linux-musl-1.2.6/lib/libc.a(xattr.lo): in function `fgetxattr':430(.text.fgetxattr+0x0): multiple definition of `fgetxattr'; file_caps_test.o:/build/source/src/test/file_caps_test.c:78: first defined here431/nix/store/60lv8wlcr99wv4ck3sk9fzcbb4jbk2n6-x86_64-unknown-linux-musl-binutils-2.46/bin/x86_64-unknown-linux-musl-ld.bfd: /nix/store/x3ga6nq5bxfnip0lz80zb2pi111y914a-musl-static-x86_64-unknown-linux-musl-1.2.6/lib/libc.a(xattr.lo): in function `fsetxattr':432(.text.fsetxattr+0x0): multiple definition of `fsetxattr'; file_caps_test.o:/build/source/src/test/file_caps_test.c:libtool: link: x86_64-unknown-linux-musl-gcc -g -O2 -o lib_test lib_test.o ../../src/.libs/libcap-ng.a433129: first defined here434collect2: error: ld returned 1 exit status435make[3]: *** [Makefile:634: file_caps_test] Error 1436make[3]: *** Waiting for unfinished jobs....437libtool: link: x86_64-unknown-linux-musl-gcc -g -O2 -o change_id_test change_id_test.o ../../src/.libs/libcap-ng.a438make[3]: Leaving directory '/build/source/src/test'439make[2]: *** [Makefile:995: check-am] Error 2440make[2]: Leaving directory '/build/source/src/test'441make[1]: *** [Makefile:622: check-recursive] Error 1442make[1]: Leaving directory '/build/source/src'443make: *** [Makefile:466: check-recursive] Error 1