setup
checks.aarch64-linux.nixos-blob64
· build #597
· raw
1these 802 derivations will be built:2 /nix/store/yf40ah94ks2a27dcgczx8nk0l4gi0pjg-binutils-wrapper-2.46.drv3 /nix/store/q5bfmffw60zfzlvsppxfwas0mzccz1n1-gcc-wrapper-15.3.0.drv4 /nix/store/4nwx7nxn8hgxakcm4kwgr7v5jzv2rb68-stdenv-linux.drv5 /nix/store/00bzn7xn0c1f6rr8nndgsjkaq55184g6-cargo-package-libbz2-rs-sys-0.2.3.drv6 /nix/store/04nyg1x3rqn4vjin710n80s9w85a1bmy-cargo-package-tracing-log-0.2.0.drv7 /nix/store/xsc5q2qlzxx6v88m2jads117gx3y617d-locales-setup-hook.sh.drv8 /nix/store/dkw6jzs3kfsdlv3n2g8agiinril34xrr-glibc-locales-2.42-84.drv9 /nix/store/0669vv51d79mmvmil2wsn4myv3x93bb9-unit-systemd-pstore.service.drv10 /nix/store/3w5hcas1vkhmd9x5h10cyd531kwj9ppy-zfs-user-2.4.4.drv11 /nix/store/w6q4sb4lid4ryy6m1c8llj712zf9h4dg-zfstools-0.1.0.drv12 /nix/store/066a50i020rqndvsr9jjd8k10cvr9ybg-unit-zfs-snapshot-weekly.service.drv13 /nix/store/rwhakk9pkss0qlg6gybszblp5b08zdk7-extra-udev-rules.drv14 /nix/store/09axswssgk1z07mvw8s7aynz9pjsd27w-hwdb.bin.drv15 /nix/store/0a4pnvxsziwpx3xdchlb8cfg69b0d5l2-cargo-package-bytes-1.11.1.drv16 /nix/store/0b5nrl92gcp1ii2qld0hkcizg7m6rzsg-cargo-package-num-conv-0.2.1.drv17 /nix/store/0bbknwwcss3f3bg2k1f8ig9ki81aha10-cargo-package-wasi-0.11.1+wasi-snapshot-preview1.drv18 /nix/store/0byzbs5y8fgq0rjil8bsvll67v73d698-sudoers-in.drv19 /nix/store/0df5nkxg98v74yjr23am4qn1b3xambrm-cargo-package-displaydoc-0.2.5.drv20 /nix/store/0dpp58zp7wqv52qkva3vh266yqrbcjan-cargo-package-bitflags-2.11.1.drv21 /nix/store/0rigc9i21dzlmjghliylpxzhm7lwq6my-nix-util-2.36.0pre.drv22 /nix/store/qpbzddzzs9hqzzy4wm3r8pzildk1pn7g-nix-util-c-2.36.0pre.drv23 /nix/store/8rl3zhmcm1wkpavmffjpdmi91lnpsaya-nix-util-test-support-2.36.0pre.drv24 /nix/store/0ig147nccqvjksm3bkjc8awjcp46f2c8-nix-util-tests-2.36.0pre.drv25 /nix/store/0khamb8vwril1040r4k8x5fjcfd6hc4p-cargo-package-impl-more-0.1.9.drv26 /nix/store/0lyvia1yhvwilmcpprniisp4kbjicdnl-locale.conf.drv27 /nix/store/0npmqlnzcyx6g39rm0vyqhi1p9hc5622-unit-systemd-journald-.service.drv28 /nix/store/0qf0j0isbijhaa54bjwfv5qmj88ms1jv-cargo-package-rustls-pki-types-1.15.1.drv29 /nix/store/0w9kfbjyvd7c8m20ldihl9xgxp098zpa-cargo-package-crossbeam-epoch-0.9.18.drv30 /nix/store/q81wf7lbpy63nv24ggvnlavyrid57kjd-nix-store-2.36.0pre.drv31 /nix/store/h3xfgrpi57dw87d2jlygsm8rv5742w18-nix-fetchers-2.36.0pre.drv32 /nix/store/50hswb9qggi559vz079c2159kbrdsrdw-nix-tarmac-0.1.0.drv33 /nix/store/a31dg9va1akpag8k3pqdnkvv82xmizp8-nix-tarmac-0.1.0.drv34 /nix/store/b6xrvdqf47whabx1g995z54322ir3a63-nix-tarmac-0.1.0.drv35 /nix/store/7m4a32138nk28pdhdyqg9z8x7wnnhzp8-nix-util-2.36.0pre20260828_7f711bef.drv36 /nix/store/s8vk5r1774f1f2yvgc3a9fmf0x13ch6j-nix-store-2.36.0pre20260828_7f711bef.drv37 /nix/store/9z1kkdgwv4dka2vb4nikl6n4kv5bd6ns-nix-fetchers-2.36.0pre20260828_7f711bef.drv38 /nix/store/r3rr67s9mgvjfkd9i9prxxqa88dr9zdd-nix-tarmac-0.1.0.drv39 /nix/store/fpq6afwabf8c4c9nwgyaaa8gxjzipys0-nix-tarmac-dispatcher.drv40 /nix/store/jf9gqapzq058aw92si9m5gc3d9zdcqkh-boehm-gc-8.2.12.drv41 /nix/store/hp3bzjjm6lv57lqd3m3civlp2028rv0n-nix-expr-2.36.0pre.drv42 /nix/store/4s9qm0rcij04b53zs25xqn394i2wd01m-nix-main-2.36.0pre.drv43 /nix/store/f5hrvwd60mk96kldds6rkgch4rmnxpcw-nix-flake-2.36.0pre.drv44 /nix/store/6b69l6iih0v29j60kzbkja2jmyz8kzxk-nix-cmd-2.36.0pre.drv45 /nix/store/al96a832dh276rrrzfl5sblxwj2dw9mf-mimalloc-3.5.1.drv46 /nix/store/nfwk21li85s7fdqh5jh33z2hgffarqlb-nix-store-c-2.36.0pre.drv47 /nix/store/b9da3r70g1c44z3pjx90hf4csgbwb7p5-nix-expr-c-2.36.0pre.drv48 /nix/store/z1yr8xvgz01066clvm7haz4dnbjd4y5m-nix-fetchers-c-2.36.0pre.drv49 /nix/store/crq9bc61sdcz9sj6rvg2r3fdgci1xzyb-nix-flake-c-2.36.0pre.drv50 /nix/store/fkgf79wmx2kbl4p6ng7ix3jplwa3nky8-nix-main-c-2.36.0pre.drv51 /nix/store/5aialp11ip2zk74ivf8b7gv6rpvzwsas-nix-2.36.0pre20260916_1de45ba.drv52 /nix/store/5mcpi4kiqmlbzxgsy06cmd4nvzdgwg6p-nix-util-tests-run-without-new-syscalls.drv53 /nix/store/4228brbbmiql8xyvhcrw4dmhyr5vs1z8-exec.drv54 /nix/store/6q3zb9wnm8bk94jxzyrdiy11p5lp9mar-nix-util-tests-run.drv55 /nix/store/7hc9icbm8dwnq0saky68dz0b5w8zksyd-nix-functional-tests-2.36.0pre20260916_1de45ba.drv56 /nix/store/1kfrzfk8sl43qj638qlx5n4ax1l7smh1-nix-store-test-support-2.36.0pre.drv57 /nix/store/g9jkzzf3cyqg0jm0mwh0xkcbi8pyjqgx-nix-fetchers-tests-2.36.0pre.drv58 /nix/store/afpayj8yyh50vw437anfwnj01lva23i8-nix-fetchers-tests-run.drv59 /nix/store/pc6agdihjn3n2dg3jv5ch102w8h2hpfd-nix-util-test-support-2.36.0pre.drv60 /nix/store/jyk37vq24szhhks3y6gwxdaircn6clxw-nix-expr-tests-2.36.0pre.drv61 /nix/store/fb0dlygc8bhj1hs0y9z4clqr097d1lfd-nix-expr-tests-run.drv62 /nix/store/kaf6a4m5cjzcvkmclgcg7w90jmz508m6-nix-store-tests-2.36.0pre.drv63 /nix/store/fx3swbxbq1vd6kvs2rps48a9f6iixq4f-nix-store-tests-run.drv64 /nix/store/kg5xz47s1c2amd9cs9arvk2kax906rhf-nix-manual-2.36.0pre20260916_1de45ba.drv65 /nix/store/xrq386nqh3142c2f0sa9y5jcwnc349ws-nix-flake-tests-2.36.0pre.drv66 /nix/store/q79aqf02pnqnq4y8pmy0ifab4hxiz2h4-nix-flake-tests-run.drv67 /nix/store/qdzadhix71s15hj2igf0x3dk2i2lzmln-nix-nswrapper-2.36.0pre.drv68 /nix/store/qmlqxiikrb6vsri0cb8mcj237m4fk3fr-nix-2.36.0pre20260916_1de45ba.drv69 /nix/store/p4xg9n5v9q8cla23zq2ax07wawkdnyar-nix.conf.drv70 /nix/store/0x7vxzkf6kb6zfwq81c4ssazgyz571ss-X-Restart-Triggers-nix-daemon.drv71 /nix/store/2r2l9v3c0g9c3mm6f6mbf1h62ymyh1l0-nixos-rebuild-ng-26.11.drv72 /nix/store/8c8g2g8raihb0d6kb462f545f2dibdrj-nixos-version.drv73 /nix/store/gpqzp3z0sdq1k2d07nvafhg1r1z7f4z4-resize.drv74 /nix/store/k8cp9p1sz6p34a5k3jl6p1gi42fqk490-nix-grpc-cert.drv75 /nix/store/100nbwps2pfzk3y2mv3iw65iqp6vmmwl-cargo-package-hex-0.4.3.drv76 /nix/store/1lv2rxjk7bwkmpaj3nziarg4ldxjiaz1-cargo-package-syn-2.0.117.drv77 /nix/store/1y50vsmqigdxgxwnmjlp0irr96w5dlv4-cargo-package-pkg-config-0.3.34.drv78 /nix/store/23zfs318842pjgw24rqdbc2r28i9l0i6-cargo-package-landlock-0.4.4.drv79 /nix/store/2415qwjlvhywddn04rqzvksb40dmk9d5-cargo-package-crypto-primes-0.7.2.drv80 /nix/store/2j5mcil10sgr1b58w6hnz8nw73cjvfpn-cargo-package-enumflags2_derive-0.7.12.drv81 /nix/store/2r0j07r29s8xn96907sz56qpm3n71fv7-cargo-package-memchr-2.8.0.drv82 /nix/store/2rzz9hdiyn6rnsl8igk1qpqnlgj9iqbv-cargo-package-nix-0.31.3.drv83 /nix/store/2vrzi9njhvykfyx3chrf0xpkavfm2h88-cargo-package-module-lattice-0.2.3.drv84 /nix/store/34x37b3zn5bysa2qwh4rsww6liw7v0hl-cargo-package-const-oid-0.10.2.drv85 /nix/store/36waw2hr3nmlpvfrnxfvgwwr3hhmrcy5-cargo-package-cfg_aliases-0.2.1.drv86 /nix/store/37ljmyqp2dykwg5rbc40yflhb71ya1x1-cargo-package-cpufeatures-0.2.17.drv87 /nix/store/3ahyr5spj1z9cdv54j2a7i792fy992hy-cargo-package-crc32fast-1.5.0.drv88 /nix/store/3z6pmnhxv8v56szpqp2j1aq1463ipq34-cargo-package-proc-macro2-1.0.106.drv89 /nix/store/48dqd61dlfqici7kx85ahiwwp3j026lz-cargo-package-rsa-0.10.0-rc.18.drv90 /nix/store/5h6vlrwg5lcs5zf3b9x6fivfaavzw153-cargo-package-ndk-context-0.1.1.drv91 /nix/store/5hb44a240ldpify3g37k3xifc6d654zz-cargo-package-zerocopy-0.8.57.drv92 /nix/store/5rhny3q912rd3q1d9n6n7y1fpagdsc68-cargo-package-curve25519-dalek-derive-0.1.1.drv93 /nix/store/5rxl69b4j7rrkvw2z3ghy9nr9s1aak5l-cargo-package-windows-sys-0.45.0.drv94 /nix/store/5xcjkq78f62zz0b6c13qsfy9vaa303nd-cargo-package-bitflags-2.13.2.drv95 /nix/store/5yzrr6i2c4qq04j361zx9yfllhzg6kf0-cargo-package-enumflags2-0.7.12.drv96 /nix/store/613maf0wdk55ixn56njm36kcxcxlyaa4-cargo-package-netlink-packet-route-0.33.0.drv97 /nix/store/6p7kz5m702rbcmci6jn0xlyqr5fgyx62-cargo-package-jni-sys-0.4.1.drv98 /nix/store/6s68l2rynwggm0dxjybp9sqvwhyf9800-cargo-package-ml-kem-0.3.2.drv99 /nix/store/6wy3gnx57qfi0sp99gav969rlwdr9vw7-cargo-package-time-0.3.47.drv100 /nix/store/7jdpipkcfanydfa325hh14r09crginmb-cargo-package-ed25519-3.0.0-rc.4.drv101 /nix/store/7l55qd53xsgb7vnazr453zqyrqdr03aq-cargo-package-walkdir-2.5.0.drv102 /nix/store/7rrks3f2fqa5z1gcj1i93s40r9v7hb29-cargo-package-ipnet-2.12.0.drv103 /nix/store/7y7ks34qrybllq1nfi1wyzkw71bjd6m4-cargo-package-windows_i686_msvc-0.42.2.drv104 /nix/store/8bbw3ad4v47n0yd74j2vjzv5dp2y7rgp-cargo-package-inout-0.2.2.drv105 /nix/store/8bglk8yjnx3v9963pkbl5drbjkq2ypn5-cargo-package-thiserror-impl-1.0.69.drv106 /nix/store/8bhh69nk1ylrh0j7ifysc1bb5dlybcas-cargo-package-der-0.8.1.drv107 /nix/store/8d6bqkjh3yaic89bjiwsp7d0cpfnksmf-cargo-package-ppv-lite86-0.2.21.drv108 /nix/store/8n3qb0afz6vfxn1ymjmca7i3xl9bjlwm-cargo-package-ctutils-0.4.2.drv109 /nix/store/8qbgv6z6vwzx0bwpi2grc60jh7ns8qs3-cargo-package-zerocopy-derive-0.8.57.drv110 /nix/store/8zvh1rjblcyhkssnajwn3dy7h0z3laqw-cargo-package-cc-1.4.5.drv111 /nix/store/91l56ajc6wpa3k0xjx4j321vgdaxfs0f-cargo-package-slotmap-1.1.1.drv112 /nix/store/9c807hkf350qjs80s17sjccm78gfz9sd-cargo-package-tiny_http-0.12.0.drv113 /nix/store/9h9hs5108szbcvqms5j5hwwqscnk0rlb-cargo-package-block-buffer-0.12.0.drv114 /nix/store/9sym3qkm8c1bcc6acmn9rchan7gh4791-cargo-package-windows_i686_gnu-0.42.2.drv115 /nix/store/9v39algajp9xwxyi3n7zzzm7cpg86vg1-cargo-package-objc2-0.6.4.drv116 /nix/store/a1bpzz1b3rlwf118s2kgh76liv23lw9n-cargo-package-curve25519-dalek-5.0.0-pre.6.drv117 /nix/store/a8gdnjcfxniaqlryza1iqlimnan4jlfa-cargo-package-env_filter-2.0.0.drv118 /nix/store/aal5a2zgdns12v9az5bb6xrxcssi02dc-cargo-package-time-core-0.1.8.drv119 /nix/store/blxqyp2m05d9fh4ncvsygcqkvz2p29zr-cargo-package-ascii-1.1.0.drv120 /nix/store/bn2sfri5mq0ab9q38dv6za15sv669mhp-cargo-package-windows_x86_64_gnullvm-0.42.2.drv121 /nix/store/bpv0i1142a6c3706rqgngdqw7xmlms7y-cargo-package-digest-0.11.2.drv122 /nix/store/brm4f2scgj2p2fncxm711salzy1143lq-cargo-package-unarray-0.1.4.drv123 /nix/store/brpcn6q11acm924aql8rvi2jmr63737c-cargo-package-crypto-bigint-0.7.5.drv124 /nix/store/ccm72sf843z0jdwjv0lrxh80cn9mipr2-cargo-package-time-macros-0.2.27.drv125 /nix/store/cj69rx2gg1x05xqbvpdxvd6sgvlwmwym-cargo-package-fnv-1.0.7.drv126 /nix/store/d6k8iawyc255v2p5hfmp2fpqy91fazg6-cargo-package-winapi-i686-pc-windows-gnu-0.4.0.drv127 /nix/store/d7g93j21ybacsyxppdqpsshqw5y70lq4-cargo-package-chunked_transfer-1.5.0.drv128 /nix/store/dbfai8yj588hb7c15rdclfnrd0qsy8q9-cargo-package-twox-hash-2.1.2.drv129 /nix/store/dbwq9g6dab3rqspr2ghw49gyzblrxgqx-cargo-package-sha3-0.11.0.drv130 /nix/store/f92a1g12pin4vm2y9vi18xj5zbryypff-cargo-package-thiserror-1.0.69.drv131 /nix/store/f9yx292d7hcf6zmv7siwjgs87lp58rqr-cargo-package-base64-0.22.1.drv132 /nix/store/fbymbpl23v1zy1famxja34f6yqvr1mr0-cargo-package-equivalent-1.0.2.drv133 /nix/store/fdmj8r8fm3qn71762a6sjlcjak8cpv9m-cargo-package-wit-bindgen-0.51.0.drv134 /nix/store/fi7jksarj0g0fl229j774w9jsaxmfmmp-cargo-package-netdev-0.46.2.drv135 /nix/store/fqx718j6bp8lm5m4f24ykb6iscxz47rl-cargo-package-bit-set-0.8.0.drv136 /nix/store/g3v6pfqzfkrppmnwa0blq5c3padwmymq-cargo-package-base16ct-1.0.0.drv137 /nix/store/g9688909nhl6lqscxzrrjnz4y09q5d8b-cargo-package-block2-0.6.2.drv138 /nix/store/gazfi2k4a3as5sgg115dsqrgdwari95s-cargo-package-serdect-0.4.3.drv139 /nix/store/gxczrpmigdcv6kaffvfbp68pyv9zzw3y-cargo-package-vcpkg-0.2.15.drv140 /nix/store/gzl3c3yw2av76yzkxrbiwxl8042l4k6d-cargo-package-typenum-1.19.0.drv141 /nix/store/h2d7y5hqnfkng1dhiiwkls49xfkh1rm9-cargo-package-rand_chacha-0.9.0.drv142 /nix/store/hi6sb6v29a93my4bk0axf1mr1krp5154-cargo-package-windows_aarch64_msvc-0.42.2.drv143 /nix/store/hkkma3cha09wdcja3fza7495nk2ahy9f-cargo-package-rand-0.9.2.drv144 /nix/store/hnpfsc5sdlmp77c4j8cviayjk0mxrbkd-cargo-package-signature-3.0.0-rc.10.drv145 /nix/store/hzqn5m12pm07fs84jdwaqzsnjl4ya1k9-cargo-package-cmov-0.5.3.drv146 /nix/store/ib7yjai64sll6c4nyps1hmbr85msl5pq-cargo-package-jni-0.21.1.drv147 /nix/store/id083c10c8hx13dy5l2lz6fr72m07mil-cargo-package-dlopen2-0.8.2.drv148 /nix/store/idybn9jqk7l1mfalhnlm7glzan0md7fr-cargo-package-plist-1.10.0.drv149 /nix/store/ifyrhk31lzpdh4xhnlyzhzlvxs1nhnkc-cargo-package-cpubits-0.1.1.drv150 /nix/store/ilwwrz5ip0q0vp3cdpzh82yccsp9jx2i-cargo-package-semver-1.0.28.drv151 /nix/store/j3fblmnjhm73hcjvvfyglbkwki1dyfvx-cargo-package-base64ct-1.8.3.drv152 /nix/store/jd8l0zfx3pk11g03i1ji8v8gjk2k3ajk-cargo-package-netlink-sys-0.9.0.drv153 /nix/store/jh4f2w6z842szjsjdssdm1q2k7lc11f3-cargo-package-fiat-crypto-0.3.0.drv154 /nix/store/ji5ixfa0043dqyypql6pvcw0ly0fi9jl-cargo-package-ed25519-dalek-3.0.0-pre.6.drv155 /nix/store/jmzlib5sdzf5y5sfw4n48l9s8nh9ca00-cargo-package-zmij-1.0.21.drv156 /nix/store/jv0knywgfi3xrwrnv6d36l1sbgxf8liz-cargo-package-cipher-0.5.2.drv157 /nix/store/jxnrza012z620wzdhmsyxkdqih84sz10-cargo-package-indexmap-2.13.1.drv158 /nix/store/jywdlfqy23s7c94gv3mdk1891hbzf5ph-cargo-package-cpufeatures-0.3.0.drv159 /nix/store/k8c0088n3ihbn9fn1rdgm8wh7fs38as9-cargo-package-jni-sys-0.3.1.drv160 /nix/store/kfwk3i2d1mipalzqffs8pkxpjgrhcjha-cargo-package-miniz_oxide-0.9.1.drv161 /nix/store/l6c01i6958pz95da1gm1wqn5mb4la3hi-cargo-package-find-msvc-tools-0.1.12.drv162 /nix/store/lpilg6i99iavwhc1jpkvnnh3q4m5wz4j-cargo-package-dispatch2-0.3.1.drv163 /nix/store/lvvj3nq9sydfwgng1fk25vr613da2vb5-cargo-package-lz4_flex-0.14.0.drv164 /nix/store/lwpyzsccrkmsqbkwprfp4fd3qi99wrpv-cargo-package-rand_xorshift-0.4.0.drv165 /nix/store/lx3n6fj0fijkgypy7fan6f9p9pnf485z-cargo-package-adler2-2.0.1.drv166 /nix/store/m4ajgaas130wshv4c743pm8m4ikv7z11-cargo-package-objc2-system-configuration-0.3.2.drv167 /nix/store/m5k4ims0z1bbmfx18ff0ym1gvfc3qja2-cargo-package-objc2-core-foundation-0.3.2.drv168 /nix/store/n60r8fk7vwdh0szk26bcwjn1yh5b6snp-cargo-package-openssl-src-300.5.2+3.5.2.drv169 /nix/store/nclx94h7d77qsa7b3p7h94vhzrghwz54-cargo-package-sha2-0.11.0.drv170 /nix/store/nhsi4fqr2maay5am8zg1hjj34xwqfk18-cargo-package-quote-1.0.45.drv171 /nix/store/njwlah9zh9z5j441kazzi8caq3c8m605-cargo-package-zeroize_derive-1.5.0.drv172 /nix/store/nzzw5k5vwn657q79y4pvypjdhhs4wszl-cargo-package-autocfg-1.5.0.drv173 /nix/store/pgdz5sl4fqm1j5x2id847qmvacpfm1nr-cargo-package-keccak-0.2.0.drv174 /nix/store/pi9vdb440dnn3f906v1wrlnlb7h0kz5m-cargo-package-objc2-encode-4.1.0.drv175 /nix/store/pmnpddimxzigkl1z9pws6zlz3klpg9hk-cargo-package-winapi-util-0.1.11.drv176 /nix/store/q429pqz0q4d9sggpamvr03471jjcacnw-cargo-package-syn-3.0.5.drv177 /nix/store/q9kl556wn9zammlqiwaj78wiynlmrlny-cargo-package-regex-1.13.1.drv178 /nix/store/q9zjz5c6500pdf8i65ngjyvd2fz29p4i-cargo-package-env_logger-0.11.11.drv179 /nix/store/qf4vh1zz3a4zib86jnjnxhg5834brdfn-cargo-package-winapi-x86_64-pc-windows-gnu-0.4.0.drv180 /nix/store/qm6qbw042cmgkf450lml12wqbr668rdx-cargo-package-combine-4.6.7.drv181 /nix/store/qr1jrpv1m1xmg89ms0r16inx43q5w56x-cargo-package-windows_x86_64_msvc-0.42.2.drv182 /nix/store/qy2aczszrb5w7cipbzwigpgwhqykfv93-cargo-package-winapi-0.3.9.drv183 /nix/store/r2zvmh8wbmx1vc4riqpzyi37r8n3bi0z-cargo-package-rand_core-0.9.5.drv184 /nix/store/rk0zbmcd5ypwrdbsfjnxq9mlq5nf9gz2-cargo-package-shake-0.1.0.drv185 /nix/store/rnfysbsgbvqczy8jwar9jiqr1cbwfmlf-cargo-package-rusty-fork-0.3.1.drv186 /nix/store/rx1h49dkpdi384sshr4si7gvxs81lyf6-cargo-package-flate2-1.1.10.drv187 /nix/store/rxy00hnsih9z74sgwsv5i1c3px05ww2z-cargo-package-simd-adler32-0.3.9.drv188 /nix/store/s39gli40wcjbarhqi343gz6f3cvgf6nd-cargo-package-proptest-1.11.0.drv189 /nix/store/s9m8v69k8p74yvff9wvgz80ga7xnzbr4-cargo-package-openssl-sys-0.9.117.drv190 /nix/store/sf6myzfwhvhsafym88x7vzkyb92g6hvd-cargo-package-pkcs8-0.11.0.drv191 /nix/store/shira9dam9pn4q06y0svprsc2nnk58hy-cargo-package-spki-0.8.0.drv192 /nix/store/shrwx1lb9ppa1mwspp4y7xn40zlbnd4w-cargo-package-crypto-common-0.2.2.drv193 /nix/store/smn1mhh81naklby9mi141vybhh8sa55y-cargo-package-cesu8-1.1.0.drv194 /nix/store/sw8mp27xgkbw3m6dp14w7654lzi3c0d5-cargo-package-hashbrown-0.16.1.drv195 /nix/store/v1h9z5aq00k1mhsrn5cqin6c5nq10vkx-cargo-package-bit-vec-0.8.0.drv196 /nix/store/v1vvpsix2f5s7a56anahj5f303bpc0fk-cargo-package-wasip2-1.0.2+wasi-0.2.9.drv197 /nix/store/v24zjy36av6f38rac1ci3hg4hwzs8pbx-cargo-package-jni-sys-macros-0.4.1.drv198 /nix/store/v6m0bcym7zk4hnllwn2yd7x65kwgz0h5-cargo-package-wait-timeout-0.2.1.drv199 /nix/store/vg02vr2j5sj9bnmzhj31vv0ifali4ar4-cargo-package-windows-targets-0.42.2.drv200 /nix/store/vvjkibi74adlj4w8c7qjc9180czrb30y-cargo-package-pkcs1-0.8.0-rc.4.drv201 /nix/store/w21fa4v0fp6i5nrnqgpry0yq40fbv5ap-cargo-package-fastrand-2.4.0.drv202 /nix/store/w5dykbsabnn0marab25qwjr66jx778lc-cargo-package-sponge-cursor-0.1.0.drv203 /nix/store/wc2l7xrdqsr4v82gdd9cwx25ndr7kzf5-cargo-package-hmac-0.13.0.drv204 /nix/store/wif1xfhm0zh10lmqbfhjgakqc893y0mw-cargo-package-windows_aarch64_gnullvm-0.42.2.drv205 /nix/store/x2997yiz9fpnayhg4cixhyanhv0qlfhz-cargo-package-hybrid-array-0.4.10.drv206 /nix/store/x7fi6d5mdy2wa86pkfvvdmp6i0xc8hl7-cargo-package-getrandom-0.3.4.drv207 /nix/store/xcgppsp2kcvjsxi2rjggax6cy6wqlb3r-cargo-package-quick-error-1.2.3.drv208 /nix/store/xjb6y3vvcqggq66q445xg1s6xfjjl2zy-cargo-package-memoffset-0.9.1.drv209 /nix/store/xwr6s9kksi7bbc1h19kr84lv3scagdhb-cargo-package-mac-addr-0.3.0.drv210 /nix/store/yag5s3plc2rnv78yqmxjgv7q5casx1l4-cargo-package-quick-xml-0.41.0.drv211 /nix/store/ydpw2vpl7b9x2b6ji5akls25f2birs7j-cargo-package-same-file-1.0.6.drv212 /nix/store/yj3a6clnwapx57v09swm123p3xm0q1ik-cargo-package-rand_chacha-0.10.0.drv213 /nix/store/yl7w03hjcnd4qp4qdxgd89ziq086h7b0-cargo-package-netlink-packet-core-0.9.0.drv214 /nix/store/ynhablnm3nxj1g1xjx4xcbrhc4indzf9-cargo-package-r-efi-5.3.0.drv215 /nix/store/z3qf2yzvvi44y8q0h6g74f8iqqdh3p61-cargo-package-pem-rfc7468-1.0.0.drv216 /nix/store/z7vyngx484s5235hmljmnl7540rcw7hn-cargo-package-kem-0.3.0.drv217 /nix/store/zrk3vr6ri1467vfvpj6gfn1w7iinh3ag-cargo-package-rustc_version-0.4.1.drv218 /nix/store/zxqr6a8vv87ca7jx4213niqj9l3lw0bx-cargo-package-windows_x86_64_gnu-0.42.2.drv219 /nix/store/jj1kphcqpyj9hmgksvb82ag8hrxacww3-vendor-registry.drv220 /nix/store/2g5iixnqs0x0hmll73y4vg5zznzyxb1i-vendor-cargo-deps.drv221 /nix/store/3amlpy8ys0m54n3p9723msm08i0wk1a0-Cargo.toml.drv222 /nix/store/432cnysqhmrwfyrcm5hyxlgzhrj9x3m6-Cargo.toml.drv223 /nix/store/43arhs8nm6v4vf7nfk97qkv4p1053nvj-Cargo.toml.drv224 /nix/store/cpaxa53pyq1r2284zsds822in6zigbz3-Cargo.toml.drv225 /nix/store/dgdwicpmj3d2sryq13l83v4xq1jbziix-Cargo.toml.drv226 /nix/store/fnymg6xkgd18a0r89kqgi4acc9ll3wzy-Cargo.toml.drv227 /nix/store/jv2n7wmvplzqfrvz3qvskly2rh96rggb-Cargo.toml.drv228 /nix/store/kva8hr0hxr71pf7ib32vgnvlq4mslk9y-Cargo.toml.drv229 /nix/store/wvj878qbd700skbsqpf1xf2yr9qkidz0-Cargo.toml.drv230 /nix/store/jxlw6capq5lc1pbz39j26ydw8zk7smcy-source.drv231 /nix/store/f47fyz4wl6s16r62smbzjijyahaicjhy-tincd-deps-0.1.0.drv232 /nix/store/n7qpxriscipnd2xy2cxi24aam19j0q3i-tincd-0.1.0.drv233 /nix/store/vyja9qai6ss2iznspi6q8918flyaia3v-ld-library-path.drv234 /nix/store/w6jq3my5kxg9bgxjp6dcimsr2gg2ipfw-rad-system.drv235 /nix/store/xz06k0rbbmkyv2g2qy3s9cvg43lkzh7w-nixos-option-26.11.drv236 /nix/store/0ygj624cw1dz25my4l0w1w6cxhfqwab4-system-path.drv237 /nix/store/0ylij2d9l9qh8xqmjwcj5jrbzimrmbr1-unit-zfs-snapshot-hourly.service.drv238 /nix/store/3dbd0in3b1jihz5qbdf2bxysy7j8qs8k-nixos.conf.drv239 /nix/store/ykx49z4jsv9hfkkgad1kbq872a25fwd5-X-Restart-Triggers-systemd-modules-load.drv240 /nix/store/100hpizph0k9kr1q6k70r1525xwvd14k-unit-systemd-modules-load.service.drv241 /nix/store/115l1fnmvkgpc40vil49an8qp59app2k-cargo-package-h2-0.3.27.drv242 /nix/store/13mp2df1bfmc0c52w463lc7l36851nw0-cargo-package-yoke-0.8.2.drv243 /nix/store/14km759lm7hrh63nnyh32rkx882z7f54-cargo-package-pin-project-lite-0.2.17.drv244 /nix/store/14mc5bza46fh97ksxxzcpvvl20cgmrca-cargo-package-tokio-util-0.7.19.drv245 /nix/store/14viabzicg3mlfgkxxfxzwk2n9r17wfw-unit-reload-systemd-vconsole-setup.service.drv246 /nix/store/15q79qhpb4njxw52ri007bp20xz91q1g-cargo-package-aho-corasick-1.1.4.drv247 /nix/store/17dx33rqr4rvpkrrjm4gfl5fh90jbnrf-cargo-package-page_size-0.6.0.drv248 /nix/store/18c1jkdnyrnf2lai36zbb4sjx6zraw2n-cargo-package-encoding_rs-0.8.35.drv249 /nix/store/18z7a9g1k9hzdbwib0disq9bcys2lnin-cargo-package-tokio-1.53.1.drv250 /nix/store/19k5vghsj7xp2svd76qwgc4v2nn03yy1-unit-script-sshd-keygen-start.drv251 /nix/store/1bkbp3fxcgp1n7lmykxmnycg5zj16b30-cargo-package-autocfg-1.5.0.drv252 /nix/store/1d3274sacw7whsz23b1gi0nrn0ack1gd-cargo-package-v_htmlescape-0.15.8.drv253 /nix/store/1dgcf8fai83mv1nll6qr9csblxd1nj1h-etc-ssh-ssh_known_hosts.drv254 /nix/store/1fvnp22g8m48k5pz7ngjd35w6iypnn9i-cargo-package-indexmap-2.14.0.drv255 /nix/store/1hyjf16v7mwpizhh0acqv58ifg7a90va-etc-hostname.drv256 /nix/store/1kl59fi0wmk47dp9j1qzcijzgj4hvayh-cargo-package-tracing-attributes-0.1.31.drv257 /nix/store/1lllbi3xkbw3aakqm70nxqr793z73fha-cargo-package-clap-4.6.1.drv258 /nix/store/1lx7h93qqwflf0lj20cwp80lz3ialyf1-root-authorized_keys.drv259 /nix/store/1mc90al9ml54lg6q5ilhdmzmpz3hihk6-unit-99-wireless-client-dhcp.network.drv260 /nix/store/1x9x0kwcl1v98zaqgzxl82nxqswjby7a-Cargo.toml.drv261 /nix/store/1yfj9paagvi597h51h7hh34a0k1648pa-cargo-package-unicode-ident-1.0.24.drv262 /nix/store/1zvcjq0x2jlh2ccs84n98msqfgrdv6bz-cargo-package-tokio-rustls-0.26.4.drv263 /nix/store/24jnjd4k1d5zidi8y4h3f89ir3k9325w-cargo-package-rand_chacha-0.9.0.drv264 /nix/store/qghkg0mridmyai9ddzymn2v1xf7l8ifz-cargo-vendor-dir.drv265 /nix/store/js0gb4p489zdva7jsvgl4irjsg38j3sq-fancontrol.drv266 /nix/store/28350zzza7pwksrinxc5xs5pv9iadiyw-unit-fans.service.drv267 /nix/store/65mvy3schxn3mc4nxiwmd9vjdf758dyf-unit-script-nix-gc-start.drv268 /nix/store/2ah8szbzvqv3zdz1a1bg3hvpyqr5x3n7-unit-nix-gc.service.drv269 /nix/store/q4f0c3nicc6rmkgrd8yrc5aqqi2kq4hc-dbus-1.drv270 /nix/store/fyc5ykjmyx57j12sdzs6f5c2hldg0qpw-X-Restart-Triggers-dbus-broker.drv271 /nix/store/2gl7ib4c6dh095g0l6r3bm816a0p4dpq-unit-dbus-broker.service.drv272 /nix/store/79fm6rgxmp7m65smlc8ijcapic589asa-etc-systemd-resolved.conf.drv273 /nix/store/j60s3asdjimhb1xm4jh1kkba4ay8ljv1-X-Reload-Triggers-systemd-resolved.drv274 /nix/store/2gmn9d9vyq037jrfxkvlh8mpwx6ngk8l-unit-systemd-resolved.service.drv275 /nix/store/88yalfjhg7yiyjzd33rlwmkf0vr4lacw-unit-script-update-prefetch-start.drv276 /nix/store/2my3lfhshmz0jjpa2mm3j2qsyiqcb7pd-unit-update-prefetch.service.drv277 /nix/store/3rq479c9i582s3yzcqfby3zy1s2qqhvn-unit-script-borgbackup-repo-utm-vm-start.drv278 /nix/store/2s7pjyqh02v1i06vb73vwh5v2f9ksb17-unit-borgbackup-repo-utm-vm.service.drv279 /nix/store/32banc2vp1sj8xvwdq4djvn10gkrz4jm-unit-zfs-scrub.timer.drv280 /nix/store/xqc8w57zbw9fjzv9k4grm5v4hi4md5yg-security-wrapper-smartctl-aarch64-unknown-linux-musl.drv281 /nix/store/dayfgcidl6qzb81pc4cy4jcy37fi81ls-unit-script-suid-sgid-wrappers-start.drv282 /nix/store/40hwp5g0crqxjs69kwhmw248x7rasc3j-unit-suid-sgid-wrappers.service.drv283 /nix/store/48y6cm2ialmr65v28chlpy73d2glbphf-unit-phantun-client-eva-wg.service.drv284 /nix/store/4d4waz8kga1pf2gyc9czxxq2rzhb6n09-unit-systemd-networkd-wait-online-.service.drv285 /nix/store/4jad4h7m2nfx51rqy9lgsdsyz1w76kcp-unit-zfs-snapshot-monthly.timer.drv286 /nix/store/4jny5d1vi9nzizf5da8ssd4a45vlkdw0-unit-logrotate.service.drv287 /nix/store/4jzq3azprj5g15hs0rr5qagvy0cx4x5v-unit-systemd-zram-setup-.service.drv288 /nix/store/fz9k0lm60vb8yhinjbbdhwixbj73lsf7-udev-rules.drv289 /nix/store/2sms42v7sw4r65ppsnmvxkyyscalv3qf-X-Restart-Triggers-systemd-udevd.drv290 /nix/store/4w0w3qg814zfkd0lxbca6yi5plvc90f3-unit-systemd-udevd.service.drv291 /nix/store/4ybsz0n0c1pk7gs27axb4hqwd256wx33-unit-user-.service.drv292 /nix/store/55xn0z24v6wncjqgy8babwmljk3b1ndq-unit-zfs-snapshot-frequent.timer.drv293 /nix/store/5wlygrvi3szawzqzvgss1dps8vzzw1zr-unit-systemd-nspawn-.service.drv294 /nix/store/754xr9k7q91xvdp0kd55sj42c7pydpkq-unit-script-borgbackup-repo-dorits-laptop-start.drv295 /nix/store/61my276fxn97kwd5agsh9pv77z72ma9n-unit-borgbackup-repo-dorits-laptop.service.drv296 /nix/store/3gikg3b01kqywlap2w3ljazajaiy2na9-unit-script-borgbackup-repo-eve-start.drv297 /nix/store/6llh7i45xi3jkzla7bj6i9kf3gm7343z-unit-borgbackup-repo-eve.service.drv298 /nix/store/72jhfcrhm5a72h4zz16yg4xphdv6iv8y-unit-systemd-oomd.service.drv299 /nix/store/75dvpkgf8agil30c4ca47pkbn8617rp8-unit-zfs-import.target.drv300 /nix/store/pi059sdhkmd3ahc4jq0jrxlwzhcsqx23-unit-script-zfs-import-zdata-start.drv301 /nix/store/7r8av0dzsj48vs982b931vxdfkkm5jpl-unit-zfs-import-zdata.service.drv302 /nix/store/7w60xxw4gbg5dms8cifikagpm4k33ca9-unit-harmonia-gc.timer.drv303 /nix/store/82ssdyawmif79yvgwmwgw00lagz4acx6-unit-ip-update.timer.drv304 /nix/store/8sfxizdfqz6nlmhzd7k9rp25jnhjyf0n-unit-kmod-static-nodes.service.drv305 /nix/store/90q1d1hnx12p4slilr6v243nkazqsqxn-unit-systemd-importd.service.drv306 /nix/store/914vncr94l4yz08xcq8ci34dp4l2zpxm-unit-zfs-snapshot-hourly.timer.drv307 /nix/store/9dy1g2gzv4nxlrsr2g81qjc7jcmvhdir-unit-phantun-client-eve-wg.service.drv308 /nix/store/a1qpjh901c9zqpwi29pixf2zm0y6jxkn-unit-nix-cleanup-gcroots.service.drv309 /nix/store/a3n7r2zrj5yjhb4bg2zcyigfyy1732y2-unit-user-runtime-dir-.service.drv310 /nix/store/w996532cd95lpaq9icx8bn744wj4m4p1-unit-script-zfs-sync-zdata-start.drv311 /nix/store/a8ak4djdwrnf2ki7jpfrwz69mp2mdqdz-unit-zfs-sync-zdata.service.drv312 /nix/store/almqiqkqhwa1dp8sn76w4zgidc6j5ph9-unit-sleep-actions.service.drv313 /nix/store/8m4syx8zb42mdfqvsh3a8y90s0nni8x6-unit-script-borgbackup-repo-bernie-start.drv314 /nix/store/b1virp44sdsl72f3r7sgg8c9f7kfj11n-unit-borgbackup-repo-bernie.service.drv315 /nix/store/b37rlnc28xpzqyjc1s61f8f41xzff13h-unit-zfs-share.service.drv316 /nix/store/bifcz76sc43vmpl096lxg0zrf2978vbq-unit-zfs-snapshot-monthly.service.drv317 /nix/store/c6y0ygjrb4i86shsybsnmpm85bxqb6l4-unit-systemd-networkd-wait-online.service-disabled.drv318 /nix/store/c9zygcqdsylimwgh5xqmjqylim6fmpdp-unit-systemd-journald.service.drv319 /nix/store/crgkq5b7fy1s581w8z0083fajkhwi1ml-unit-zfs-snapshot-weekly.timer.drv320 /nix/store/ppb63hnvz3fy3kp6irqd1kjix4mssbjx-unit-script-borgbackup-repo-matchbox-start.drv321 /nix/store/d0ss58b5ps5ay4g8n0mfn9brd6jzb2yv-unit-borgbackup-repo-matchbox.service.drv322 /nix/store/d17ibrljaiifjbvc2p8lqfzz0wdk6ffc-unit-zpool-trim.timer.drv323 /nix/store/9wh0fazm6mi43rw8hy6gfnmxmiq04psb-etc-sysctl.d-60-nixos.conf.drv324 /nix/store/mqm1dh9wy2118sswzbv4a9nfmhga8vzm-X-Restart-Triggers-systemd-sysctl.drv325 /nix/store/dhj8dcdkh9xkmz1v6pw3kp0ybm5sa2ap-unit-systemd-sysctl.service.drv326 /nix/store/f2f0a9m0zvbny2i4achm7yyf8n0awhws-unit-systemd-hostnamed.service.drv327 /nix/store/f667lz9vl8bqhgmn8jcvfwiwjdakq1aw-unit-sshd-.service.drv328 /nix/store/f8kchrqfanf4ll3i81igiinrsh8ni7r0-unit-systemd-backlight-.service.drv329 /nix/store/fh97njql3307cfrrdx4c1hp87bps60qb-unit-radicle-auto-seed.timer.drv330 /nix/store/3j9ph267ryhsjkywq7nmlgllwhvzk53n-etc-os-release.drv331 /nix/store/wjw46mas4rv7fy7k11xgicgnkbkymay3-zpool-sync-shutdown.drv332 /nix/store/pr9p07xwir52vi63g8ldzzsa3i89dai9-shutdown-ramfs-contents.json.drv333 /nix/store/fvvcwyq7pfv5vqkvwrcbz11hrzprnb0w-unit-generate-shutdown-ramfs.service.drv334 /nix/store/fw3ha206myb4akhy2n9chnjm0p92rbys-unit-systemd-random-seed.service.drv335 /nix/store/fwmihq233yqbp887mh6jnasgnw3irzwl-unit-update-prefetch.timer.drv336 /nix/store/fx2ybhn38wh1zhki7s27dx4ihc5kldk4-unit-systemd-fsck-.service.drv337 /nix/store/g1l1sphfp21rxa5975fdzdhf1lld7b86-unit-post-boot.service.drv338 /nix/store/g81qx7f02xyfc7h0lan2w49m6kzafl5r-unit-zfs.target.drv339 /nix/store/81v2ipzi9rw1zngnrmb0k6cjyfjn800q-sshd.conf-settings.drv340 /nix/store/lywvzz63w1n2h9gpbyl5jz71ncbc03hl-sshd.conf-final.drv341 /nix/store/h2cqm4w86m1ybn7kvdg4ba7cd6r8jxbc-X-Restart-Triggers-sshd.drv342 /nix/store/gkw8g61rws4aq5fbd8888in6kf89nab3-unit-sshd.service.drv343 /nix/store/321z56z6br7mjdvaqqlcy4v0hxk2vim7-unit-script-zfs-scrub-start.drv344 /nix/store/h5ajyb6isxdkz24prrj3pa15yrv9035f-unit-zfs-scrub.service.drv345 /nix/store/ycvh5h541sfnavx0xmdp7wvadamrxfai-zfs-zed-wrapper.drv346 /nix/store/hfavwfyspxh3v6cz5m1dlja7f15p5yi8-unit-zfs-zed.service.drv347 /nix/store/f3hbmfy2nap90di8b0wpilrv9bga47xa-nixos-tmpfiles.d.drv348 /nix/store/z39w87ar8z55npczp5nd8nrarpiv1qpb-tmpfiles.d.drv349 /nix/store/731i613npk6a37zn77lm3wpyin80s9a2-X-Restart-Triggers-systemd-tmpfiles-resetup.drv350 /nix/store/ijasln8n5ck28swhhqvqaak8sg68ziz6-unit-systemd-tmpfiles-resetup.service.drv351 /nix/store/ixz31p1b22pkslnhbs4gr2zs9fj4cp84-unit-zpool-trim.service.drv352 /nix/store/izfqlrym5n7vnavsjvhyd84la6bm5jxn-unit-systemd-remount-fs.service.drv353 /nix/store/jd4gg9cbi7by7vx20dn9xmkh5xz6184k-unit-zfs-snapshot-frequent.service.drv354 /nix/store/jhybdyknp54jxcl1raq9qrb1sqqk9y3r-unit-systemd-localed.service.drv355 /nix/store/rlagrggzlsnqjbi0ghc59kj1ip69j48g-unit-script-borgbackup-repo-jacquardmachine-start.drv356 /nix/store/jjcz45qzf2hal6l9n9k6syz31mkyryj9-unit-borgbackup-repo-jacquardmachine.service.drv357 /nix/store/jvrbss64v08dn18vsxiv1abr1npw6c10-unit-systemd-user-sessions.service.drv358 /nix/store/jz42ypr8ymvx8yxi68cy1mvff7qfxczw-unit-zfs-mount.service.drv359 /nix/store/26kbfc3l0m1y4blxxvn694xfcgk3c1q7-cargo-package-block-buffer-0.12.0.drv360 /nix/store/26vjin7ghmypj25ypjrds5z1qjzja7dz-cargo-package-parking_lot-0.12.5.drv361 /nix/store/2dyybljiy8lg1x2pd39p6hrby83jsfln-cargo-package-windows_aarch64_msvc-0.52.6.drv362 /nix/store/2hv13h2sxln7sfli1wwyg2khlkvpbc8a-cargo-package-sha1-0.11.0.drv363 /nix/store/2iw61l5ikfkqbhfr3yxprjg9h4wcvjvi-cargo-package-const-oid-0.10.2.drv364 /nix/store/2plj9z5zzlvgnyhl1nalr2qkra074mqa-cargo-package-utf8_iter-1.0.4.drv365 /nix/store/2rn213bcjbh7wf6rvwl3df6lsz1iidw7-cargo-package-actix-codec-0.5.2.drv366 /nix/store/2sgh201jnqy8scw1sj53x25ikyyl8wqd-cargo-package-memchr-2.8.3.drv367 /nix/store/2yn8w0cwicsh8l65z58y8zan0jhk9s85-cargo-package-winapi-i686-pc-windows-gnu-0.4.0.drv368 /nix/store/2z2b9c4nrq5mcy42kjwjcm96f2zh5nwb-cargo-package-zerocopy-0.8.56.drv369 /nix/store/2zmhwfp6lzijlvv89a5c7li7jyxn7smq-cargo-package-memoffset-0.9.1.drv370 /nix/store/321cfsn7l5m46ddfhd6l70k0v2b2dr2n-cargo-package-tinystr-0.8.3.drv371 /nix/store/36zcmki4kg5cka1xcrbl7x1xp80dcazf-cargo-package-half-2.7.1.drv372 /nix/store/39agnnmnf7wj50jz81l5nggbrz2bab1c-cargo-package-clap_derive-4.6.1.drv373 /nix/store/3asl0rirl8skw1km5y09yzn48cnfmjgk-cargo-package-rand_core-0.9.5.drv374 /nix/store/3dhbwvg3pi5m3w9rli827ydp3vcn1qan-cargo-package-rstest_macros-0.26.1.drv375 /nix/store/3fnpvkj1wnsmlcgzscrgjhqvd81ysq7w-cargo-package-cfg-if-1.0.4.drv376 /nix/store/3h9a4nw3g1p5vlj6xaibz00nsvg3yc0f-cargo-package-anes-0.1.6.drv377 /nix/store/3hb8nj0vz78agn56sv2p8yf7gwdrlai8-cargo-package-unicase-2.9.0.drv378 /nix/store/3li3yziy3ydfbczg1b8335d5h9bi1inz-cargo-package-digest-0.11.2.drv379 /nix/store/3qckamphx3pab9gwf7az1lcxksbv2h98-cargo-package-icu_locale_core-2.2.0.drv380 /nix/store/3rvzr7g7xplmxj9h9sq521fa5fcfzwjv-cargo-package-valuable-0.1.1.drv381 /nix/store/3zkxkfr7k33ahqrqwgivxjparazrhkh3-cargo-package-winapi-util-0.1.11.drv382 /nix/store/48z8nk3xyqdx5p7fm024xbf0p8w6w06b-cargo-package-num_enum_derive-0.7.6.drv383 /nix/store/493hlps0kbyg8r2agxyqwdfpiqphagjh-cargo-package-zstd-sys-2.0.16+zstd.1.5.7.drv384 /nix/store/4cb9nmhmyd5gmjbp42y37vxhq8vk2qcj-cargo-package-signal-hook-registry-1.4.8.drv385 /nix/store/4cgfql27gla7k891c3gk106f0vfqxwrc-cargo-package-windows_x86_64_gnu-0.52.6.drv386 /nix/store/4kdk78m35j4ax27aqmimy8b8kfbixs38-cargo-package-deranged-0.5.8.drv387 /nix/store/4lmg9m5fcdgx9904bx9j5pi5v042qsam-cargo-package-actix-server-2.7.0.drv388 /nix/store/4n1vl744phvpdalmz95m2nyqkki0mahy-cargo-package-icu_provider-2.2.0.drv389 /nix/store/4sr71p4flx5wh1nhdkkbs7pjfwy6qhq0-cargo-package-actix-service-2.0.3.drv390 /nix/store/4yfy4m7qxfsxz85kyxhxvicsb0vw2xv3-cargo-package-heck-0.5.0.drv391 /nix/store/516qklbm5n1vs3i233c61ybwkm7hpiff-cargo-package-icu_normalizer-2.2.0.drv392 /nix/store/53gnhccvikkyhnsw1phd3767bwhx7kv5-cargo-package-icu_collections-2.2.0.drv393 /nix/store/5bi5342pkn77j9igrkdgwcg1340ih3qr-cargo-package-bstr-1.13.1.drv394 /nix/store/5d407da35krwg98xnbxb9ly9g6k3wpm5-cargo-package-crossbeam-deque-0.8.6.drv395 /nix/store/5dqmjvsd74hxh2g88wl6ibbcfil79sng-cargo-package-zerovec-0.11.6.drv396 /nix/store/5fvgcw91xz2kpkkh85hla65knxc37dn0-cargo-package-getrandom-0.2.17.drv397 /nix/store/5i7jjypdzc8lrnprrk6bhr33bpgqjr1n-cargo-package-proptest-derive-0.8.0.drv398 /nix/store/5nkwar48w6wia0bdwy4iq2dyixdixvcq-cargo-package-fastrand-2.4.1.drv399 /nix/store/65d6i1bhirb8mcik6prch4vyzf08ljai-cargo-package-log-0.4.29.drv400 /nix/store/65q6m5gkiz19ddnsgyzym08mlqrrj786-cargo-package-unicode-xid-0.2.6.drv401 /nix/store/6af6188fkcqf539addi6i37zpm15l617-cargo-package-curve25519-dalek-derive-0.1.1.drv402 /nix/store/6g93gd6zdascvx0086brkzxnynqbggnb-cargo-package-yoke-derive-0.8.2.drv403 /nix/store/6jnn0j1g2fmqmbrqzk1p7dklx50d42r8-cargo-package-syn-3.0.5.drv404 /nix/store/6w92irm85ybml0j98wqppg7ym8zqgf0s-cargo-package-hashbrown-0.17.0.drv405 /nix/store/6xjphvqvi65wbgzk8cmnj046xa163jlf-cargo-package-tokio-stream-0.1.18.drv406 /nix/store/6zchkgjgs96cnynzm09pw3jhvsjqd3yq-cargo-package-itertools-0.13.0.drv407 /nix/store/719af5l5lsmzs1bbal8hwrszxyr6n1yy-cargo-package-toml_writer-1.1.2+spec-1.1.0.drv408 /nix/store/79ikh6x6gbv6qp29hjg7bk0iia7k4li8-cargo-package-wasm-bindgen-shared-0.2.118.drv409 /nix/store/7f830wjxs8jkdirfj7lzq05r665jmxcs-cargo-package-matchers-0.2.0.drv410 /nix/store/7gl9bdnfbm6rw8alllcqn86ar3iybdzn-cargo-package-tokio-test-0.4.5.drv411 /nix/store/7q0r427bw2z6rjhdsa526ac7rkj8x6nq-cargo-package-toml_datetime-1.1.1+spec-1.1.0.drv412 /nix/store/7vryib7f642nil43hcimjmb90qb58wh9-cargo-package-regex-1.12.3.drv413 /nix/store/7xlj574d7nlsdmljz7ggw4ivhm1p7sgn-cargo-package-bit-set-0.8.0.drv414 /nix/store/80chfmhg9nbsnpyls3wqy8jcp1l0az9f-cargo-package-equivalent-1.0.2.drv415 /nix/store/8g810041q6nijdpcnblmrlr1l72mah0d-cargo-package-convert_case-0.10.0.drv416 /nix/store/8kzadrzq7vl4byxipz8kphynwhhb6774-cargo-package-unicode-segmentation-1.13.2.drv417 /nix/store/8qkmrcl0vvhxza5a3j700kaln8a9x4dx-cargo-package-relative-path-1.9.3.drv418 /nix/store/8rnfpf0n9x8nx6b0cn1v00ga6635lb7b-cargo-package-ppv-lite86-0.2.21.drv419 /nix/store/8rv5qylgp513yz5phm5hgg0ylbp4qj76-cargo-package-once_cell-1.21.4.drv420 /nix/store/8wgqfrc3zg7jxsfx7vy2cj3g1rfgmjln-cargo-package-icu_normalizer_data-2.2.0.drv421 /nix/store/91qyfbvv7cppz324mxb52l7kxd90mnfb-cargo-package-tokio-macros-2.7.0.drv422 /nix/store/96nc16bhf9zj7hwg79w5gjyn4xb8xkwd-cargo-package-http-range-0.1.5.drv423 /nix/store/98jq4jwzil47vfcqbgyyx71w5xkvzbg5-cargo-package-criterion-plot-0.8.2.drv424 /nix/store/98m2rxah89sawy3xvkxz5kxq1gz18lph-cargo-package-num-traits-0.2.19.drv425 /nix/store/9i7r1dldwbv9plfxczf4n27v5qr227v8-cargo-package-lock_api-0.4.14.drv426 /nix/store/9rrjvz8l89k63ykb0yjn7mfvwmnxw9rp-cargo-package-serde_spanned-1.1.1.drv427 /nix/store/acm9pb30yar193vvqc0vf4z0nl5kyaaz-cargo-package-rustix-1.1.4.drv428 /nix/store/aicxm1bkfbss9z3im162qc503krmr01x-cargo-package-crossbeam-utils-0.8.21.drv429 /nix/store/apsgazpndy0r14q8cgp97cxy228igcmr-cargo-package-rustversion-1.0.22.drv430 /nix/store/ark9a747ny3j0fn9b1na5vq0rn1ihbrx-cargo-package-impl-more-0.3.1.drv431 /nix/store/as7ajlr0jk4h573pcdy3nz73cgjgpjlh-cargo-package-oorandom-11.1.5.drv432 /nix/store/awkws4mrhkwmahv8x8z1c4nkvd13733l-cargo-package-scopeguard-1.2.0.drv433 /nix/store/axs0zf5qp6k97i9pvlvq288826xzbir7-cargo-package-bumpalo-3.20.2.drv434 /nix/store/b23f4r1plyi1633bjic6mdfw7nwgs2xl-cargo-package-wasm-bindgen-macro-0.2.118.drv435 /nix/store/b7j1dcwfsaa14b1vzk00siz6zpnpx82x-cargo-package-askama_escape-0.16.0.drv436 /nix/store/b9c0gx26sgxj91i5fb1y7x7w1sghhjjg-cargo-package-winnow-1.0.1.drv437 /nix/store/b9d40f5lcf2k1jim52198yp1yiq0vxci-cargo-package-actix-web-4.15.0.drv438 /nix/store/bdrny24lf7622ar88gpm4cahrvdsgz04-cargo-package-synstructure-0.13.2.drv439 /nix/store/bg2gzvfsd0xf4gazzbfjg9crfl9lafnk-cargo-package-rustls-webpki-0.103.13.drv440 /nix/store/bjm5bgkjdr2gcr7x02z98w6yswwrcwzz-cargo-package-crunchy-0.2.4.drv441 /nix/store/blzzd003nwaxai7a8ywl6fp1l8dgvmsb-cargo-package-zerocopy-derive-0.8.56.drv442 /nix/store/bm4wlm94bvrapc5apmbas25kfdjb99nl-cargo-package-num_enum-0.7.6.drv443 /nix/store/bnjzvpdd632amnbys3pipx3ibicv65s4-cargo-package-mime-0.3.17.drv444 /nix/store/bq16lkbzarb3afgpm01rajcpgij03ars-cargo-package-httparse-1.10.1.drv445 /nix/store/bqhb2dcdh2j6q4cwv1816yznm472bpjz-cargo-package-md5-0.8.1.drv446 /nix/store/bx4q3j3ng2v1rlkgkcvfifsabbabls6v-cargo-package-cpufeatures-0.3.0.drv447 /nix/store/bzymkq74i21frf6r54m16m518mij5l0d-cargo-package-cast-0.3.0.drv448 /nix/store/c0cyink13n60035y86acx75g9zzsglhl-cargo-package-rusqlite-0.40.2.drv449 /nix/store/c2f6hnl57pn7kcgfkk2qn07v9y3l56mg-cargo-package-serde_json-1.0.151.drv450 /nix/store/c6nhy3v7jmcd2n2nkf7mzlq72sbj5xfm-cargo-package-wait-timeout-0.2.1.drv451 /nix/store/c8yphhj3ng5kfxfykz9h28fapxa1zx8g-cargo-package-getrandom-0.4.3.drv452 /nix/store/cgi2y4si6zd7mh095w9rv9swvj90xs6b-cargo-package-ciborium-0.2.2.drv453 /nix/store/cgiqgwnfcyfqzi0x4p5178cvh3yggcc2-cargo-package-url-2.5.8.drv454 /nix/store/cvdlbsjya2rq39p3vix7kbnyf2di5rn3-cargo-package-same-file-1.0.6.drv455 /nix/store/cx1cc1hnfkjzfj05vhwvw8bm4s1ihh03-cargo-package-subtle-2.6.1.drv456 /nix/store/d1kmrl4bsld4yyqribrrp9pccydz7sbr-cargo-package-windows_aarch64_gnullvm-0.52.6.drv457 /nix/store/da6pisk4vc9kbcnbrsij27xmwipx0rk4-cargo-package-httpdate-1.0.3.drv458 /nix/store/db40xadznzvgm2l6dfh1mp2vqdf7sbl9-cargo-package-writeable-0.6.3.drv459 /nix/store/ddcqnzjqqxw17md4rypcy1vzdl89j9h9-cargo-package-socket2-0.6.3.drv460 /nix/store/dicnqc7732ykkaizzjjl02za08lzl31l-cargo-package-untrusted-0.9.0.drv461 /nix/store/dn5090b7g1mzm6hbp342n2sy7jk00clb-cargo-package-plotters-backend-0.3.7.drv462 /nix/store/drj7q237dkpjj6w2ggj7i56khrnjmj0f-cargo-package-r-efi-5.3.0.drv463 /nix/store/drsxdryvqigz0mv1w4gs316rsmfcbcqi-cargo-package-derive_more-impl-2.1.1.drv464 /nix/store/dsf9k20874vgkd50k14j4dnlpbrbpcfq-cargo-package-rand-0.9.4.drv465 /nix/store/f1px7jlkvg6vky2m7qkhh83fh7giykm5-cargo-package-rusty-fork-0.3.1.drv466 /nix/store/f5lldlcwr425w8yc0wy5323bmkpwjw6i-cargo-package-glob-0.3.3.drv467 /nix/store/fa608445qlfw4bghzhp3r860bmljbhra-cargo-package-icu_properties-2.2.0.drv468 /nix/store/fwkkswz0abcmmlyjr6zc91gmyr3jmlb4-cargo-package-tracing-subscriber-0.3.23.drv469 /nix/store/g51fj4jwn4bm2ip03q125i2s40vh9v93-cargo-package-mio-1.2.0.drv470 /nix/store/g75g563a1gg54kyfwhdn9m5n10349nx6-cargo-package-proc-macro2-1.0.107.drv471 /nix/store/g9fs9440rzfwr3zg8a5aysrf79a5yjcc-cargo-package-strsim-0.11.1.drv472 /nix/store/gf7h651d3kl6ngzsbyn727jnjmhyxxa5-cargo-package-regex-syntax-0.8.10.drv473 /nix/store/ghs7acxra6vq1dlqnp3r7kk3gza4bkvv-cargo-package-derive_more-2.1.1.drv474 /nix/store/gi103qiqgdqdgpcykwj0bh3fbbarw9bv-cargo-package-windows-sys-0.61.2.drv475 /nix/store/gizxmcc037hwdx61wkznrzn7xmsmyg76-cargo-package-js-sys-0.3.95.drv476 /nix/store/gma7qi513hy0ykqn1acpywyr4ffs8jsx-cargo-package-potential_utf-0.1.5.drv477 /nix/store/gmd6g8vhn6kcg2a4vqqaj9hh31104kc8-cargo-package-zerofrom-0.1.7.drv478 /nix/store/gn0gk4q4ni903jmx92d9nwik0s58yv86-cargo-package-toml-1.1.3+spec-1.1.0.drv479 /nix/store/grqnvsxingjl5zxzxs6nd4z3j2mr6mix-cargo-package-shlex-1.3.0.drv480 /nix/store/gvflmhbdknq42ym08v053jrq0m5956qk-cargo-package-async-stream-impl-0.3.6.drv481 /nix/store/gw3my1xlb5xvxmfqsylamkni9xkkaldz-cargo-package-nix-0.31.3.drv482 /nix/store/h5s9kc3w0sjafay1cdnvz5dwxlkd5ix7-cargo-package-actix-tls-3.5.0.drv483 /nix/store/h67l18virk24qg1f79n5g2z9gmkp2s4l-cargo-package-plotters-svg-0.3.7.drv484 /nix/store/h8ahs0xlfl5iyrkws44whkn4ar72752f-cargo-package-zstd-safe-7.2.4.drv485 /nix/store/ha35q9cywpxh89rdkprysiism2n8x423-cargo-package-alloca-0.4.0.drv486 /nix/store/hbrwr6m6cpisrf6d7dc51zmrzkikry2h-cargo-package-constant_time_eq-0.4.2.drv487 /nix/store/hd7pxz2g6xqv8fmlrnm3mq6f2y97hnwg-cargo-package-time-core-0.1.8.drv488 /nix/store/hldzv4y8rwkiq38ilr2lsym9vczk6kby-cargo-package-quote-1.0.47.drv489 /nix/store/hs315d6kwcjb2i71qscxsa4ll6bghmpy-cargo-package-actix-web-codegen-4.3.0.drv490 /nix/store/hw7nnj679k367r53in41h878hmasv3bx-cargo-package-criterion-0.8.2.drv491 /nix/store/i20kllyd00jikklif85g1anxx6hqfwlm-cargo-package-percent-encoding-2.3.2.drv492 /nix/store/i61gf1j5frrgly6p1733c7in14x04lkz-cargo-package-idna-1.1.0.drv493 /nix/store/i758a26qbvm1hg48rhz8cx3246nzzqkh-cargo-package-language-tags-0.3.2.drv494 /nix/store/i8024nhb39c8prv3zaaryrg7fa3cpsma-cargo-package-actix-utils-3.0.1.drv495 /nix/store/i979lf0fliky4px0v42h0gpcklg4jydj-cargo-package-windows_i686_gnu-0.52.6.drv496 /nix/store/ighrb4jqsan25piqiwf3r4mkm62brkvb-cargo-package-rayon-1.12.0.drv497 /nix/store/ij0anwbk5wjl42ixp2wd7q62046n26vm-cargo-package-bytestring-1.5.0.drv498 /nix/store/ijnfqvzfj0p43bsm6kh87j9rpln77xvx-cargo-package-cc-1.2.60.drv499 /nix/store/ijx1xynd2yqnw551grcqn3yv7x0lx7q2-cargo-package-icu_properties_data-2.2.0.drv500 /nix/store/ikqqady2cpsf1wq0n8h9gdr27pffl7dv-cargo-package-futures-task-0.3.34.drv501 /nix/store/ir57y4a3ycwj9qcnhpi6513fm28c7xh3-cargo-package-errno-0.3.14.drv502 /nix/store/ira45pw1dbyj3x3v4y8vrjiix29r35nd-cargo-package-jobserver-0.1.34.drv503 /nix/store/iv38h33v50lmqdxz3skd0yf2iirkg921-cargo-package-lazy_static-1.5.0.drv504 /nix/store/j0531y8mq3v62w0vvm2m7j6pz4gkmkfr-cargo-package-web-sys-0.3.95.drv505 /nix/store/j54vzfv5wk8pdpkfm7slklql3zqarsx9-cargo-package-futures-macro-0.3.34.drv506 /nix/store/jank68hmz7vlqjw0ffb0pk0knxxbjygr-cargo-package-rustls-0.23.43.drv507 /nix/store/jd89248d2bhysldy2mfl9p962lwvqs4n-cargo-package-windows-sys-0.52.0.drv508 /nix/store/jfrxl6kpfdix85b41yicsdj09pc6fnzd-cargo-package-fnv-1.0.7.drv509 /nix/store/jhj5bpwnv8djy97hvsfnai7kn7bgdm60-cargo-package-prometheus-0.14.0.drv510 /nix/store/jq19m8hm6yv18bm9vqf15nji6r2bmcvb-cargo-package-zerofrom-derive-0.1.7.drv511 /nix/store/jsynhgc9yrhgjm2fk99hxf9s22gq5951-cargo-package-parking_lot_core-0.9.12.drv512 /nix/store/jv26x04fplf0izarbb7408s1lvp2yy8c-cargo-package-idna_adapter-1.2.1.drv513 /nix/store/jy42fiki89znrch3lawyzn2sh72s0zgp-cargo-package-libsqlite3-sys-0.38.2.drv514 /nix/store/jz13xik39z436iw1faimwbi9y58jrhji-cargo-package-pkg-config-0.3.33.drv515 /nix/store/k1ma9648g8kfnjkh1pac0dpw1p4arxz8-cargo-package-serde_derive-1.0.229.drv516 /nix/store/k3rbqghlgrncn6pr8givrar5gjdm807v-cargo-package-local-waker-0.1.4.drv517 /nix/store/ki3bjqrw2iqy6w7mq1dk27zh3212l741-cargo-package-ed25519-3.0.0.drv518 /nix/store/kidhiff9qwdpzh7a0y58mzyx8akpk52y-cargo-package-itoa-1.0.18.drv519 /nix/store/kpzph5x27353s2r2avyx2np4ilmfz1gp-cargo-package-powerfmt-0.2.0.drv520 /nix/store/kv9130cphl7xwfv1iip0n1dmvzlgxwiq-cargo-package-wasm-bindgen-macro-support-0.2.118.drv521 /nix/store/kyh10khacy54nsaxpg3qc873kx8nkv4k-cargo-package-actix-files-0.6.10.drv522 /nix/store/l032i86s4qcbvq97dv2j2bilal3mm7ya-cargo-package-sqlite-wasm-rs-0.5.2.drv523 /nix/store/l2na3300137lna5a4gli3nd2dk1pfd39-cargo-package-windows_x86_64_gnullvm-0.52.6.drv524 /nix/store/l4my3ixpdi3vmlr39r445907svi44d0s-cargo-package-http-0.2.12.drv525 /nix/store/l7c8i2sbr0sdcdnf0wfscjjw3qahc8hs-cargo-package-bzip2-0.6.1.drv526 /nix/store/l81jnxapcapr8sy7gvvi0j3vpka32819-cargo-package-wasm-bindgen-0.2.118.drv527 /nix/store/lcqg3rs8sgsaw4p2w71zbyg4wp9yg5ky-cargo-package-rand_xorshift-0.4.0.drv528 /nix/store/lha1pzgqzh1ma14fs57lcjvqwyb29095-cargo-package-zeroize-1.9.0.drv529 /nix/store/lpcw4m2dzw3dkgkd89aqj9nhkazl2qg6-cargo-package-anstyle-1.0.14.drv530 /nix/store/lpq9da73sr6czqpb2k62688hgjl5r3m9-cargo-package-sha2-0.11.0.drv531 /nix/store/lqd40i03k7zw94i04sxjzr1pff2ws311-cargo-package-futures-core-0.3.34.drv532 /nix/store/lx0lcd5z0yg2ijw54zmdbr9zfjhfz7h5-cargo-package-hashbrown-0.16.1.drv533 /nix/store/lylahjvq3z8jpjf3zdghbamsv7k45f64-cargo-package-futures-sink-0.3.34.drv534 /nix/store/m0a956gzy36x83vj2hv7lmqmdqxj0xnv-cargo-package-slab-0.4.12.drv535 /nix/store/mb9pvvqyxh488nl8mbqykndx6hq2gwc5-cargo-package-thiserror-2.0.20.drv536 /nix/store/mdagy1fbb917vlqnyhs9xa5cblh9gz0l-cargo-package-typenum-1.20.0.drv537 /nix/store/mfbfkdn01av47dnldnr2lyyj7wyba6iw-cargo-package-getrandom-0.3.4.drv538 /nix/store/mfg44djv9pj6885csf1cd1qbqlkyi4h7-cargo-package-winapi-x86_64-pc-windows-gnu-0.4.0.drv539 /nix/store/mj0kv9lpgpr4pk63mvrx9kgfmjmi8jgm-cargo-package-hex-literal-1.1.0.drv540 /nix/store/mk8k1mla1318l2izzx52xk6fnxixlqnv-cargo-package-smallvec-1.15.1.drv541 /nix/store/mkqyjcsav7r2sg8zc5wvyq29ljqr73l0-cargo-package-crypto-common-0.2.1.drv542 /nix/store/mwv16vp8y644r91znrjjn7m9kdsg9638-cargo-package-thiserror-impl-2.0.20.drv543 /nix/store/mx7pg6v8x66rd41ma6b3jfqha51byafj-cargo-package-proc-macro-crate-3.5.0.drv544 /nix/store/mxaw3p6yz976i31ggvqh57y0bvsy585r-cargo-package-plotters-0.3.7.drv545 /nix/store/mxslyflr5c9il02vmwm0ixq43s4rwbn3-cargo-package-walkdir-2.5.0.drv546 /nix/store/na4ljsslhys9075ylz9j5gnh1mqlfxmh-cargo-package-syn-2.0.118.drv547 /nix/store/nfbvrsa6lyj2b81z3m4347mfign5ily7-cargo-package-windows-targets-0.52.6.drv548 /nix/store/nw5i9wsiwinh5h79nb16anclpp5bpv8y-cargo-package-foldhash-0.2.0.drv549 /nix/store/nzf7xf6h9vjyy68mqlgnpvvzd28wlzzb-cargo-package-hashlink-0.12.0.drv550 /nix/store/p421hkc328i37hx962l4kdaggsankay7-cargo-package-windows_i686_gnullvm-0.52.6.drv551 /nix/store/p5dipyhxnvrfk9xlcsrxwxpilnphi09d-cargo-package-fallible-iterator-0.3.0.drv552 /nix/store/pgn6fdz6si0nn5cqkiyayw5a4ijk4b0y-cargo-package-sharded-slab-0.1.7.drv553 /nix/store/pj4z7yli5ss9vr2lb1xd90l6s4pd10fl-cargo-package-actix-http-3.13.3.drv554 /nix/store/pn4ryk0jcryi14dspym9hmjkjnflhq81-cargo-package-signature-3.0.0.drv555 /nix/store/ppvzh7dr368d4n2xzaazcmxmfibv8lbc-cargo-package-tinytemplate-1.2.1.drv556 /nix/store/pz13jnni2bqqccfsf85wi2jwff30v3v9-cargo-package-nu-ansi-term-0.50.3.drv557 /nix/store/pz34597frxjp7rc08whip2sfzhb7zpqs-cargo-package-time-macros-0.2.27.drv558 /nix/store/q33x443v3fqf93c4sz5cfbaj7qfg06l4-cargo-package-zmij-1.0.21.drv559 /nix/store/q67cp4039zkxh7i00xw7zg7vf5bycv90-cargo-package-clap_lex-1.1.0.drv560 /nix/store/q6mppv3lc52gvg4j0vzzsbw08xw3fm4s-cargo-package-async-compression-0.4.44.drv561 /nix/store/qaznldr57yxfl5zjr29132i7ivic6w96-cargo-package-regex-lite-0.1.9.drv562 /nix/store/qiidp199z5yp691r70sljy6b5p73fqbq-cargo-package-tempfile-3.27.0.drv563 /nix/store/qjkqm2igylpkmnbgil5v6a8b4rlak3f2-cargo-package-windows_i686_msvc-0.52.6.drv564 /nix/store/qjsa8vz6rignlr8qzn82xhhwl2dvr2jc-cargo-package-redox_syscall-0.5.18.drv565 /nix/store/qlf06bzxdp9v179c5032m6p60zqf7i1i-cargo-package-r-efi-6.0.0.drv566 /nix/store/qnvkkwf6gnv9fa54awm4blg234lpvidp-cargo-package-thread_local-1.1.9.drv567 /nix/store/qsn0y9jigkvygfnpz41355fb5cqr5x94-cargo-package-serde_core-1.0.229.drv568 /nix/store/qv4fk64c6plm910nv9p30h0plw1y2ak5-cargo-package-tracing-0.1.44.drv569 /nix/store/r15sfq0xybzdpd162n63ipm7gndrvdfk-cargo-package-actix-router-0.5.4.drv570 /nix/store/r262ns681ad4b59cpp94p1z5004y8zzm-cargo-package-rstest-0.26.1.drv571 /nix/store/r2kahfnkkg3iwzkka0j5j70cxrikm04v-cargo-package-winapi-0.3.9.drv572 /nix/store/rai8j8pm0pi6q2vyayhwbnvf4ly1f7dx-cargo-package-compression-codecs-0.4.39.drv573 /nix/store/rfid3s4cbin9ppkd7m0q387h0apj8qlj-cargo-package-zerotrie-0.2.4.drv574 /nix/store/rizpk4xdr7p3hxh49ymvykqghaa34qyf-cargo-package-curve25519-dalek-5.0.0.drv575 /nix/store/rpz5faj1w3yhnvd52478r33ibx3353v0-cargo-package-windows-link-0.2.1.drv576 /nix/store/rxp47xigdb39z4g4c6slqqzp28i65y62-cargo-package-toml_edit-0.25.11+spec-1.1.0.drv577 /nix/store/s02a0nly5idc9cdapm9zzgm7yhmbh2ca-cargo-package-regex-automata-0.4.14.drv578 /nix/store/s3r6pdc2xjrbfk8bm95waylf1gbsp7k9-cargo-package-serde_urlencoded-0.7.1.drv579 /nix/store/s4wahjvyl80852wrf6v27gqspn3s4mkb-cargo-package-clap_builder-4.6.0.drv580 /nix/store/s76nc0vsf2hxwsndbw5yfxlq8vmm47h2-cargo-package-rsqlite-vfs-0.1.0.drv581 /nix/store/shvsira0dk35nikxr2y7fdyxvidhs7rf-cargo-package-linux-raw-sys-0.12.1.drv582 /nix/store/sqrslqkwsy3rpfbn5jkjwxgnvjb5l77k-cargo-package-stable_deref_trait-1.2.1.drv583 /nix/store/svjhazilnlsy4qi1ggzzfrlkqcjv7ylb-cargo-package-wasip2-1.0.3+wasi-0.2.9.drv584 /nix/store/syng8c5bwsb4hbsplxma09hbfm1zd370-cargo-package-quick-error-1.2.3.drv585 /nix/store/v1nlfdii50mhczqp0bgvplvmc81kg7qp-cargo-package-libc-0.2.189.drv586 /nix/store/v2y583lw41rkr5yyamfj42hf4606z3mn-cargo-package-wit-bindgen-0.57.1.drv587 /nix/store/v7yqmkqk0zh016bdnj7hcfpkssj7xsh5-cargo-package-unarray-0.1.4.drv588 /nix/store/vb2jx0hp9a0hixmdb5gh8849kdswf7b4-cargo-package-ed25519-dalek-3.0.0.drv589 /nix/store/vh51vsv9fcqz0cjzc1sgkjqhl3mf9flj-cargo-package-find-msvc-tools-0.1.9.drv590 /nix/store/vnxw047s97qjsg5zq5l587rwcv6krxrz-cargo-package-arrayvec-0.7.6.drv591 /nix/store/vydks0gixqg0fzi1dvqimy014dg8fp69-cargo-package-futures-timer-3.0.3.drv592 /nix/store/w1yh1v78v8hkyghivs373p1kqv90airi-cargo-package-serde-1.0.229.drv593 /nix/store/w8g9rdzmx77783ad2vvrayw6bl8vp2v1-cargo-package-data-encoding-2.11.1.drv594 /nix/store/wda7s86iz98l3znn1m0wmyl8mg8nzrb2-cargo-package-futures-util-0.3.34.drv595 /nix/store/wdmdd2gq1ymiqgmb6kh2qxb35qpws7aq-cargo-package-bit-vec-0.8.0.drv596 /nix/store/wf52lcna80fn51q0n37mivkaymsq477c-cargo-package-blake3-1.8.7.drv597 /nix/store/wmq4slh28s45mrpdidsail69cgasp0kf-cargo-package-toml_parser-1.1.2+spec-1.1.0.drv598 /nix/store/wq47q391nsjspn9v69wa16bjvgyafb0y-cargo-package-litemap-0.8.2.drv599 /nix/store/wrfifpx1fnw8ic0x1lw8nil8b9593qb8-cargo-package-compression-core-0.4.33.drv600 /nix/store/wv5s1p9scgx1j7fyxh4myvg1z790all4-cargo-package-fiat-crypto-0.3.0.drv601 /nix/store/ww1d66wiknbf4xwc3xwfrlxmzcsn3jk6-cargo-package-form_urlencoded-1.2.2.drv602 /nix/store/wwj7j6yxqf2xn7v0z12dri0agbh4rm2w-cargo-package-proptest-1.11.0.drv603 /nix/store/x15kdm2yg0snr6ysjx9bd2r96ry79qxg-cargo-package-rustc_version-0.4.1.drv604 /nix/store/xfl34z9r8sdmjy6c2b210synmwfjn37a-cargo-package-async-stream-0.3.6.drv605 /nix/store/xq7lqrcm76a3cqqz2qrdwxxyngq9nyya-cargo-package-either-1.15.0.drv606 /nix/store/xsbflla4gsy3izhvna318lq8fmjqr3fb-cargo-package-actix-rt-2.11.0.drv607 /nix/store/y4mkhl49aaa5pq3xndg3cxvs578gi49p-cargo-package-zstd-0.13.3.drv608 /nix/store/yci3w2sjk5l8dvq73wgkwf0mgaymm6b4-cargo-package-ciborium-ll-0.2.2.drv609 /nix/store/ygg2w1bhv56r56vd5pwnqfs9x0wcwdmy-cargo-package-zerovec-derive-0.11.3.drv610 /nix/store/yk0cr9wg6dajyy49f1ap6lpbkaa79jfc-cargo-package-ryu-1.0.23.drv611 /nix/store/ysd4wl067cb45c0la6m6pk6s4kc1vgg5-cargo-package-ring-0.17.14.drv612 /nix/store/yv66jdxdamw5h2am44kr5mc63bgi4l1m-cargo-package-rayon-core-1.13.0.drv613 /nix/store/yvhzrl4s511f3czy0jdc9b42s5y5lafs-cargo-package-bytes-1.12.1.drv614 /nix/store/yx3jx1xp3msic89v19wplwjgxhgq09m6-cargo-package-vcpkg-0.2.15.drv615 /nix/store/yzcs5vzna6j0z3gqlp3z9b2jkb8dxp3f-cargo-package-actix-macros-0.2.4.drv616 /nix/store/z0z62lxizgz80034r5scmg0i794i92a0-cargo-package-cfg_aliases-0.2.1.drv617 /nix/store/za9v2ny7bnf22wg8iqqlzd1kgap99n2h-cargo-package-ciborium-io-0.2.2.drv618 /nix/store/zbcpz16c8h2da8rdv6n8v57axkpmxw5f-cargo-package-time-0.3.47.drv619 /nix/store/zdlkkzvcb7vqrdap54vyjsvkadarkb1w-cargo-package-semver-1.0.28.drv620 /nix/store/zgwr3pr9j894x687fvv7frywz8jmq6hb-cargo-package-hybrid-array-0.4.11.drv621 /nix/store/zmc5d8r34f936xi15dn8zvg1lzf1ycfz-cargo-package-windows_x86_64_msvc-0.52.6.drv622 /nix/store/zph70zb52h8byfkj8qyp89jzr5qn80x8-cargo-package-fallible-streaming-iterator-0.1.9.drv623 /nix/store/zsfxvxamd3cy11sad0iipgvzndvjs82c-cargo-package-num-conv-0.2.1.drv624 /nix/store/zvw1v458kisb5f4p0svgf9dhcw7ci34l-cargo-package-tracing-core-0.1.36.drv625 /nix/store/zwlq9gq8vwwxsk4ssqqma38xx4rr78rj-cargo-package-mime_guess-2.0.5.drv626 /nix/store/4arfbprhqsg3xxq8ky1i43p38i7q3d31-vendor-registry.drv627 /nix/store/4f4kw6a12z0lxpi1apk0izbylyw7204m-vendor-cargo-deps.drv628 /nix/store/2id1y8d3wg7g9y6jaky2x2f2nvlbrqzd-Cargo.toml.drv629 /nix/store/4lshz3gif6flvg9mpjhf8pb3yydgwmzw-Cargo.toml.drv630 /nix/store/60q5wdfy1kj5q5a5vbfvdlk8iq7ng6d5-Cargo.toml.drv631 /nix/store/81grx3pg843v62fhgvxscpl9h1whjlqw-Cargo.toml.drv632 /nix/store/8cb23c972azkb8byagg3y793dl0jwdn0-Cargo.toml.drv633 /nix/store/a15cphdhwwrp76hkc34mcb5bdcb4d2ic-Cargo.toml.drv634 /nix/store/axp4wbpxqhrz77qnsz952cild54ki8az-Cargo.toml.drv635 /nix/store/c2rryc71l5nb25h44x5kch8jm2f5j4yq-Cargo.toml.drv636 /nix/store/cpvj4775zmb6gan3vj4jka4qq9024jis-Cargo.toml.drv637 /nix/store/d6q3q9kzg232z2qzvjqx8lwvrhc1a9p9-Cargo.toml.drv638 /nix/store/djs8cgkgf23cl682zqnwa29938ckvbkk-Cargo.toml.drv639 /nix/store/dncbsswnzcn66h1sf11n8ix9sjjzl08r-Cargo.toml.drv640 /nix/store/fby9nlz26iilb65cj2vhh5kpsxgdkj79-Cargo.toml.drv641 /nix/store/gzp41nzhlj65pnr21rsv6rx609d6hvqd-Cargo.toml.drv642 /nix/store/h078x54264yz8ndq9slkbxprag38p73w-Cargo.toml.drv643 /nix/store/la0jkip2j8272582s85km95w4w7ych95-Cargo.toml.drv644 /nix/store/nxi5fhcrlfbh2j0a2ffkjk52b6ar2cvj-Cargo.toml.drv645 /nix/store/pnki7znj6bqr330h1kv0rvpiwfcd5l6s-Cargo.toml.drv646 /nix/store/q2m3qswdclrp4lbl526chlsn95v1ldaq-Cargo.toml.drv647 /nix/store/qkx5pwlrb6k20py7kijfdlzmc82adic2-Cargo.toml.drv648 /nix/store/qz25ds3zblcy6pq4gcpbh14x6bq1h45v-Cargo.toml.drv649 /nix/store/rb4ipzh3l32ix2jwa0l3n1k6fsx0hfwf-Cargo.toml.drv650 /nix/store/rhlksgdh4db0rxbc4rjb2k75mf1p1vzp-Cargo.toml.drv651 /nix/store/rhmk44p78cs32dq1z18vjmhpqknrcjh8-Cargo.toml.drv652 /nix/store/rwln77wd3b2mia7yq8qzg8kjch6j1z5h-Cargo.toml.drv653 /nix/store/xqg6849wqnpbg40qp7z67gjrl143wnr7-dummy.rs.drv654 /nix/store/z5jhkjan1x51yypq703m27cpyrw503f5-Cargo.toml.drv655 /nix/store/8kfwa2ajm71c09wicbm2qspy69xjja2h-source.drv656 /nix/store/wmh82xffispl641xr7djg7s7rl9jkaqa-harmonia-deps-3.2.0.drv657 /nix/store/28bfpp0spq44sjxyrb9lvk0wviq4w8n3-harmonia-3.2.0.drv658 /nix/store/k9hafjdywkhb3acbjajalsi7z9pjj84w-unit-harmonia-gc.service.drv659 /nix/store/4vf6zmcmsvr456gdlsgbc4will9pgs8s-config.json.drv660 /nix/store/id1v7gnygxfnglv20h9ij0z8h0bwkmb4-unit-script-radicle-auto-seed-start.drv661 /nix/store/kclw896hw48w667nl3jk42pkisma6s8q-unit-radicle-auto-seed.service.drv662 /nix/store/yah0gz9gh6q4hqjw2610xf4li033n3x4-unit-script-ip-update-start.drv663 /nix/store/ki93rrmcmk61cjwhx176mdw6p6g6sbb3-unit-ip-update.service.drv664 /nix/store/km0jk1m04fcm34hqb6b2y5hj0c0a8l8n-unit-systemd-logind.service.drv665 /nix/store/kv4xkh7wr3xcmvflhs1rkmznsbv4vlmm-unit-serial-getty-.service.drv666 /nix/store/4alrgl8l69c1kg90gimksd3pdxl8npmp-X-Restart-Triggers-tincr-retiolum.drv667 /nix/store/i854sn9ivfar91b9sqxcpk1fqyd8hdhh-tinc-retiolum-hosts.drv668 /nix/store/npnsk7qbapynwv4pfazyvgj6slbdxm82-tincr-retiolum-migrate.drv669 /nix/store/l4mbz2bk61hlfiq8xkl63dalmjxq3599-unit-tincr-retiolum.service.drv670 /nix/store/ldlfywqy95xrq0rrg045qvbw4livhy6w-unit-prepare-kexec.service.drv671 /nix/store/lhi92f416zagqzf1z36rvhf89yz2c20g-unit-nix-optimise.timer.drv672 /nix/store/ljx2fnijfzbnnrbbhaqljkfdpwpjwnlp-unit-sshd-vsock-.service.drv673 /nix/store/lnf84bgbl56864pm5x4wyawjfh2zmk09-unit-systemd-boot-random-seed.service.drv674 /nix/store/lx0sd508x7qki88mw2vw0cgc2fc4pwjr-unit-systemd-update-utmp.service.drv675 /nix/store/mx9igk4kxyf20ncp6y1sswgjwagkswyw-unit-nix-optimise.service.drv676 /nix/store/nsn5ips71fnm24i38gi3s60r1sm5njzv-unit-script-borgbackup-repo-eva-start.drv677 /nix/store/n48bj9kz2zvic0wsld0a2kb0f2rvxsi3-unit-borgbackup-repo-eva.service.drv678 /nix/store/ip06qz6jfrzpncz8xdssicbsyj68rzfg-unit-40-tincr-retiolum.netdev.drv679 /nix/store/rplpy8ix6hxap50cb1gw6wnakmr68h5d-unit-40-wireguard.netdev.drv680 /nix/store/jh3s8ag5j68rzq7b3gqxnrf7l266g9wk-X-Restart-Triggers-systemd-networkd.drv681 /nix/store/3fsbpgffn7bw4vn71amd8igbk0n01qsy-unit-40-wireguard.network.drv682 /nix/store/ampa36w0cfk1viz8m3pfxynlb594fla1-unit-40-tincr-retiolum.network.drv683 /nix/store/nhj7k2w987a7vlfhq2d5rwn0y1yyg268-unit-99-ethernet-default-dhcp.network.drv684 /nix/store/p6kfmga41r3k2sf017w32w501nc3hgky-unit-10-uplink.network.drv685 /nix/store/sqrm1f45y4ib6civ9dhnincvcxpr9663-X-Reload-Triggers-systemd-networkd.drv686 /nix/store/n5880cvk8h80a3mggwy4vc32d75y821q-unit-systemd-networkd.service.drv687 /nix/store/nbvmis7hrp8ybwr0sn8h2zrzmhcw9a6y-unit-dbus.service.drv688 /nix/store/npspxh1gha9fd3ksd7vkn94wm93r9h1q-unit-systemd-mkswap-.service.drv689 /nix/store/nw7y0sk84cilgnhvwdj6kz2w4nc2i1qj-unit-linger-users.service.drv690 /nix/store/pk6yihqvwq3wfwlav9a8kifnj2w700lk-unit-NetworkManager-wait-online.service-disabled.drv691 /nix/store/pm341a66x2hp3yvx8iznp3q2haq5z3lx-unit-systemd-timesyncd.service.drv692 /nix/store/q5dg8vwzm7pw05wsffcabrimi7hirncv-unit-systemd-makefs-.service.drv693 /nix/store/6pvgd6f4dp6gqfxyva06yzmcy93k35kl-flake-inputs.prom.drv694 /nix/store/lgv3fjfhg7h8sylin5dhyg8fryllzd97-ipv6-dad-check.drv695 /nix/store/vvci37npjgpdawsww16ad8j9gdxdl5hz-zpool-health.drv696 /nix/store/4smi7212z9g4m6rjkvpjxy9ia9dy674q-config.toml.drv697 /nix/store/qbks30ism3375bcvlvb1qb9bglky552f-unit-telegraf.service.drv698 /nix/store/mcv4caxh5miylx5yjynhipqzwd1528v8-cacert-extra-certificates-bundle.crt.drv699 /nix/store/b3ldybg6s0g3q3j0b0dzpk9n0wlcp2ws-nss-cacert-3.126.drv700 /nix/store/qp49zyb4mqml9y9i56wp3hwj9j8cg5gs-unit-radicle-node.service.drv701 /nix/store/r05r3x119xgd103wyrwzg041ky34ay20-unit-getty-.service.drv702 /nix/store/r0njkiggb1qq41wh6qajx0rpsc15s47m-unit-nix-cleanup-gcroots.timer.drv703 /nix/store/b75nf3afdpjwyka5rgzxmj891llscgah-unit-script-radicle-node-setup-start.drv704 /nix/store/rbiihp21l7k6pwk1kr2kjkqf8qa01p9w-unit-radicle-node-setup.service.drv705 /nix/store/rjg4mqsz2xbdkm3qp0yivpb6p82f74yq-unit-sshd-keygen.service.drv706 /nix/store/rzy9ap292yrikgi6ls50jnh3r6jk1sw9-unit-lastlog2-import.service.drv707 /nix/store/hsmr9da5sqsabljw8d3zcsbky6sr66i3-ExecStartPre.drv708 /nix/store/sday2m5hxsc7y4jc9q4y76dgq550zqpk-torrc.drv709 /nix/store/rapn05n9hq9y482ga7pi4xlfsa5dvb67-X-Restart-Triggers-tor.drv710 /nix/store/sgym5w8snagxqjr279zn3939rd63sdlp-unit-tor.service.drv711 /nix/store/sr677zr0n6c0fymfljsa857hm075rndg-unit-zfs-snapshot-daily.service.drv712 /nix/store/v1yb1wg3wijhcrzib502xzvlghp4jaql-unit-logrotate-checkconf.service.drv713 /nix/store/vs268xh54fm1jxrjxhm586ysxdbnqcqj-unit-container-getty-.service.drv714 /nix/store/vzz6c14x444a4p3kgymi31qfnkgrgp9v-unit-nscd.service.drv715 /nix/store/w3n13qri37177mny1q3mf92i9hvpca9n-unit-systemd-journal-flush.service.drv716 /nix/store/w7ivg8irvi05bw4sjd90akqq8rn4mxlz-unit-nix-daemon.service.drv717 /nix/store/771mkg7nippzfzi42cdfjk6738fypn7a-nftables-ensure-deletions.drv718 /nix/store/dvk94inqjp6m757q0jhhii203wafln39-nftables-cleanup-deletions.drv719 /nix/store/6jzbr79mxx1fj10f9l7qm68g49zlv6fw-nftables-deletions.drv720 /nix/store/42gyqd2jgdkls8whrnxwq6j732957qsq-extra-hosts.drv721 /nix/store/ny1ysdl4q1ci5yfaq8d6n9fyxbaydcx7-string-hosts.drv722 /nix/store/j8r81n6jhyysgzav5mq1ld2zc955cij6-hosts.drv723 /nix/store/sdisqn9hb92acqynf57km1c4m6sn1shn-nftables-rules.drv724 /nix/store/w520jwx723r0i9ji3hv6fm16a7rlby51-nftables-save-deletions.drv725 /nix/store/wlr2b621y7dywzpgqhjq95lpk70yh84m-unit-nftables.service.drv726 /nix/store/wrv65kqgnyv7sc8j4syir67l81hm0xxs-unit-zfs-snapshot-daily.timer.drv727 /nix/store/wrzw1wpwisj7lkr7cbq0571rm1pdx6kb-unit-systemd-timedated.service.drv728 /nix/store/52nb01hnrskqgnfhhyzlr4zz80ig0v8b-unit-script-borgbackup-repo-turingmachine-start.drv729 /nix/store/x0gr2p2572bkjj82disk7wl5rqkiyahk-unit-borgbackup-repo-turingmachine.service.drv730 /nix/store/xzsvsyxv7327pnp8s9hf1rrxq5q7drwb-unit-tincr-retiolum.socket.drv731 /nix/store/ambb4bab27xq8p0vs76mcv3wwbq5q5lz-manage.drv732 /nix/store/5ibyxr1241pcbaggypz43mys05pf84hq-unit-script-photoprism-pre-start.drv733 /nix/store/brxbfnprrilm81454gfi5r50qx7v6179-unit-script-photoprism-start.drv734 /nix/store/yviqpwhimvkls2y2wfszqqrrx324a1q2-unit-photoprism.service.drv735 /nix/store/zbmnfbj4z0vvddbkk74wsvi5256vbh25-unit-modprobe-.service.drv736 /nix/store/ziarspaafl96h8vcqs3cb7v1y4634zpj-unit-pinchflat.service.drv737 /nix/store/24prisin3fb83kcbqg8l7mwqvslb2jqq-system-units.drv738 /nix/store/jiyk0a3q4b109wbfpwfhwlkvi7m4naby-set-environment.drv739 /nix/store/2dbx2xyjgqcyk85i7aiqphyndla84wc6-etc-profile.drv740 /nix/store/2gf69ymlc7li2jlk6n31j2p3n7sp5dyq-unit-panic-on-fail.service.drv741 /nix/store/3qxjznih15cksciqlbsqaxxfy8qsf1ws-check-sshd-config.drv742 /nix/store/8bfflqh6aid2zcbf1yik8s5kvqrkzy1d-sops-install-secrets-0.0.1.drv743 /nix/store/3vgx4fn3rf7cnkhvli08mz9m6pr1zn9b-manifest-for-users.json.drv744 /nix/store/5i336ax7q50lw61jkfbyy6byh5nkpsr6-etc-tinc-retiolum-tinc.conf.drv745 /nix/store/5x1qxm15916dmyjmi43011cpwkhr3z94-gen-hostid.drv746 /nix/store/610gb18v8xq0bva0fkayd5lc9w22df4s-users-groups.json.drv747 /nix/store/6pjjbckd50lnw20w5af34syy4nli9hj3-issue.drv748 /nix/store/7g4hnhvygsb9jlvxkx249ii8lwnlmnl3-user-generators.drv749 /nix/store/aaaqz9agnglamikdma6nasrbr31rfsd2-etc-systemd-sleep.conf.drv750 /nix/store/bfpk6gvqr592v40x8caddz7k32rlj02g-etc-shells.drv751 /nix/store/d581i8dhhg7phd9pf7gymhmw9f81krwy-system-shutdown.drv752 /nix/store/d6fiv4glqd4fpyar0pcsip0ma034q7f6-zram-generator.conf.drv753 /nix/store/g5z5g03wf18nl86fkb76pmz67p7282wm-nix-authorized_keys.drv754 /nix/store/g6p562sd7ql7p7hh1klgy877ifyn7hlh-etc-nix-registry.json.drv755 /nix/store/gdz3zy37ff9z0z86cfrwdx829kff5ps1-etc-zshenv.drv756 /nix/store/i35xhw11f0abrc2pr4k7n0w9w48f9x01-unit-dbus-broker.service.drv757 /nix/store/i5d8p0js3002bzdiz7bc35w2yssjkn1h-unit-nixos-activation.service.drv758 /nix/store/wd91y1b3z3vn3yp675dv4ad17czrnx7n-unit-systemd-tmpfiles-setup.service.drv759 /nix/store/gixg0cj2bxzl2x7bc7ah2bg862abrsmx-user-units.drv760 /nix/store/gxsb0zysd4rmw8g1wmi5gl2rg14wzf71-etc-zshrc.drv761 /nix/store/i5ykyqhhms1l23503nk9v2k7ab8gi511-etc-zprofile.drv762 /nix/store/iidn3jl8fgr57wm41bn9bvk52x5sy03b-etc-systemd-system.conf.drv763 /nix/store/k3fr89dvrfgpf5k0jmvflvcxdcb5dya6-systemd-generator-environment.json.drv764 /nix/store/khm8zz6l096a5ndyqiacjyhy2azw9bqr-etc-modprobe.d-nixos.conf.drv765 /nix/store/kllm7fshf9rkl9plg09bmx9x328gsdfr-borg-authorized_keys.drv766 /nix/store/lc1l7p5hn5vrqa4z3hrgn56388fj46m4-joerg-authorized_keys.drv767 /nix/store/pdazis6qdcic61anf47j02ljdh7sc7mq-etc-zinputrc.drv768 /nix/store/qqr0671y5d00dj9sgmjqwr1393iprb8v-etc-ssh-ssh_config.drv769 /nix/store/sb3r0g1yk1ca5wnqcgihfgs51x3gklrw-etc-pam-environment.drv770 /nix/store/vcfsfbbr1qwnh249n7avwv7vgin4lgc6-system-generators.drv771 /nix/store/xqdk4mll4wwhnz1ldciji8azxfjm73kj-etc-fstab.drv772 /nix/store/yip4mx1skjx3xf9rgjjy5dxwfrbsx015-sudoers.drv773 /nix/store/zvhs18nlnv8n6kmbm9vpnkls1099afwi-etc-zfs-zed.d-zed.rc.drv774 /nix/store/6i1w7jqy4c29p6kh7yzmg33ab35akmgv-etc.drv775 /nix/store/6sdvvjfpq2k3wzr8pq39glp3vw30w9x8-initrd-fstab.drv776 /nix/store/8hg6wbzmvg3wkrwq1sgivrx8cqv2fais-initrd-system.conf.drv777 /nix/store/zggqlc255f3vp5wiyxk2y2i9x9q4w3sq-uname.drv778 /nix/store/id2vpqdld8rhrg11asagxbxiflxkyl38-zfs-kernel-2.4.4-7.2.5.drv779 /nix/store/gsjzbzj8kc9k7y69gv2r8vi7pyapf5hg-linux-7.2.5-modules.drv780 /nix/store/8ihd210yi3kn4a0pyv3cqcdprmlv9701-linux-7.2.5-modules-shrunk.drv781 /nix/store/azv1hdl12qjlcz395x3n3254gp9wm5za-initrd-hostname.drv782 /nix/store/pya5chr4q56ssr50a86ky7lx2230456n-50-envfs.conf.drv783 /nix/store/flpildsa25r8wzkalw5c9r3mqdhhw0sh-initrd-tmpfiles.d.drv784 /nix/store/p5l9nqj2hrjd0zyk48mg3xgbi5yngs6f-initrd-shadow.drv785 /nix/store/6z8hq8sqpnarzf13yikvy8xz8iqgiz0x-unit-dbus.service.drv786 /nix/store/7zkbw43k14n14z9rdxn6cplqpqlw13kq-unit-initrd-switch-root.service.drv787 /nix/store/9s5k7xi1v8vkvk52h347vvq5qrlzw65s-unit-systemd-tmpfiles-setup-sysroot.service.drv788 /nix/store/dabfab2sxsi825g0ahl3xf7vd3azkq7y-unit-initrd-parse-etc.service.drv789 /nix/store/f85m4vfiaprf9f6p8z0a017d6sx050ll-unit-systemd-tmpfiles-setup.service.drv790 /nix/store/m2k9m7syxdh3ialgis9kpx6m869isipg-unit-initrd-nixos-activation.service.drv791 /nix/store/pb4rmrmjawpsn8fvr0qh3x17jv66k1q3-unit-initrd-find-nixos-closure.service.drv792 /nix/store/v0f516hhnzavlfqz9l4fvca2b9y1l8ji-unit-modprobe-.service.drv793 /nix/store/xx90mfmvhbfi4icmqm3cvzmrf0x7zjh0-initrd-units.drv794 /nix/store/6wmaw262w01p52hzv9dgjpfla6d5950a-initrd-linux-7.2.5.drv795 /nix/store/6xwh27inlvfk531vlv39pg7vg7m032p8-extlinux-conf-builder.sh.drv796 /nix/store/72hb9lhzmjlgf3y45f19hww9g1q3cbhd-ensure-all-wrappers-paths-exist.drv797 /nix/store/753zby3jn8jczvdd1lpb6d6kr9r1imgl-pre-switch-checks.drv798 /nix/store/jc0gzj0n4djzkjykrz6fh6pj9i4wf0bp-manifest.json.drv799 /nix/store/k150zv4zjrgpd4mb9wj3w4wnp8w278c5-boot.json.drv800 /nix/store/m7zj64vs78hicf8n39sl6h2illrhcbcl-activate.drv801 /nix/store/mvd25c66wng1kz2y68wq09gk9h5q4lz1-dry-activate.drv802 /nix/store/yr7lzr1p8x5mp8yhv5cvjjc2wl6x3flg-install-extlinux-conf.sh.drv803 /nix/store/pr9mvr9m40b88pij8k9ig5g2bbbp77nn-nixos-system-blob64-26.11.20260917.397d52b.drv804these 201 paths will be fetched (1.1 GiB download, 4.1 GiB unpacked):805 /nix/store/k7vmpafggz4scrzb4hfbfqis5fhxi33c-55-nixos-aslr-entropy.conf806 /nix/store/3n4fq9rkd8a7y9rlng48b7h83cd4wkc1-atkmm-2.28.5807 /nix/store/qr28p3japzvaja9ckjlj3lxmxfmia4yh-atomicparsley-20240608.083822.1ed9031808 /nix/store/5gmpnasihk6mbqy94iy6cfnmx7bg6im6-autoreconf-hook809 /nix/store/j212j343yp574dc12b22pk9g63dzgz3s-bandwhich-0.23.1810 /nix/store/3hi0n4jwgm4agj9pafqfkbz5jczd5yr5-bind-9.20.26-dnsutils811 /nix/store/yycr1wgkcxbvyfh4whrdfnddi32ryzr7-binutils-2.46-info812 /nix/store/84d2l70n7wjh12l9nz8q16gkndspg309-binutils-2.46-man813 /nix/store/sjys8wz8s7nl3mv9037nvfmwscibdcdl-binutils-wrapper-2.46-man814 /nix/store/ccywqw8m4axalmfdl17sj8wx6xq6vqin-bootstrap-stage4-stdenv-linux-no-cc815 /nix/store/79sg0sdqvz8ddqjlwsxvas47jqf7vgnf-borgbackup-1.4.5816 /nix/store/98yircygmqxiz58raqm6vsw8qj8504vc-borgbackup-1.4.5-man817 /nix/store/jmskv0wpvw54pmrrzqkx1yy0357in2x0-cairomm-1.14.5818 /nix/store/h9a3hqagrc8m80q05qarib14sk7b9244-cfitsio-4.7.0819 /nix/store/m3yc9gn2k0347mjvxlw8yzhw6w1rb4s2-cgif-0.5.3820 /nix/store/pydwy5w32dcd5x54c9p7rpd497bdlm8q-changelog-d-1.0.2821 /nix/store/b6cjylqq7qvlh9il8ryjfi8mp9z0n5hc-colord-1.4.8822 /nix/store/nzwq1mch5ffxxywnxlw20ydsrskzmpvc-colord-gtk-0.3.1823 /nix/store/wnccfw30bzs91frb92dlwvszfkb27clb-curl-impersonate-2.1.1824 /nix/store/7sz2qc8jz1cald3v5ahdihc00lvlc5sc-darktable-5.6.0825 /nix/store/gp45cfmypmhikz20zgpsd8y88zgqqqs1-dix-2.2.0826 /nix/store/hf4javsb3760z7aa1y35sg76kxv8fvc8-envfs-1.2.0827 /nix/store/4s8v20p1wsbpzv15yvk32446bcm6frgm-exiv2-0.28.9-lib828 /nix/store/b75ckpylhvrrv6wzl2bzx2pwl201anlk-fallback-path829 /nix/store/i9yxyqwnl41kmsnxkm2gb1njc8zxm2aa-ffmpeg-9.0.1-bin830 /nix/store/hfcfnm6jsch1bvgp4zs2cm40vf1dm276-ffmpeg-headless-9.0.1-bin831 /nix/store/dgpgi6zcz5q45nxkza757wczr3sg337v-file-5.48-man832 /nix/store/g255bdzmjwsp08lfbibixvdp6az71glv-gcc-15.3.0-info833 /nix/store/22mnvimbzqkqm3z0d3qdawwjcrd470gy-gcc-15.3.0-man834 /nix/store/znbr5hrgkfyvqx4v38zlq91i1i4ffcf5-glib-networking-2.80.1835 /nix/store/5h79273awiv22ln380fd9c4fzqld89x9-gmic-3.7.6-lib836 /nix/store/rlhn1slywbmzbsnmd0pa8yp87b0nd75c-gnu-config-2024-01-01837 /nix/store/hk3g049iav9z6yn50wa4fg49v4yf0fzd-go-1.25.14838 /nix/store/28hhrm3p3p1msdylz3y9clfnrkqr8z6s-graphicsmagick-1.3.48839 /nix/store/243dk2na84dr8p38jcbvqzn5s57fnx3h-graphviz-15.1.1840 /nix/store/zl74bcjga23i2yxwd296ggmbw8wmy15f-gtkmm-3.24.10841 /nix/store/b1fmp2v17rl3h0mabpkbwql7sq5x33kg-gts-0.7.6842 /nix/store/73fh9rn2wn9zcfzw4z1qssx7aj0wf4sv-gusb-0.4.9843 /nix/store/sdk958rji7vfbh7whm1py6pnvn0qc989-htop-3.5.3844 /nix/store/js0nich0rj03whaysafpixc6i1yzi632-htop-3.5.3-man845 /nix/store/chq87z54bq7qjijh052jzbj4ca2w0wl7-hwinfo-25.5846 /nix/store/1lfwdnkrjjd69c23xrcpa7hpa8k044w8-hwinfo-25.5-lib847 /nix/store/ckxzbwf1d8nlaf9nzmx9qr0vxvv9pv8r-iotop-0.6848 /nix/store/a4bqkcqrnmcgjqisrbpxx3cx82wq2lgv-iperf-3.21849 /nix/store/jzmrki57nv1xbqii1rkr0ck4j8hbsi4h-iperf-3.21-lib850 /nix/store/4q78rf1iw555anjbsyyrm432hklc5wdh-iperf-3.21-man851 /nix/store/ldsqhycdg8vbxirw6v40m3im6ri1hbiq-lensfun-0.3.4852 /nix/store/hnyxqvhqpz1sxsi678kz0b7a2fr2cq99-libcanberra-0.30853 /nix/store/hkqchmmfhmn07g617wjg48fmkddayvs6-libdicom-1.0.5854 /nix/store/f81vbnck8jxdr1a9bjxkax40j139gwki-libgphoto2-2.5.34855 /nix/store/lc44s3f5911kprnzcnfdkjj1xbpn1zcb-libheif-1.23.3-bin856 /nix/store/lx463i42m6krig3z32lymb7m4pdb02zc-libieee1284-0.2.11857 /nix/store/m0brq16va5xz9ldz7zq05is49pvisx8h-libiptcdata-1.0.5858 /nix/store/jnlmbvpcrm5dwzm5r8ssja3aqdidx7bf-libnvme-1.16.1859 /nix/store/qfbn2slvv2vhrsd2m231ngm246sa3jls-libproxy-0.5.12860 /nix/store/pbw3129l41v5zlya2pwbkpmxab9yki0h-libredirect-0861 /nix/store/jf1a72i7v258vx5bifl2a3yjvbrarz4s-libtensorflow862 /nix/store/7n2mmv4rjczf45miqnirafz8fa0b1gfs-libtirpc-1.3.7-dev863 /nix/store/mafr6jyxqj66vhx25xsfi24yw3aax4pq-linux-7.2.5864 /nix/store/6wrba6f861cd02ndxzvd81bamssf5clw-linux-7.2.5-dev865 /nix/store/2d16zihx6h65k5n6jf02pa5pdrr0gy61-linux-7.2.5-modules866 /nix/store/i1v5hfjhdd2jxq5idk02nncdwz75rhry-lkl-2025-11-13-lib867 /nix/store/xrknqw48vyffsnzi80z7g0jz5py3c8pf-lksctp-tools-1.0.21868 /nix/store/nwvkvb9y4pwq99yikjdp9ic22bs791k6-lmdb-0.9.36-bin869 /nix/store/4a299hkw295778g3jjv0aqz8nj9n6ap8-lmdb-0.9.36-dev870 /nix/store/nx5h6dk0yywgawhkjgxm2h8fk996ggx8-man-pages-6.19-man871 /nix/store/3gbx4y4l6sc0qrmw2p69fi6k8rcaach3-matio-1.5.30872 /nix/store/i8khbkjxni2pbh92b3sz4qcsly5r9bq0-mercurial-7.2.2873 /nix/store/67diih9jy1av2swrkbw0ch5g644y1gz0-mold-unwrapped-2.42.0874 /nix/store/00hyzwkhjq7f9s2w1l5bxxq4ipfln19y-mold-unwrapped-wrapper-2.42.0875 /nix/store/3324aa6fdii9p9igfk04iskqp7qm1flh-mtr-0.96876 /nix/store/xgpgqkj5c8m5zi0499i97p0zbi7rc2d2-mtr-0.96-man877 /nix/store/pp6n543s4j8z599ffh5sx349c40670lp-net-snmp-5.9.5.2878 /nix/store/ixidfz0wpcnippk44f1m040x3iir70xm-net-snmp-5.9.5.2-lib879 /nix/store/8b0ry1rgc521jwjmv8mmifw85nb2mk3j-net-tools-2.10880 /nix/store/nqzr84vafnhlc0a2wdgpra9bl437s8da-nfs-utils-2.9.2881 /nix/store/fdzjpkhkd2fl2vksnpik5v0pnq36mg5z-nfs-utils-2.9.2-lib882 /nix/store/pmam8qyih69hhi5rz9v2vp95cnv6ygpa-nix-fetchers-2.35.2-dev883 /nix/store/4cm9f46aymnpd081r8q0h7x5m7w72nhn-nix-ld-2.0.6884 /nix/store/pmkmpziqhp6gagvhdsxbwcgfsgclhcb2-nix-store-2.35.2-dev885 /nix/store/4nvwqlbr2hh2kkdqv4g8yq7p6vfj4js5-nix-util-2.35.2-dev886 /nix/store/60z2lxqnh15f52hsjgvk8l5nwanrnm8z-nix-zsh-completions-0.5.1-unstable-2025-12-12887 /nix/store/awgx1nngqw87kx6m7cv7dgb989j6xyyf-nixos-facter-0.4.4888 /nix/store/10ja6bs5izingd229rdzknnh1h6wpvpb-nvme-cli-2.16889 /nix/store/spd26nmqyjbpr7qs2n0c46ckqpvcdgin-opencv-4.13.0890 /nix/store/6qqpshildkifdlg2w5150d37cxlkaqmm-openslide-4.0.0891 /nix/store/wih3wiqs1zkv6bjx1avwgqn6s9ks744n-openssl-3.6.4-man892 /nix/store/ykk87q2pvyn0hi7ks90yg20rjbchl87d-osm-gps-map-1.2.0893 /nix/store/6frv98v12wsbyavjgh4bwnh203n14582-ouch-0.8.1894 /nix/store/rv8y2fmqrqyvpz42wlg1g0hf0fmmg3ln-pahole-1.31895 /nix/store/gakdbns0csfcl9car5f29wq92pja7dm1-pam.d896 /nix/store/77qmxr0vcpkcz74ga0n1x8y61lb3xy7f-pangomm-2.46.4897 /nix/store/x4ihwab83pdw715lq8vabic8p5pcnd1d-patchelf-0.15.2898 /nix/store/anah3f7fbmfiyby6y9sasy7wnliqczlx-pciutils-3.15.0-man899 /nix/store/mir1jxgaav1l6cb45n3dvc08k862a885-perl5.42.3-Archive-Zip-1.68900 /nix/store/lszmkzd553c30hw6lfihpqq67kjv5csk-perl5.42.3-Compress-Raw-Lzma-2.206901 /nix/store/zx8d738ggnrf9bk3mynjqb3msph2ld2j-perl5.42.3-File-Slurper-0.014902 /nix/store/282za0y8hwmhwh6l7jr9fm3rkzjfkl0s-perl5.42.3-Getopt-Long-2.58903 /nix/store/39zp24vxni86d0zlqz8b60b13yd3g2ml-perl5.42.3-IO-Compress-Brotli-0.019904 /nix/store/mqjs345jwmjwkh2fg0x7vpsvzghgzpgf-perl5.42.3-Image-ExifTool-13.59905 /nix/store/hga790ndcc4fz00xcknzjkqkz8hp5y7h-perl5.42.3-SUPER-1.20190531906 /nix/store/6qq5h10p8y2smxpfp3igvmggc0cfd618-perl5.42.3-Sub-Identify-0.14907 /nix/store/5j15a2bma72hbrfhf48qcbjby7qb2dik-perl5.42.3-Test-MockModule-0.177.0908 /nix/store/8vl0kz5r79vh8r5gr7k5csxz4b126dfz-photoprism-260728-bbde8f452909 /nix/store/lb8csv63svicyp7qh2jd2x8xsffrbw0f-photoprism-backend-260728-bbde8f452910 /nix/store/5np7vcy3bvwka1ivrs3mrsdfb0mc0zcf-photoprism-frontend-260728-bbde8f452911 /nix/store/scc2d9jvkairmk6hd7hbnpvlym62qwmg-pinchflat-2025.9.26912 /nix/store/js4gw07v3s6lgrjk7ygg8zj8mgx5rf6s-poppler-data-0.4.12913 /nix/store/lwi6h1g4lh7zp6v48r80f69zhkirpl0z-poppler-glib-26.06.0914 /nix/store/13r5mssjzvkdgi0d3f4p14bqp03pq2wj-portmidi-2.0.8915 /nix/store/g5lp9aqdl5jxc2af24plv7fac5mj6z81-psmisc-23.7916 /nix/store/85y0aiwm1wcvf5111vzbqfji2ccicfmh-pugixml-1.16917 /nix/store/kxl1d4664xf8xwynvhnp4fiikjkq1rd0-pybind11-setup-hook918 /nix/store/rwg4kyj336j35csibciqh5z0qx0n7sxv-python3-minimal-3.14.7919 /nix/store/ms400zib9wqhd6w3jij3c2z6vl6lzha4-python3.13-absl-py-2.5.0920 /nix/store/x07h00nxnibnh7q3p2d6s28jvrw4hp4r-python3.13-astunparse-1.6.3921 /nix/store/qn8s7pw8vh3f44mdn03w50av6qdk1i0b-python3.13-charset-normalizer-3.4.9922 /nix/store/9imcx31m2pb3rbc9r8qkglcxip9vabf6-python3.13-clang-21.1.8923 /nix/store/mv6v7nxm9pj84m1gh9bslw331x720bvh-python3.13-flatbuffers-25.12.19924 /nix/store/mm07mf5lx8sli5ll6kxj367zimdl98px-python3.13-gast-0.7.0925 /nix/store/kbiz2j1q9mgpkn5ffh7csw3r26wc85h6-python3.13-google-pasta-0.2.0926 /nix/store/c8p61qddwd058dwsjr5vh1sbdxxzygng-python3.13-grpcio-1.83.0927 /nix/store/nvfrr13dxrgnzj2vva8yizy12p982ybq-python3.13-grpcio-1.83.0-dev928 /nix/store/r6skifby1syc18av5vps62zrk4ixkx74-python3.13-h5py-3.16.0929 /nix/store/9yg7b381ghr3y0d9ln4h09f151k5pq26-python3.13-markdown-3.10.2930 /nix/store/iw782h54d75js2f1wg9v1ilfnqk2n0hx-python3.13-markupsafe-3.0.3931 /nix/store/swvhzpszpyki4z0k8639ymwfyv46a4ys-python3.13-ml-dtypes-0.6.0932 /nix/store/vlkbk5qk0n6w0gjkxwjqhydyhjlvff86-python3.13-numpy-2.5.2933 /nix/store/ycp3sivy5cq4a4y15q73r7g0j8wrlnaq-python3.13-opt-einsum-3.4.0934 /nix/store/lv72i8jljxxrnbss7d0vpg70pdi14r7w-python3.13-pillow-12.3.0935 /nix/store/n03fwwnx8g0kj5kdcqfgyhmj42q3lmdp-python3.13-protobuf-7.36.1936 /nix/store/h5abcp246qadsjhyhcgnksp4vap7d8ik-python3.13-requests-2.34.2937 /nix/store/8p92j2ppflf7igibazxiwsh3wa8y528w-python3.13-setuptools-83.0.0938 /nix/store/2lgbsi5lps6a0nxv9lpf8r3n2arv2ifg-python3.13-six-1.17.0939 /nix/store/xspvg2wanmvz8x0lajxni9930ml8shbx-python3.13-tensorboard-2.21.0940 /nix/store/cc2fwd7a5d8adkrvjxnncmhcb0cayjl2-python3.13-tensorboard-data-server-0.7.2941 /nix/store/7skmxfirykhnxrypxa1rrszq9gg7p2dl-python3.13-tensorflow-2.21.0942 /nix/store/nc9cfk7wcacx2zvmmdlf55kmkncxc2y0-python3.13-termcolor-3.3.0943 /nix/store/mbnbaq4qv34bh9bnmcz3nmr31yzyygr9-python3.13-urllib3-2.7.0944 /nix/store/hvd3gl3bxydjl4dpa7wykzycnv9ac9wq-python3.13-werkzeug-3.1.8945 /nix/store/gnbs3drzxbngqrqlqs6hsffzr2k6dgpm-python3.13-wrapt-2.2.2946 /nix/store/mqnjfzvfbfavi9f811f2aggyjgxmwvx0-python3.14-apprise-1.13.0947 /nix/store/zing9vnkyd1wh36x676cfxanq1l47h94-python3.14-curl-cffi-0.16.0948 /nix/store/k5iyx2fx3pzkm2h4l4y9ddgxxgzqxqjg-python3.14-dataclasses-json-0.6.7949 /nix/store/q4yxsrx8vhhw5pj3c3pcvhd31y5zdvcl-python3.14-google-re2-1.1.20251105950 /nix/store/wlz8kh5cb3jp2q7g4dqmjmdhzwsxwr55-python3.14-htmlmin-0.1.12951 /nix/store/gb7qfmms5s1wi3wc0yv0w7h5mdmrn991-python3.14-json-schema-for-humans-1.5.1952 /nix/store/8dpjdpkkhfmdza0p21h5jx1ibgjhg01i-python3.14-markdown2-2.5.5953 /nix/store/kb5gc3554xsjd5vn3yq7b2b0pg2w1bvj-python3.14-marshmallow-4.3.0954 /nix/store/x0x6j7yi1p3i640ngh5rsyfvc1x6mypp-python3.14-mutagen-1.48.1955 /nix/store/pfkijn7f1zw2dlsp6ir8vy69hv0d3wd9-python3.14-oauthlib-3.3.1956 /nix/store/95k7sk6fdlcbyli2xlrh8s912ly36ckk-python3.14-outcome-1.3.0.post0957 /nix/store/f4a8g13c7gwck2bz41yb6gija53a5hf2-python3.14-pybind11-3.0.4958 /nix/store/dzggl7gs8ncknrca9r4n9i0nnzgybkqn-python3.14-pycryptodomex-3.23.0959 /nix/store/4b69c3j6p1clzrpd8bh51pn4jg85yzk7-python3.14-pyfuse3-3.5.0960 /nix/store/9fzl0k08g5b7g07y02hlfck9vz70p3k9-python3.14-requests-oauthlib-2.0.0961 /nix/store/xnlplm3isyidd5ayk8h6wd685hzkc5my-python3.14-shtab-1.9.2962 /nix/store/ggsrxnni3v1kwj708592n8b07nmylsr1-python3.14-sniffio-1.3.1963 /nix/store/ghq0n2an6icgxw3nsp035ip0dq2yk27q-python3.14-standard-cgi-3.13.0964 /nix/store/qncdmmwwc834bv25dfjfjma2pbnmjj29-python3.14-trio-0.33.0965 /nix/store/alnn25ns8j4pm3lpd3p019vhqprbvpmp-python3.14-typing-inspect-0.9.0-unstable-2025-10-20966 /nix/store/q2fx86gqzd2lkz2pb9jyqyyag41wqa86-python3.14-websockets-16.1967 /nix/store/fz2fi7lhn3ma6j2v1xddmaabjgn4vn5s-python3.14-yt-dlp-ejs-0.8.0968 /nix/store/yhqmzmbdjabs5xm73jk3h3m6m0qa4vgg-radicle-node-chroot-paths969 /nix/store/2gkvnfczb52dl94z8jb2zkf4g2sidxzh-rawtherapee-5.13970 /nix/store/264kaqqrmanq1bvx90rf8ra6fxn17nc3-re2-2025-11-05971 /nix/store/lqv9cgqig657zn8ssni7gb2yyzwg3pin-rust-bindgen-unwrapped-0.72.1972 /nix/store/kyhnz23p7vxz2f3ynj8492ds5zi9cnxv-sane-backends-1.4.0973 /nix/store/ggyc6mz7dgixzdclz8y7592wjyg08q9c-scdoc-1.11.5974 /nix/store/a2ff4c4wb35bjh0sjnkml8yrqxm3750b-scdoc-1.11.5-dev975 /nix/store/893kcr9h2m4qgvb2ww6shi6j4rijlr73-script-util-linux-2.42.3976 /nix/store/i0kiwvq4xgk15x3rr8ribnhqdn97vhxa-setup-module-compression977 /nix/store/8495ccahv9klck41p0psaq87wqlamxrc-sipcalc-1.1.6978 /nix/store/fgv0cdd9bb4w5sfd6ls2zz7jznm7k3is-smartmontools-7.5979 /nix/store/m8g55wxjm9ap4d8748xnsim3sv2nifx6-step-cli-0.30.6980 /nix/store/h7c69cza9viq8l2nc7dbssv9ip8wni39-sysstat-12.7.7981 /nix/store/zar1ngk0rjpjv7jb0l9gfbncn6a0sfpc-tcpdump-4.99.6982 /nix/store/zv7r1h1ijwgc60nzvp25cl5gx3hmgjrn-telegraf-1.40.0983 /nix/store/qmfxy54k6mvv29d1mpjyc053l61ppxnw-tig-2.6.1984 /nix/store/4gg481k0nwd4s10vpwzmqkn3b26q4d3q-tig-2.6.1-man985 /nix/store/dg1aq6yb25xahcqam3pfwir7nlvp5n4b-tmux-3.7c-man986 /nix/store/5pnj3cb5fccay0yv0m2xjb7bhkvripps-tor-0.4.9.12987 /nix/store/qskqd23hxx9vdjfwrb0l9624kghddhaq-tor-0.4.9.12-geoip988 /nix/store/42lg58mxcbz7vijjyy4pf4x1nijb1x40-tor-client-auth-gen989 /nix/store/iwvnb2rw7j1if53r7gvvaxr2rh6iqgdj-torsocks-2.5.0990 /nix/store/j3kyr24c85wwgxfdbg0gh85sysrdyz3k-udev-check-hook991 /nix/store/z95lk9hgfi9ih03mcj6vsdi86n80c9wp-update-autotools-gnu-config-scripts-hook992 /nix/store/fj3xc9v06n8b3l0djjyhkqd5gxkrpzy7-usbutils-019993 /nix/store/h79x81lhh352kdgx7mavvxpggq0gl26m-usbutils-019-man994 /nix/store/gfip1jv3m6r2c156yr8rxbkzky4c9znv-vim-9.2.1001-xxd995 /nix/store/b1rxi506yhn87shccbcjc8wyhmybyqp1-vips-8.18.6996 /nix/store/6wyj9ycxngp7qhhkh2gc95vmz94kykpc-wget-1.25.0997 /nix/store/1yfnc7rpqmh1yr5aln33w836hky4pq6g-wget-1.25.0-man998 /nix/store/p6mp2kb34badldga984aa5f8a0pb5fxf-whois-5.6.6999 /nix/store/hyh6bmvqwgn7b4ksk1qmb0b9mxz2pcwg-xz-5.8.31000 /nix/store/d3wvdnd9mv9j2kkxa6d1r3b2m8dccpvi-xz-5.8.3-bin1001 /nix/store/srq230c38j963s0g4lqrh94ajqv7i7w2-yt-dlp-2026.08.191002 /nix/store/kiakp2fr9a8h9hbpyd0bv7frjbwj24xs-zfs-prune-snapshots-1.5.01003 /nix/store/qvfzdsaavkkhg1zwrhsixl7gs65gdbqf-zram-generator-1.2.11004 /nix/store/yrn0bmddzgif6rlwyvnbgjar9z9py3ql-zsh-5.9.21005 /nix/store/md3hd22gvna8mnj7w16pwpyy49kf3r5i-zsh-5.9.2-man1006Failed to find a machine for remote build!1007derivation: i854sn9ivfar91b9sqxcpk1fqyd8hdhh-tinc-retiolum-hosts.drv1008required (system, features): (aarch64-linux, [])10091 available machines:1010(systems, maxjobs, supportedFeatures, mandatoryFeatures)1011([aarch64-darwin, x86_64-darwin], 8, [big-parallel, recursive-nix], [])1012Failed to find a machine for remote build!1013derivation: lx3n6fj0fijkgypy7fan6f9p9pnf485z-cargo-package-adler2-2.0.1.drv1014required (system, features): (aarch64-linux, [])10151 available machines:1016(systems, maxjobs, supportedFeatures, mandatoryFeatures)1017([aarch64-darwin, x86_64-darwin], 8, [big-parallel, recursive-nix], [])1018Failed to find a machine for remote build!1019derivation: blxqyp2m05d9fh4ncvsygcqkvz2p29zr-cargo-package-ascii-1.1.0.drv1020required (system, features): (aarch64-linux, [])10211 available machines:1022(systems, maxjobs, supportedFeatures, mandatoryFeatures)1023([aarch64-darwin, x86_64-darwin], 8, [big-parallel, recursive-nix], [])1024Failed to find a machine for remote build!1025derivation: nzzw5k5vwn657q79y4pvypjdhhs4wszl-cargo-package-autocfg-1.5.0.drv1026required (system, features): (aarch64-linux, [])10271 available machines:1028(systems, maxjobs, supportedFeatures, mandatoryFeatures)1029([aarch64-darwin, x86_64-darwin], 8, [big-parallel, recursive-nix], [])1030Failed to find a machine for remote build!1031derivation: g3v6pfqzfkrppmnwa0blq5c3padwmymq-cargo-package-base16ct-1.0.0.drv1032required (system, features): (aarch64-linux, [])10331 available machines:1034(systems, maxjobs, supportedFeatures, mandatoryFeatures)1035([aarch64-darwin, x86_64-darwin], 8, [big-parallel, recursive-nix], [])1036Failed to find a machine for remote build!1037derivation: f9yx292d7hcf6zmv7siwjgs87lp58rqr-cargo-package-base64-0.22.1.drv1038required (system, features): (aarch64-linux, [])10391 available machines:1040(systems, maxjobs, supportedFeatures, mandatoryFeatures)1041([aarch64-darwin, x86_64-darwin], 8, [big-parallel, recursive-nix], [])1042Failed to find a machine for remote build!1043derivation: j3fblmnjhm73hcjvvfyglbkwki1dyfvx-cargo-package-base64ct-1.8.3.drv1044required (system, features): (aarch64-linux, [])10451 available machines:1046(systems, maxjobs, supportedFeatures, mandatoryFeatures)1047([aarch64-darwin, x86_64-darwin], 8, [big-parallel, recursive-nix], [])1048Failed to find a machine for remote build!1049derivation: fqx718j6bp8lm5m4f24ykb6iscxz47rl-cargo-package-bit-set-0.8.0.drv1050required (system, features): (aarch64-linux, [])10511 available machines:1052(systems, maxjobs, supportedFeatures, mandatoryFeatures)1053([aarch64-darwin, x86_64-darwin], 8, [big-parallel, recursive-nix], [])1054Failed to find a machine for remote build!1055derivation: v1h9z5aq00k1mhsrn5cqin6c5nq10vkx-cargo-package-bit-vec-0.8.0.drv1056required (system, features): (aarch64-linux, [])10571 available machines:1058(systems, maxjobs, supportedFeatures, mandatoryFeatures)1059([aarch64-darwin, x86_64-darwin], 8, [big-parallel, recursive-nix], [])1060Failed to find a machine for remote build!1061derivation: 5xcjkq78f62zz0b6c13qsfy9vaa303nd-cargo-package-bitflags-2.13.2.drv1062required (system, features): (aarch64-linux, [])10631 available machines:1064(systems, maxjobs, supportedFeatures, mandatoryFeatures)1065([aarch64-darwin, x86_64-darwin], 8, [big-parallel, recursive-nix], [])1066Failed to find a machine for remote build!1067derivation: 9h9hs5108szbcvqms5j5hwwqscnk0rlb-cargo-package-block-buffer-0.12.0.drv1068required (system, features): (aarch64-linux, [])10691 available machines:1070(systems, maxjobs, supportedFeatures, mandatoryFeatures)1071([aarch64-darwin, x86_64-darwin], 8, [big-parallel, recursive-nix], [])1072Failed to find a machine for remote build!1073derivation: g9688909nhl6lqscxzrrjnz4y09q5d8b-cargo-package-block2-0.6.2.drv1074required (system, features): (aarch64-linux, [])10751 available machines:1076(systems, maxjobs, supportedFeatures, mandatoryFeatures)1077([aarch64-darwin, x86_64-darwin], 8, [big-parallel, recursive-nix], [])1078Failed to find a machine for remote build!1079derivation: 0a4pnvxsziwpx3xdchlb8cfg69b0d5l2-cargo-package-bytes-1.11.1.drv1080required (system, features): (aarch64-linux, [])10811 available machines:1082(systems, maxjobs, supportedFeatures, mandatoryFeatures)1083([aarch64-darwin, x86_64-darwin], 8, [big-parallel, recursive-nix], [])1084Failed to find a machine for remote build!1085derivation: 8zvh1rjblcyhkssnajwn3dy7h0z3laqw-cargo-package-cc-1.4.5.drv1086required (system, features): (aarch64-linux, [])10871 available machines:1088(systems, maxjobs, supportedFeatures, mandatoryFeatures)1089([aarch64-darwin, x86_64-darwin], 8, [big-parallel, recursive-nix], [])1090Failed to find a machine for remote build!1091derivation: smn1mhh81naklby9mi141vybhh8sa55y-cargo-package-cesu8-1.1.0.drv1092required (system, features): (aarch64-linux, [])10931 available machines:1094(systems, maxjobs, supportedFeatures, mandatoryFeatures)1095([aarch64-darwin, x86_64-darwin], 8, [big-parallel, recursive-nix], [])1096Failed to find a machine for remote build!1097derivation: 36waw2hr3nmlpvfrnxfvgwwr3hhmrcy5-cargo-package-cfg_aliases-0.2.1.drv1098required (system, features): (aarch64-linux, [])10991 available machines:1100(systems, maxjobs, supportedFeatures, mandatoryFeatures)1101([aarch64-darwin, x86_64-darwin], 8, [big-parallel, recursive-nix], [])1102Failed to find a machine for remote build!1103derivation: d7g93j21ybacsyxppdqpsshqw5y70lq4-cargo-package-chunked_transfer-1.5.0.drv1104required (system, features): (aarch64-linux, [])11051 available machines:1106(systems, maxjobs, supportedFeatures, mandatoryFeatures)1107([aarch64-darwin, x86_64-darwin], 8, [big-parallel, recursive-nix], [])1108Failed to find a machine for remote build!1109derivation: jv0knywgfi3xrwrnv6d36l1sbgxf8liz-cargo-package-cipher-0.5.2.drv1110required (system, features): (aarch64-linux, [])11111 available machines:1112(systems, maxjobs, supportedFeatures, mandatoryFeatures)1113([aarch64-darwin, x86_64-darwin], 8, [big-parallel, recursive-nix], [])1114Failed to find a machine for remote build!1115derivation: hzqn5m12pm07fs84jdwaqzsnjl4ya1k9-cargo-package-cmov-0.5.3.drv1116required (system, features): (aarch64-linux, [])11171 available machines:1118(systems, maxjobs, supportedFeatures, mandatoryFeatures)1119([aarch64-darwin, x86_64-darwin], 8, [big-parallel, recursive-nix], [])1120Failed to find a machine for remote build!1121derivation: qm6qbw042cmgkf450lml12wqbr668rdx-cargo-package-combine-4.6.7.drv1122required (system, features): (aarch64-linux, [])11231 available machines:1124(systems, maxjobs, supportedFeatures, mandatoryFeatures)1125([aarch64-darwin, x86_64-darwin], 8, [big-parallel, recursive-nix], [])1126Failed to find a machine for remote build!1127derivation: 34x37b3zn5bysa2qwh4rsww6liw7v0hl-cargo-package-const-oid-0.10.2.drv1128required (system, features): (aarch64-linux, [])11291 available machines:1130(systems, maxjobs, supportedFeatures, mandatoryFeatures)1131([aarch64-darwin, x86_64-darwin], 8, [big-parallel, recursive-nix], [])1132Failed to find a machine for remote build!1133derivation: ifyrhk31lzpdh4xhnlyzhzlvxs1nhnkc-cargo-package-cpubits-0.1.1.drv1134required (system, features): (aarch64-linux, [])11351 available machines:1136(systems, maxjobs, supportedFeatures, mandatoryFeatures)1137([aarch64-darwin, x86_64-darwin], 8, [big-parallel, recursive-nix], [])1138Failed to find a machine for remote build!1139derivation: 37ljmyqp2dykwg5rbc40yflhb71ya1x1-cargo-package-cpufeatures-0.2.17.drv1140required (system, features): (aarch64-linux, [])11411 available machines:1142(systems, maxjobs, supportedFeatures, mandatoryFeatures)1143([aarch64-darwin, x86_64-darwin], 8, [big-parallel, recursive-nix], [])1144Failed to find a machine for remote build!1145derivation: jywdlfqy23s7c94gv3mdk1891hbzf5ph-cargo-package-cpufeatures-0.3.0.drv1146required (system, features): (aarch64-linux, [])11471 available machines:1148(systems, maxjobs, supportedFeatures, mandatoryFeatures)1149([aarch64-darwin, x86_64-darwin], 8, [big-parallel, recursive-nix], [])1150Failed to find a machine for remote build!1151derivation: 3ahyr5spj1z9cdv54j2a7i792fy992hy-cargo-package-crc32fast-1.5.0.drv1152required (system, features): (aarch64-linux, [])11531 available machines:1154(systems, maxjobs, supportedFeatures, mandatoryFeatures)1155([aarch64-darwin, x86_64-darwin], 8, [big-parallel, recursive-nix], [])1156Failed to find a machine for remote build!1157derivation: brpcn6q11acm924aql8rvi2jmr63737c-cargo-package-crypto-bigint-0.7.5.drv1158required (system, features): (aarch64-linux, [])11591 available machines:1160(systems, maxjobs, supportedFeatures, mandatoryFeatures)1161([aarch64-darwin, x86_64-darwin], 8, [big-parallel, recursive-nix], [])1162Failed to find a machine for remote build!1163derivation: shrwx1lb9ppa1mwspp4y7xn40zlbnd4w-cargo-package-crypto-common-0.2.2.drv1164required (system, features): (aarch64-linux, [])11651 available machines:1166(systems, maxjobs, supportedFeatures, mandatoryFeatures)1167([aarch64-darwin, x86_64-darwin], 8, [big-parallel, recursive-nix], [])1168Failed to find a machine for remote build!1169derivation: 2415qwjlvhywddn04rqzvksb40dmk9d5-cargo-package-crypto-primes-0.7.2.drv1170required (system, features): (aarch64-linux, [])11711 available machines:1172(systems, maxjobs, supportedFeatures, mandatoryFeatures)1173([aarch64-darwin, x86_64-darwin], 8, [big-parallel, recursive-nix], [])1174Failed to find a machine for remote build!1175derivation: 8n3qb0afz6vfxn1ymjmca7i3xl9bjlwm-cargo-package-ctutils-0.4.2.drv1176required (system, features): (aarch64-linux, [])11771 available machines:1178(systems, maxjobs, supportedFeatures, mandatoryFeatures)1179([aarch64-darwin, x86_64-darwin], 8, [big-parallel, recursive-nix], [])1180Failed to find a machine for remote build!1181derivation: a1bpzz1b3rlwf118s2kgh76liv23lw9n-cargo-package-curve25519-dalek-5.0.0-pre.6.drv1182required (system, features): (aarch64-linux, [])11831 available machines:1184(systems, maxjobs, supportedFeatures, mandatoryFeatures)1185([aarch64-darwin, x86_64-darwin], 8, [big-parallel, recursive-nix], [])1186Failed to find a machine for remote build!1187derivation: 5rhny3q912rd3q1d9n6n7y1fpagdsc68-cargo-package-curve25519-dalek-derive-0.1.1.drv1188required (system, features): (aarch64-linux, [])11891 available machines:1190(systems, maxjobs, supportedFeatures, mandatoryFeatures)1191([aarch64-darwin, x86_64-darwin], 8, [big-parallel, recursive-nix], [])1192Failed to find a machine for remote build!1193derivation: 8bhh69nk1ylrh0j7ifysc1bb5dlybcas-cargo-package-der-0.8.1.drv1194required (system, features): (aarch64-linux, [])11951 available machines:1196(systems, maxjobs, supportedFeatures, mandatoryFeatures)1197([aarch64-darwin, x86_64-darwin], 8, [big-parallel, recursive-nix], [])1198Failed to find a machine for remote build!1199derivation: bpv0i1142a6c3706rqgngdqw7xmlms7y-cargo-package-digest-0.11.2.drv1200required (system, features): (aarch64-linux, [])12011 available machines:1202(systems, maxjobs, supportedFeatures, mandatoryFeatures)1203([aarch64-darwin, x86_64-darwin], 8, [big-parallel, recursive-nix], [])1204Failed to find a machine for remote build!1205derivation: lpilg6i99iavwhc1jpkvnnh3q4m5wz4j-cargo-package-dispatch2-0.3.1.drv1206required (system, features): (aarch64-linux, [])12071 available machines:1208(systems, maxjobs, supportedFeatures, mandatoryFeatures)1209([aarch64-darwin, x86_64-darwin], 8, [big-parallel, recursive-nix], [])1210Failed to find a machine for remote build!1211derivation: id083c10c8hx13dy5l2lz6fr72m07mil-cargo-package-dlopen2-0.8.2.drv1212required (system, features): (aarch64-linux, [])12131 available machines:1214(systems, maxjobs, supportedFeatures, mandatoryFeatures)1215([aarch64-darwin, x86_64-darwin], 8, [big-parallel, recursive-nix], [])1216Failed to find a machine for remote build!1217derivation: 7jdpipkcfanydfa325hh14r09crginmb-cargo-package-ed25519-3.0.0-rc.4.drv1218required (system, features): (aarch64-linux, [])12191 available machines:1220(systems, maxjobs, supportedFeatures, mandatoryFeatures)1221([aarch64-darwin, x86_64-darwin], 8, [big-parallel, recursive-nix], [])1222Failed to find a machine for remote build!1223derivation: ji5ixfa0043dqyypql6pvcw0ly0fi9jl-cargo-package-ed25519-dalek-3.0.0-pre.6.drv1224required (system, features): (aarch64-linux, [])12251 available machines:1226(systems, maxjobs, supportedFeatures, mandatoryFeatures)1227([aarch64-darwin, x86_64-darwin], 8, [big-parallel, recursive-nix], [])1228Failed to find a machine for remote build!1229derivation: 5yzrr6i2c4qq04j361zx9yfllhzg6kf0-cargo-package-enumflags2-0.7.12.drv1230required (system, features): (aarch64-linux, [])12311 available machines:1232(systems, maxjobs, supportedFeatures, mandatoryFeatures)1233([aarch64-darwin, x86_64-darwin], 8, [big-parallel, recursive-nix], [])1234Failed to find a machine for remote build!1235derivation: 2j5mcil10sgr1b58w6hnz8nw73cjvfpn-cargo-package-enumflags2_derive-0.7.12.drv1236required (system, features): (aarch64-linux, [])12371 available machines:1238(systems, maxjobs, supportedFeatures, mandatoryFeatures)1239([aarch64-darwin, x86_64-darwin], 8, [big-parallel, recursive-nix], [])1240Failed to find a machine for remote build!1241derivation: a8gdnjcfxniaqlryza1iqlimnan4jlfa-cargo-package-env_filter-2.0.0.drv1242required (system, features): (aarch64-linux, [])12431 available machines:1244(systems, maxjobs, supportedFeatures, mandatoryFeatures)1245([aarch64-darwin, x86_64-darwin], 8, [big-parallel, recursive-nix], [])1246Failed to find a machine for remote build!1247derivation: q9zjz5c6500pdf8i65ngjyvd2fz29p4i-cargo-package-env_logger-0.11.11.drv1248required (system, features): (aarch64-linux, [])12491 available machines:1250(systems, maxjobs, supportedFeatures, mandatoryFeatures)1251([aarch64-darwin, x86_64-darwin], 8, [big-parallel, recursive-nix], [])1252Failed to find a machine for remote build!1253derivation: fbymbpl23v1zy1famxja34f6yqvr1mr0-cargo-package-equivalent-1.0.2.drv1254required (system, features): (aarch64-linux, [])12551 available machines:1256(systems, maxjobs, supportedFeatures, mandatoryFeatures)1257([aarch64-darwin, x86_64-darwin], 8, [big-parallel, recursive-nix], [])1258Failed to find a machine for remote build!1259derivation: w21fa4v0fp6i5nrnqgpry0yq40fbv5ap-cargo-package-fastrand-2.4.0.drv1260required (system, features): (aarch64-linux, [])12611 available machines:1262(systems, maxjobs, supportedFeatures, mandatoryFeatures)1263([aarch64-darwin, x86_64-darwin], 8, [big-parallel, recursive-nix], [])1264Failed to find a machine for remote build!1265derivation: jh4f2w6z842szjsjdssdm1q2k7lc11f3-cargo-package-fiat-crypto-0.3.0.drv1266required (system, features): (aarch64-linux, [])12671 available machines:1268(systems, maxjobs, supportedFeatures, mandatoryFeatures)1269([aarch64-darwin, x86_64-darwin], 8, [big-parallel, recursive-nix], [])1270Failed to find a machine for remote build!1271derivation: l6c01i6958pz95da1gm1wqn5mb4la3hi-cargo-package-find-msvc-tools-0.1.12.drv1272required (system, features): (aarch64-linux, [])12731 available machines:1274(systems, maxjobs, supportedFeatures, mandatoryFeatures)1275([aarch64-darwin, x86_64-darwin], 8, [big-parallel, recursive-nix], [])1276Failed to find a machine for remote build!1277derivation: rx1h49dkpdi384sshr4si7gvxs81lyf6-cargo-package-flate2-1.1.10.drv1278required (system, features): (aarch64-linux, [])12791 available machines:1280(systems, maxjobs, supportedFeatures, mandatoryFeatures)1281([aarch64-darwin, x86_64-darwin], 8, [big-parallel, recursive-nix], [])1282Failed to find a machine for remote build!1283derivation: cj69rx2gg1x05xqbvpdxvd6sgvlwmwym-cargo-package-fnv-1.0.7.drv1284required (system, features): (aarch64-linux, [])12851 available machines:1286(systems, maxjobs, supportedFeatures, mandatoryFeatures)1287([aarch64-darwin, x86_64-darwin], 8, [big-parallel, recursive-nix], [])1288Failed to find a machine for remote build!1289derivation: x7fi6d5mdy2wa86pkfvvdmp6i0xc8hl7-cargo-package-getrandom-0.3.4.drv1290required (system, features): (aarch64-linux, [])12911 available machines:1292(systems, maxjobs, supportedFeatures, mandatoryFeatures)1293([aarch64-darwin, x86_64-darwin], 8, [big-parallel, recursive-nix], [])1294Failed to find a machine for remote build!1295derivation: sw8mp27xgkbw3m6dp14w7654lzi3c0d5-cargo-package-hashbrown-0.16.1.drv1296required (system, features): (aarch64-linux, [])12971 available machines:1298(systems, maxjobs, supportedFeatures, mandatoryFeatures)1299([aarch64-darwin, x86_64-darwin], 8, [big-parallel, recursive-nix], [])1300Failed to find a machine for remote build!1301derivation: 100nbwps2pfzk3y2mv3iw65iqp6vmmwl-cargo-package-hex-0.4.3.drv1302required (system, features): (aarch64-linux, [])13031 available machines:1304(systems, maxjobs, supportedFeatures, mandatoryFeatures)1305([aarch64-darwin, x86_64-darwin], 8, [big-parallel, recursive-nix], [])1306Failed to find a machine for remote build!1307derivation: wc2l7xrdqsr4v82gdd9cwx25ndr7kzf5-cargo-package-hmac-0.13.0.drv1308required (system, features): (aarch64-linux, [])13091 available machines:1310(systems, maxjobs, supportedFeatures, mandatoryFeatures)1311([aarch64-darwin, x86_64-darwin], 8, [big-parallel, recursive-nix], [])1312Failed to find a machine for remote build!1313derivation: x2997yiz9fpnayhg4cixhyanhv0qlfhz-cargo-package-hybrid-array-0.4.10.drv1314required (system, features): (aarch64-linux, [])13151 available machines:1316(systems, maxjobs, supportedFeatures, mandatoryFeatures)1317([aarch64-darwin, x86_64-darwin], 8, [big-parallel, recursive-nix], [])1318Failed to find a machine for remote build!1319derivation: jxnrza012z620wzdhmsyxkdqih84sz10-cargo-package-indexmap-2.13.1.drv1320required (system, features): (aarch64-linux, [])13211 available machines:1322(systems, maxjobs, supportedFeatures, mandatoryFeatures)1323([aarch64-darwin, x86_64-darwin], 8, [big-parallel, recursive-nix], [])1324Failed to find a machine for remote build!1325derivation: 8bbw3ad4v47n0yd74j2vjzv5dp2y7rgp-cargo-package-inout-0.2.2.drv1326required (system, features): (aarch64-linux, [])13271 available machines:1328(systems, maxjobs, supportedFeatures, mandatoryFeatures)1329([aarch64-darwin, x86_64-darwin], 8, [big-parallel, recursive-nix], [])1330Failed to find a machine for remote build!1331derivation: 7rrks3f2fqa5z1gcj1i93s40r9v7hb29-cargo-package-ipnet-2.12.0.drv1332required (system, features): (aarch64-linux, [])13331 available machines:1334(systems, maxjobs, supportedFeatures, mandatoryFeatures)1335([aarch64-darwin, x86_64-darwin], 8, [big-parallel, recursive-nix], [])1336Failed to find a machine for remote build!1337derivation: ib7yjai64sll6c4nyps1hmbr85msl5pq-cargo-package-jni-0.21.1.drv1338required (system, features): (aarch64-linux, [])13391 available machines:1340(systems, maxjobs, supportedFeatures, mandatoryFeatures)1341([aarch64-darwin, x86_64-darwin], 8, [big-parallel, recursive-nix], [])1342Failed to find a machine for remote build!1343derivation: k8c0088n3ihbn9fn1rdgm8wh7fs38as9-cargo-package-jni-sys-0.3.1.drv1344required (system, features): (aarch64-linux, [])13451 available machines:1346(systems, maxjobs, supportedFeatures, mandatoryFeatures)1347([aarch64-darwin, x86_64-darwin], 8, [big-parallel, recursive-nix], [])1348Failed to find a machine for remote build!1349derivation: 6p7kz5m702rbcmci6jn0xlyqr5fgyx62-cargo-package-jni-sys-0.4.1.drv1350required (system, features): (aarch64-linux, [])13511 available machines:1352(systems, maxjobs, supportedFeatures, mandatoryFeatures)1353([aarch64-darwin, x86_64-darwin], 8, [big-parallel, recursive-nix], [])1354Failed to find a machine for remote build!1355derivation: v24zjy36av6f38rac1ci3hg4hwzs8pbx-cargo-package-jni-sys-macros-0.4.1.drv1356required (system, features): (aarch64-linux, [])13571 available machines:1358(systems, maxjobs, supportedFeatures, mandatoryFeatures)1359([aarch64-darwin, x86_64-darwin], 8, [big-parallel, recursive-nix], [])1360Failed to find a machine for remote build!1361derivation: pgdz5sl4fqm1j5x2id847qmvacpfm1nr-cargo-package-keccak-0.2.0.drv1362required (system, features): (aarch64-linux, [])13631 available machines:1364(systems, maxjobs, supportedFeatures, mandatoryFeatures)1365([aarch64-darwin, x86_64-darwin], 8, [big-parallel, recursive-nix], [])1366Failed to find a machine for remote build!1367derivation: z7vyngx484s5235hmljmnl7540rcw7hn-cargo-package-kem-0.3.0.drv1368required (system, features): (aarch64-linux, [])13691 available machines:1370(systems, maxjobs, supportedFeatures, mandatoryFeatures)1371([aarch64-darwin, x86_64-darwin], 8, [big-parallel, recursive-nix], [])1372Failed to find a machine for remote build!1373derivation: 23zfs318842pjgw24rqdbc2r28i9l0i6-cargo-package-landlock-0.4.4.drv1374required (system, features): (aarch64-linux, [])13751 available machines:1376(systems, maxjobs, supportedFeatures, mandatoryFeatures)1377([aarch64-darwin, x86_64-darwin], 8, [big-parallel, recursive-nix], [])1378Failed to find a machine for remote build!1379derivation: lvvj3nq9sydfwgng1fk25vr613da2vb5-cargo-package-lz4_flex-0.14.0.drv1380required (system, features): (aarch64-linux, [])13811 available machines:1382(systems, maxjobs, supportedFeatures, mandatoryFeatures)1383([aarch64-darwin, x86_64-darwin], 8, [big-parallel, recursive-nix], [])1384Failed to find a machine for remote build!1385derivation: xwr6s9kksi7bbc1h19kr84lv3scagdhb-cargo-package-mac-addr-0.3.0.drv1386required (system, features): (aarch64-linux, [])13871 available machines:1388(systems, maxjobs, supportedFeatures, mandatoryFeatures)1389([aarch64-darwin, x86_64-darwin], 8, [big-parallel, recursive-nix], [])1390Failed to find a machine for remote build!1391derivation: 2r0j07r29s8xn96907sz56qpm3n71fv7-cargo-package-memchr-2.8.0.drv1392required (system, features): (aarch64-linux, [])13931 available machines:1394(systems, maxjobs, supportedFeatures, mandatoryFeatures)1395([aarch64-darwin, x86_64-darwin], 8, [big-parallel, recursive-nix], [])1396Failed to find a machine for remote build!1397derivation: xjb6y3vvcqggq66q445xg1s6xfjjl2zy-cargo-package-memoffset-0.9.1.drv1398required (system, features): (aarch64-linux, [])13991 available machines:1400(systems, maxjobs, supportedFeatures, mandatoryFeatures)1401([aarch64-darwin, x86_64-darwin], 8, [big-parallel, recursive-nix], [])1402Failed to find a machine for remote build!1403derivation: kfwk3i2d1mipalzqffs8pkxpjgrhcjha-cargo-package-miniz_oxide-0.9.1.drv1404required (system, features): (aarch64-linux, [])14051 available machines:1406(systems, maxjobs, supportedFeatures, mandatoryFeatures)1407([aarch64-darwin, x86_64-darwin], 8, [big-parallel, recursive-nix], [])1408Failed to find a machine for remote build!1409derivation: 6s68l2rynwggm0dxjybp9sqvwhyf9800-cargo-package-ml-kem-0.3.2.drv1410required (system, features): (aarch64-linux, [])14111 available machines:1412(systems, maxjobs, supportedFeatures, mandatoryFeatures)1413([aarch64-darwin, x86_64-darwin], 8, [big-parallel, recursive-nix], [])1414Failed to find a machine for remote build!1415derivation: 2vrzi9njhvykfyx3chrf0xpkavfm2h88-cargo-package-module-lattice-0.2.3.drv1416required (system, features): (aarch64-linux, [])14171 available machines:1418(systems, maxjobs, supportedFeatures, mandatoryFeatures)1419([aarch64-darwin, x86_64-darwin], 8, [big-parallel, recursive-nix], [])1420Failed to find a machine for remote build!1421derivation: 5h6vlrwg5lcs5zf3b9x6fivfaavzw153-cargo-package-ndk-context-0.1.1.drv1422required (system, features): (aarch64-linux, [])14231 available machines:1424(systems, maxjobs, supportedFeatures, mandatoryFeatures)1425([aarch64-darwin, x86_64-darwin], 8, [big-parallel, recursive-nix], [])1426Failed to find a machine for remote build!1427derivation: fi7jksarj0g0fl229j774w9jsaxmfmmp-cargo-package-netdev-0.46.2.drv1428required (system, features): (aarch64-linux, [])14291 available machines:1430(systems, maxjobs, supportedFeatures, mandatoryFeatures)1431([aarch64-darwin, x86_64-darwin], 8, [big-parallel, recursive-nix], [])1432Failed to find a machine for remote build!1433derivation: yl7w03hjcnd4qp4qdxgd89ziq086h7b0-cargo-package-netlink-packet-core-0.9.0.drv1434required (system, features): (aarch64-linux, [])14351 available machines:1436(systems, maxjobs, supportedFeatures, mandatoryFeatures)1437([aarch64-darwin, x86_64-darwin], 8, [big-parallel, recursive-nix], [])1438Failed to find a machine for remote build!1439derivation: 613maf0wdk55ixn56njm36kcxcxlyaa4-cargo-package-netlink-packet-route-0.33.0.drv1440required (system, features): (aarch64-linux, [])14411 available machines:1442(systems, maxjobs, supportedFeatures, mandatoryFeatures)1443([aarch64-darwin, x86_64-darwin], 8, [big-parallel, recursive-nix], [])1444Failed to find a machine for remote build!1445derivation: jd8l0zfx3pk11g03i1ji8v8gjk2k3ajk-cargo-package-netlink-sys-0.9.0.drv1446required (system, features): (aarch64-linux, [])14471 available machines:1448(systems, maxjobs, supportedFeatures, mandatoryFeatures)1449([aarch64-darwin, x86_64-darwin], 8, [big-parallel, recursive-nix], [])1450Failed to find a machine for remote build!1451derivation: 2rzz9hdiyn6rnsl8igk1qpqnlgj9iqbv-cargo-package-nix-0.31.3.drv1452required (system, features): (aarch64-linux, [])14531 available machines:1454(systems, maxjobs, supportedFeatures, mandatoryFeatures)1455([aarch64-darwin, x86_64-darwin], 8, [big-parallel, recursive-nix], [])1456Failed to find a machine for remote build!1457derivation: 0b5nrl92gcp1ii2qld0hkcizg7m6rzsg-cargo-package-num-conv-0.2.1.drv1458required (system, features): (aarch64-linux, [])14591 available machines:1460(systems, maxjobs, supportedFeatures, mandatoryFeatures)1461([aarch64-darwin, x86_64-darwin], 8, [big-parallel, recursive-nix], [])1462Failed to find a machine for remote build!1463derivation: 9v39algajp9xwxyi3n7zzzm7cpg86vg1-cargo-package-objc2-0.6.4.drv1464required (system, features): (aarch64-linux, [])14651 available machines:1466(systems, maxjobs, supportedFeatures, mandatoryFeatures)1467([aarch64-darwin, x86_64-darwin], 8, [big-parallel, recursive-nix], [])1468Failed to find a machine for remote build!1469derivation: m5k4ims0z1bbmfx18ff0ym1gvfc3qja2-cargo-package-objc2-core-foundation-0.3.2.drv1470required (system, features): (aarch64-linux, [])14711 available machines:1472(systems, maxjobs, supportedFeatures, mandatoryFeatures)1473([aarch64-darwin, x86_64-darwin], 8, [big-parallel, recursive-nix], [])1474Failed to find a machine for remote build!1475derivation: pi9vdb440dnn3f906v1wrlnlb7h0kz5m-cargo-package-objc2-encode-4.1.0.drv1476required (system, features): (aarch64-linux, [])14771 available machines:1478(systems, maxjobs, supportedFeatures, mandatoryFeatures)1479([aarch64-darwin, x86_64-darwin], 8, [big-parallel, recursive-nix], [])1480Failed to find a machine for remote build!1481derivation: m4ajgaas130wshv4c743pm8m4ikv7z11-cargo-package-objc2-system-configuration-0.3.2.drv1482required (system, features): (aarch64-linux, [])14831 available machines:1484(systems, maxjobs, supportedFeatures, mandatoryFeatures)1485([aarch64-darwin, x86_64-darwin], 8, [big-parallel, recursive-nix], [])1486Failed to find a machine for remote build!1487derivation: n60r8fk7vwdh0szk26bcwjn1yh5b6snp-cargo-package-openssl-src-300.5.2+3.5.2.drv1488required (system, features): (aarch64-linux, [])14891 available machines:1490(systems, maxjobs, supportedFeatures, mandatoryFeatures)1491([aarch64-darwin, x86_64-darwin], 8, [big-parallel, recursive-nix], [])1492Failed to find a machine for remote build!1493derivation: s9m8v69k8p74yvff9wvgz80ga7xnzbr4-cargo-package-openssl-sys-0.9.117.drv1494required (system, features): (aarch64-linux, [])14951 available machines:1496(systems, maxjobs, supportedFeatures, mandatoryFeatures)1497([aarch64-darwin, x86_64-darwin], 8, [big-parallel, recursive-nix], [])1498Failed to find a machine for remote build!1499derivation: z3qf2yzvvi44y8q0h6g74f8iqqdh3p61-cargo-package-pem-rfc7468-1.0.0.drv1500required (system, features): (aarch64-linux, [])15011 available machines:1502(systems, maxjobs, supportedFeatures, mandatoryFeatures)1503([aarch64-darwin, x86_64-darwin], 8, [big-parallel, recursive-nix], [])1504Failed to find a machine for remote build!1505derivation: vvjkibi74adlj4w8c7qjc9180czrb30y-cargo-package-pkcs1-0.8.0-rc.4.drv1506required (system, features): (aarch64-linux, [])15071 available machines:1508(systems, maxjobs, supportedFeatures, mandatoryFeatures)1509([aarch64-darwin, x86_64-darwin], 8, [big-parallel, recursive-nix], [])1510Failed to find a machine for remote build!1511derivation: sf6myzfwhvhsafym88x7vzkyb92g6hvd-cargo-package-pkcs8-0.11.0.drv1512required (system, features): (aarch64-linux, [])15131 available machines:1514(systems, maxjobs, supportedFeatures, mandatoryFeatures)1515([aarch64-darwin, x86_64-darwin], 8, [big-parallel, recursive-nix], [])1516Failed to find a machine for remote build!1517derivation: 1y50vsmqigdxgxwnmjlp0irr96w5dlv4-cargo-package-pkg-config-0.3.34.drv1518required (system, features): (aarch64-linux, [])15191 available machines:1520(systems, maxjobs, supportedFeatures, mandatoryFeatures)1521([aarch64-darwin, x86_64-darwin], 8, [big-parallel, recursive-nix], [])1522Failed to find a machine for remote build!1523derivation: idybn9jqk7l1mfalhnlm7glzan0md7fr-cargo-package-plist-1.10.0.drv1524required (system, features): (aarch64-linux, [])15251 available machines:1526(systems, maxjobs, supportedFeatures, mandatoryFeatures)1527([aarch64-darwin, x86_64-darwin], 8, [big-parallel, recursive-nix], [])1528Failed to find a machine for remote build!1529derivation: 8d6bqkjh3yaic89bjiwsp7d0cpfnksmf-cargo-package-ppv-lite86-0.2.21.drv1530required (system, features): (aarch64-linux, [])15311 available machines:1532(systems, maxjobs, supportedFeatures, mandatoryFeatures)1533([aarch64-darwin, x86_64-darwin], 8, [big-parallel, recursive-nix], [])1534Failed to find a machine for remote build!1535derivation: 3z6pmnhxv8v56szpqp2j1aq1463ipq34-cargo-package-proc-macro2-1.0.106.drv1536required (system, features): (aarch64-linux, [])15371 available machines:1538(systems, maxjobs, supportedFeatures, mandatoryFeatures)1539([aarch64-darwin, x86_64-darwin], 8, [big-parallel, recursive-nix], [])1540Failed to find a machine for remote build!1541derivation: s39gli40wcjbarhqi343gz6f3cvgf6nd-cargo-package-proptest-1.11.0.drv1542required (system, features): (aarch64-linux, [])15431 available machines:1544(systems, maxjobs, supportedFeatures, mandatoryFeatures)1545([aarch64-darwin, x86_64-darwin], 8, [big-parallel, recursive-nix], [])1546Failed to find a machine for remote build!1547derivation: xcgppsp2kcvjsxi2rjggax6cy6wqlb3r-cargo-package-quick-error-1.2.3.drv1548required (system, features): (aarch64-linux, [])15491 available machines:1550(systems, maxjobs, supportedFeatures, mandatoryFeatures)1551([aarch64-darwin, x86_64-darwin], 8, [big-parallel, recursive-nix], [])1552Failed to find a machine for remote build!1553derivation: yag5s3plc2rnv78yqmxjgv7q5casx1l4-cargo-package-quick-xml-0.41.0.drv1554required (system, features): (aarch64-linux, [])15551 available machines:1556(systems, maxjobs, supportedFeatures, mandatoryFeatures)1557([aarch64-darwin, x86_64-darwin], 8, [big-parallel, recursive-nix], [])1558Failed to find a machine for remote build!1559derivation: nhsi4fqr2maay5am8zg1hjj34xwqfk18-cargo-package-quote-1.0.45.drv1560required (system, features): (aarch64-linux, [])15611 available machines:1562(systems, maxjobs, supportedFeatures, mandatoryFeatures)1563([aarch64-darwin, x86_64-darwin], 8, [big-parallel, recursive-nix], [])1564Failed to find a machine for remote build!1565derivation: ynhablnm3nxj1g1xjx4xcbrhc4indzf9-cargo-package-r-efi-5.3.0.drv1566required (system, features): (aarch64-linux, [])15671 available machines:1568(systems, maxjobs, supportedFeatures, mandatoryFeatures)1569([aarch64-darwin, x86_64-darwin], 8, [big-parallel, recursive-nix], [])1570Failed to find a machine for remote build!1571derivation: hkkma3cha09wdcja3fza7495nk2ahy9f-cargo-package-rand-0.9.2.drv1572required (system, features): (aarch64-linux, [])15731 available machines:1574(systems, maxjobs, supportedFeatures, mandatoryFeatures)1575([aarch64-darwin, x86_64-darwin], 8, [big-parallel, recursive-nix], [])1576Failed to find a machine for remote build!1577derivation: yj3a6clnwapx57v09swm123p3xm0q1ik-cargo-package-rand_chacha-0.10.0.drv1578required (system, features): (aarch64-linux, [])15791 available machines:1580(systems, maxjobs, supportedFeatures, mandatoryFeatures)1581([aarch64-darwin, x86_64-darwin], 8, [big-parallel, recursive-nix], [])1582Failed to find a machine for remote build!1583derivation: h2d7y5hqnfkng1dhiiwkls49xfkh1rm9-cargo-package-rand_chacha-0.9.0.drv1584required (system, features): (aarch64-linux, [])15851 available machines:1586(systems, maxjobs, supportedFeatures, mandatoryFeatures)1587([aarch64-darwin, x86_64-darwin], 8, [big-parallel, recursive-nix], [])1588Failed to find a machine for remote build!1589derivation: r2zvmh8wbmx1vc4riqpzyi37r8n3bi0z-cargo-package-rand_core-0.9.5.drv1590required (system, features): (aarch64-linux, [])15911 available machines:1592(systems, maxjobs, supportedFeatures, mandatoryFeatures)1593([aarch64-darwin, x86_64-darwin], 8, [big-parallel, recursive-nix], [])1594Failed to find a machine for remote build!1595derivation: lwpyzsccrkmsqbkwprfp4fd3qi99wrpv-cargo-package-rand_xorshift-0.4.0.drv1596required (system, features): (aarch64-linux, [])15971 available machines:1598(systems, maxjobs, supportedFeatures, mandatoryFeatures)1599([aarch64-darwin, x86_64-darwin], 8, [big-parallel, recursive-nix], [])1600Failed to find a machine for remote build!1601derivation: q9kl556wn9zammlqiwaj78wiynlmrlny-cargo-package-regex-1.13.1.drv1602required (system, features): (aarch64-linux, [])16031 available machines:1604(systems, maxjobs, supportedFeatures, mandatoryFeatures)1605([aarch64-darwin, x86_64-darwin], 8, [big-parallel, recursive-nix], [])1606Failed to find a machine for remote build!1607derivation: 48dqd61dlfqici7kx85ahiwwp3j026lz-cargo-package-rsa-0.10.0-rc.18.drv1608required (system, features): (aarch64-linux, [])16091 available machines:1610(systems, maxjobs, supportedFeatures, mandatoryFeatures)1611([aarch64-darwin, x86_64-darwin], 8, [big-parallel, recursive-nix], [])1612Failed to find a machine for remote build!1613derivation: zrk3vr6ri1467vfvpj6gfn1w7iinh3ag-cargo-package-rustc_version-0.4.1.drv1614required (system, features): (aarch64-linux, [])16151 available machines:1616(systems, maxjobs, supportedFeatures, mandatoryFeatures)1617([aarch64-darwin, x86_64-darwin], 8, [big-parallel, recursive-nix], [])1618Failed to find a machine for remote build!1619derivation: rnfysbsgbvqczy8jwar9jiqr1cbwfmlf-cargo-package-rusty-fork-0.3.1.drv1620required (system, features): (aarch64-linux, [])16211 available machines:1622(systems, maxjobs, supportedFeatures, mandatoryFeatures)1623([aarch64-darwin, x86_64-darwin], 8, [big-parallel, recursive-nix], [])1624Failed to find a machine for remote build!1625derivation: ydpw2vpl7b9x2b6ji5akls25f2birs7j-cargo-package-same-file-1.0.6.drv1626required (system, features): (aarch64-linux, [])16271 available machines:1628(systems, maxjobs, supportedFeatures, mandatoryFeatures)1629([aarch64-darwin, x86_64-darwin], 8, [big-parallel, recursive-nix], [])1630Failed to find a machine for remote build!1631derivation: ilwwrz5ip0q0vp3cdpzh82yccsp9jx2i-cargo-package-semver-1.0.28.drv1632required (system, features): (aarch64-linux, [])16331 available machines:1634(systems, maxjobs, supportedFeatures, mandatoryFeatures)1635([aarch64-darwin, x86_64-darwin], 8, [big-parallel, recursive-nix], [])1636Failed to find a machine for remote build!1637derivation: gazfi2k4a3as5sgg115dsqrgdwari95s-cargo-package-serdect-0.4.3.drv1638required (system, features): (aarch64-linux, [])16391 available machines:1640(systems, maxjobs, supportedFeatures, mandatoryFeatures)1641([aarch64-darwin, x86_64-darwin], 8, [big-parallel, recursive-nix], [])1642Failed to find a machine for remote build!1643derivation: nclx94h7d77qsa7b3p7h94vhzrghwz54-cargo-package-sha2-0.11.0.drv1644required (system, features): (aarch64-linux, [])16451 available machines:1646(systems, maxjobs, supportedFeatures, mandatoryFeatures)1647([aarch64-darwin, x86_64-darwin], 8, [big-parallel, recursive-nix], [])1648Failed to find a machine for remote build!1649derivation: dbwq9g6dab3rqspr2ghw49gyzblrxgqx-cargo-package-sha3-0.11.0.drv1650required (system, features): (aarch64-linux, [])16511 available machines:1652(systems, maxjobs, supportedFeatures, mandatoryFeatures)1653([aarch64-darwin, x86_64-darwin], 8, [big-parallel, recursive-nix], [])1654Failed to find a machine for remote build!1655derivation: rk0zbmcd5ypwrdbsfjnxq9mlq5nf9gz2-cargo-package-shake-0.1.0.drv1656required (system, features): (aarch64-linux, [])16571 available machines:1658(systems, maxjobs, supportedFeatures, mandatoryFeatures)1659([aarch64-darwin, x86_64-darwin], 8, [big-parallel, recursive-nix], [])1660Failed to find a machine for remote build!1661derivation: hnpfsc5sdlmp77c4j8cviayjk0mxrbkd-cargo-package-signature-3.0.0-rc.10.drv1662required (system, features): (aarch64-linux, [])16631 available machines:1664(systems, maxjobs, supportedFeatures, mandatoryFeatures)1665([aarch64-darwin, x86_64-darwin], 8, [big-parallel, recursive-nix], [])1666Failed to find a machine for remote build!1667derivation: rxy00hnsih9z74sgwsv5i1c3px05ww2z-cargo-package-simd-adler32-0.3.9.drv1668required (system, features): (aarch64-linux, [])16691 available machines:1670(systems, maxjobs, supportedFeatures, mandatoryFeatures)1671([aarch64-darwin, x86_64-darwin], 8, [big-parallel, recursive-nix], [])1672Failed to find a machine for remote build!1673derivation: 91l56ajc6wpa3k0xjx4j321vgdaxfs0f-cargo-package-slotmap-1.1.1.drv1674required (system, features): (aarch64-linux, [])16751 available machines:1676(systems, maxjobs, supportedFeatures, mandatoryFeatures)1677([aarch64-darwin, x86_64-darwin], 8, [big-parallel, recursive-nix], [])1678Failed to find a machine for remote build!1679derivation: shira9dam9pn4q06y0svprsc2nnk58hy-cargo-package-spki-0.8.0.drv1680required (system, features): (aarch64-linux, [])16811 available machines:1682(systems, maxjobs, supportedFeatures, mandatoryFeatures)1683([aarch64-darwin, x86_64-darwin], 8, [big-parallel, recursive-nix], [])1684Failed to find a machine for remote build!1685derivation: w5dykbsabnn0marab25qwjr66jx778lc-cargo-package-sponge-cursor-0.1.0.drv1686required (system, features): (aarch64-linux, [])16871 available machines:1688(systems, maxjobs, supportedFeatures, mandatoryFeatures)1689([aarch64-darwin, x86_64-darwin], 8, [big-parallel, recursive-nix], [])1690Failed to find a machine for remote build!1691derivation: 1lv2rxjk7bwkmpaj3nziarg4ldxjiaz1-cargo-package-syn-2.0.117.drv1692required (system, features): (aarch64-linux, [])16931 available machines:1694(systems, maxjobs, supportedFeatures, mandatoryFeatures)1695([aarch64-darwin, x86_64-darwin], 8, [big-parallel, recursive-nix], [])1696Failed to find a machine for remote build!1697derivation: q429pqz0q4d9sggpamvr03471jjcacnw-cargo-package-syn-3.0.5.drv1698required (system, features): (aarch64-linux, [])16991 available machines:1700(systems, maxjobs, supportedFeatures, mandatoryFeatures)1701([aarch64-darwin, x86_64-darwin], 8, [big-parallel, recursive-nix], [])1702Failed to find a machine for remote build!1703derivation: f92a1g12pin4vm2y9vi18xj5zbryypff-cargo-package-thiserror-1.0.69.drv1704required (system, features): (aarch64-linux, [])17051 available machines:1706(systems, maxjobs, supportedFeatures, mandatoryFeatures)1707([aarch64-darwin, x86_64-darwin], 8, [big-parallel, recursive-nix], [])1708Failed to find a machine for remote build!1709derivation: 8bglk8yjnx3v9963pkbl5drbjkq2ypn5-cargo-package-thiserror-impl-1.0.69.drv1710required (system, features): (aarch64-linux, [])17111 available machines:1712(systems, maxjobs, supportedFeatures, mandatoryFeatures)1713([aarch64-darwin, x86_64-darwin], 8, [big-parallel, recursive-nix], [])1714Failed to find a machine for remote build!1715derivation: 6wy3gnx57qfi0sp99gav969rlwdr9vw7-cargo-package-time-0.3.47.drv1716required (system, features): (aarch64-linux, [])17171 available machines:1718(systems, maxjobs, supportedFeatures, mandatoryFeatures)1719([aarch64-darwin, x86_64-darwin], 8, [big-parallel, recursive-nix], [])1720Failed to find a machine for remote build!1721derivation: aal5a2zgdns12v9az5bb6xrxcssi02dc-cargo-package-time-core-0.1.8.drv1722required (system, features): (aarch64-linux, [])17231 available machines:1724(systems, maxjobs, supportedFeatures, mandatoryFeatures)1725([aarch64-darwin, x86_64-darwin], 8, [big-parallel, recursive-nix], [])1726Failed to find a machine for remote build!1727derivation: ccm72sf843z0jdwjv0lrxh80cn9mipr2-cargo-package-time-macros-0.2.27.drv1728required (system, features): (aarch64-linux, [])17291 available machines:1730(systems, maxjobs, supportedFeatures, mandatoryFeatures)1731([aarch64-darwin, x86_64-darwin], 8, [big-parallel, recursive-nix], [])1732Failed to find a machine for remote build!1733derivation: 9c807hkf350qjs80s17sjccm78gfz9sd-cargo-package-tiny_http-0.12.0.drv1734required (system, features): (aarch64-linux, [])17351 available machines:1736(systems, maxjobs, supportedFeatures, mandatoryFeatures)1737([aarch64-darwin, x86_64-darwin], 8, [big-parallel, recursive-nix], [])1738Failed to find a machine for remote build!1739derivation: dbfai8yj588hb7c15rdclfnrd0qsy8q9-cargo-package-twox-hash-2.1.2.drv1740required (system, features): (aarch64-linux, [])17411 available machines:1742(systems, maxjobs, supportedFeatures, mandatoryFeatures)1743([aarch64-darwin, x86_64-darwin], 8, [big-parallel, recursive-nix], [])1744Failed to find a machine for remote build!1745derivation: gzl3c3yw2av76yzkxrbiwxl8042l4k6d-cargo-package-typenum-1.19.0.drv1746required (system, features): (aarch64-linux, [])17471 available machines:1748(systems, maxjobs, supportedFeatures, mandatoryFeatures)1749([aarch64-darwin, x86_64-darwin], 8, [big-parallel, recursive-nix], [])1750Failed to find a machine for remote build!1751derivation: brm4f2scgj2p2fncxm711salzy1143lq-cargo-package-unarray-0.1.4.drv1752required (system, features): (aarch64-linux, [])17531 available machines:1754(systems, maxjobs, supportedFeatures, mandatoryFeatures)1755([aarch64-darwin, x86_64-darwin], 8, [big-parallel, recursive-nix], [])1756Failed to find a machine for remote build!1757derivation: gxczrpmigdcv6kaffvfbp68pyv9zzw3y-cargo-package-vcpkg-0.2.15.drv1758required (system, features): (aarch64-linux, [])17591 available machines:1760(systems, maxjobs, supportedFeatures, mandatoryFeatures)1761([aarch64-darwin, x86_64-darwin], 8, [big-parallel, recursive-nix], [])1762Failed to find a machine for remote build!1763derivation: v6m0bcym7zk4hnllwn2yd7x65kwgz0h5-cargo-package-wait-timeout-0.2.1.drv1764required (system, features): (aarch64-linux, [])17651 available machines:1766(systems, maxjobs, supportedFeatures, mandatoryFeatures)1767([aarch64-darwin, x86_64-darwin], 8, [big-parallel, recursive-nix], [])1768Failed to find a machine for remote build!1769derivation: 7l55qd53xsgb7vnazr453zqyrqdr03aq-cargo-package-walkdir-2.5.0.drv1770required (system, features): (aarch64-linux, [])17711 available machines:1772(systems, maxjobs, supportedFeatures, mandatoryFeatures)1773([aarch64-darwin, x86_64-darwin], 8, [big-parallel, recursive-nix], [])1774Failed to find a machine for remote build!1775derivation: v1vvpsix2f5s7a56anahj5f303bpc0fk-cargo-package-wasip2-1.0.2+wasi-0.2.9.drv1776required (system, features): (aarch64-linux, [])17771 available machines:1778(systems, maxjobs, supportedFeatures, mandatoryFeatures)1779([aarch64-darwin, x86_64-darwin], 8, [big-parallel, recursive-nix], [])1780Failed to find a machine for remote build!1781derivation: qy2aczszrb5w7cipbzwigpgwhqykfv93-cargo-package-winapi-0.3.9.drv1782required (system, features): (aarch64-linux, [])17831 available machines:1784(systems, maxjobs, supportedFeatures, mandatoryFeatures)1785([aarch64-darwin, x86_64-darwin], 8, [big-parallel, recursive-nix], [])1786Failed to find a machine for remote build!1787derivation: d6k8iawyc255v2p5hfmp2fpqy91fazg6-cargo-package-winapi-i686-pc-windows-gnu-0.4.0.drv1788required (system, features): (aarch64-linux, [])17891 available machines:1790(systems, maxjobs, supportedFeatures, mandatoryFeatures)1791([aarch64-darwin, x86_64-darwin], 8, [big-parallel, recursive-nix], [])1792Failed to find a machine for remote build!1793derivation: pmnpddimxzigkl1z9pws6zlz3klpg9hk-cargo-package-winapi-util-0.1.11.drv1794required (system, features): (aarch64-linux, [])17951 available machines:1796(systems, maxjobs, supportedFeatures, mandatoryFeatures)1797([aarch64-darwin, x86_64-darwin], 8, [big-parallel, recursive-nix], [])1798Failed to find a machine for remote build!1799derivation: qf4vh1zz3a4zib86jnjnxhg5834brdfn-cargo-package-winapi-x86_64-pc-windows-gnu-0.4.0.drv1800required (system, features): (aarch64-linux, [])18011 available machines:1802(systems, maxjobs, supportedFeatures, mandatoryFeatures)1803([aarch64-darwin, x86_64-darwin], 8, [big-parallel, recursive-nix], [])1804Failed to find a machine for remote build!1805derivation: 5rxl69b4j7rrkvw2z3ghy9nr9s1aak5l-cargo-package-windows-sys-0.45.0.drv1806required (system, features): (aarch64-linux, [])18071 available machines:1808(systems, maxjobs, supportedFeatures, mandatoryFeatures)1809([aarch64-darwin, x86_64-darwin], 8, [big-parallel, recursive-nix], [])1810Failed to find a machine for remote build!1811derivation: vg02vr2j5sj9bnmzhj31vv0ifali4ar4-cargo-package-windows-targets-0.42.2.drv1812required (system, features): (aarch64-linux, [])18131 available machines:1814(systems, maxjobs, supportedFeatures, mandatoryFeatures)1815([aarch64-darwin, x86_64-darwin], 8, [big-parallel, recursive-nix], [])1816Failed to find a machine for remote build!1817derivation: wif1xfhm0zh10lmqbfhjgakqc893y0mw-cargo-package-windows_aarch64_gnullvm-0.42.2.drv1818required (system, features): (aarch64-linux, [])18191 available machines:1820(systems, maxjobs, supportedFeatures, mandatoryFeatures)1821([aarch64-darwin, x86_64-darwin], 8, [big-parallel, recursive-nix], [])1822Failed to find a machine for remote build!1823derivation: hi6sb6v29a93my4bk0axf1mr1krp5154-cargo-package-windows_aarch64_msvc-0.42.2.drv1824required (system, features): (aarch64-linux, [])18251 available machines:1826(systems, maxjobs, supportedFeatures, mandatoryFeatures)1827([aarch64-darwin, x86_64-darwin], 8, [big-parallel, recursive-nix], [])1828Failed to find a machine for remote build!1829derivation: 9sym3qkm8c1bcc6acmn9rchan7gh4791-cargo-package-windows_i686_gnu-0.42.2.drv1830required (system, features): (aarch64-linux, [])18311 available machines:1832(systems, maxjobs, supportedFeatures, mandatoryFeatures)1833([aarch64-darwin, x86_64-darwin], 8, [big-parallel, recursive-nix], [])1834Failed to find a machine for remote build!1835derivation: 7y7ks34qrybllq1nfi1wyzkw71bjd6m4-cargo-package-windows_i686_msvc-0.42.2.drv1836required (system, features): (aarch64-linux, [])18371 available machines:1838(systems, maxjobs, supportedFeatures, mandatoryFeatures)1839([aarch64-darwin, x86_64-darwin], 8, [big-parallel, recursive-nix], [])1840Failed to find a machine for remote build!1841derivation: zxqr6a8vv87ca7jx4213niqj9l3lw0bx-cargo-package-windows_x86_64_gnu-0.42.2.drv1842required (system, features): (aarch64-linux, [])18431 available machines:1844(systems, maxjobs, supportedFeatures, mandatoryFeatures)1845([aarch64-darwin, x86_64-darwin], 8, [big-parallel, recursive-nix], [])1846Failed to find a machine for remote build!1847derivation: bn2sfri5mq0ab9q38dv6za15sv669mhp-cargo-package-windows_x86_64_gnullvm-0.42.2.drv1848required (system, features): (aarch64-linux, [])18491 available machines:1850(systems, maxjobs, supportedFeatures, mandatoryFeatures)1851([aarch64-darwin, x86_64-darwin], 8, [big-parallel, recursive-nix], [])1852Failed to find a machine for remote build!1853derivation: qr1jrpv1m1xmg89ms0r16inx43q5w56x-cargo-package-windows_x86_64_msvc-0.42.2.drv1854required (system, features): (aarch64-linux, [])18551 available machines:1856(systems, maxjobs, supportedFeatures, mandatoryFeatures)1857([aarch64-darwin, x86_64-darwin], 8, [big-parallel, recursive-nix], [])1858Failed to find a machine for remote build!1859derivation: fdmj8r8fm3qn71762a6sjlcjak8cpv9m-cargo-package-wit-bindgen-0.51.0.drv1860required (system, features): (aarch64-linux, [])18611 available machines:1862(systems, maxjobs, supportedFeatures, mandatoryFeatures)1863([aarch64-darwin, x86_64-darwin], 8, [big-parallel, recursive-nix], [])1864Failed to find a machine for remote build!1865derivation: 5hb44a240ldpify3g37k3xifc6d654zz-cargo-package-zerocopy-0.8.57.drv1866required (system, features): (aarch64-linux, [])18671 available machines:1868(systems, maxjobs, supportedFeatures, mandatoryFeatures)1869([aarch64-darwin, x86_64-darwin], 8, [big-parallel, recursive-nix], [])1870Failed to find a machine for remote build!1871derivation: 8qbgv6z6vwzx0bwpi2grc60jh7ns8qs3-cargo-package-zerocopy-derive-0.8.57.drv1872required (system, features): (aarch64-linux, [])18731 available machines:1874(systems, maxjobs, supportedFeatures, mandatoryFeatures)1875([aarch64-darwin, x86_64-darwin], 8, [big-parallel, recursive-nix], [])1876Failed to find a machine for remote build!1877derivation: njwlah9zh9z5j441kazzi8caq3c8m605-cargo-package-zeroize_derive-1.5.0.drv1878required (system, features): (aarch64-linux, [])18791 available machines:1880(systems, maxjobs, supportedFeatures, mandatoryFeatures)1881([aarch64-darwin, x86_64-darwin], 8, [big-parallel, recursive-nix], [])1882Failed to find a machine for remote build!1883derivation: jmzlib5sdzf5y5sfw4n48l9s8nh9ca00-cargo-package-zmij-1.0.21.drv1884required (system, features): (aarch64-linux, [])18851 available machines:1886(systems, maxjobs, supportedFeatures, mandatoryFeatures)1887([aarch64-darwin, x86_64-darwin], 8, [big-parallel, recursive-nix], [])1888Failed to find a machine for remote build!1889derivation: qghkg0mridmyai9ddzymn2v1xf7l8ifz-cargo-vendor-dir.drv1890required (system, features): (aarch64-linux, [])18911 available machines:1892(systems, maxjobs, supportedFeatures, mandatoryFeatures)1893([aarch64-darwin, x86_64-darwin], 8, [big-parallel, recursive-nix], [])1894Failed to find a machine for remote build!1895derivation: 0rigc9i21dzlmjghliylpxzhm7lwq6my-nix-util-2.36.0pre.drv1896required (system, features): (aarch64-linux, [])18971 available machines:1898(systems, maxjobs, supportedFeatures, mandatoryFeatures)1899([aarch64-darwin, x86_64-darwin], 8, [big-parallel, recursive-nix], [])1900Failed to find a machine for remote build!1901derivation: 7m4a32138nk28pdhdyqg9z8x7wnnhzp8-nix-util-2.36.0pre20260828_7f711bef.drv1902required (system, features): (aarch64-linux, [])19031 available machines:1904(systems, maxjobs, supportedFeatures, mandatoryFeatures)1905([aarch64-darwin, x86_64-darwin], 8, [big-parallel, recursive-nix], [])1906Failed to find a machine for remote build!1907derivation: b3ldybg6s0g3q3j0b0dzpk9n0wlcp2ws-nss-cacert-3.126.drv1908required (system, features): (aarch64-linux, [])19091 available machines:1910(systems, maxjobs, supportedFeatures, mandatoryFeatures)1911([aarch64-darwin, x86_64-darwin], 8, [big-parallel, recursive-nix], [])1912Failed to find a machine for remote build!1913derivation: lywvzz63w1n2h9gpbyl5jz71ncbc03hl-sshd.conf-final.drv1914required (system, features): (aarch64-linux, [])19151 available machines:1916(systems, maxjobs, supportedFeatures, mandatoryFeatures)1917([aarch64-darwin, x86_64-darwin], 8, [big-parallel, recursive-nix], [])1918Failed to find a machine for remote build!1919derivation: 753zby3jn8jczvdd1lpb6d6kr9r1imgl-pre-switch-checks.drv1920required (system, features): (aarch64-linux, [])19211 available machines:1922(systems, maxjobs, supportedFeatures, mandatoryFeatures)1923([aarch64-darwin, x86_64-darwin], 8, [big-parallel, recursive-nix], [])1924Failed to find a machine for remote build!1925derivation: js0gb4p489zdva7jsvgl4irjsg38j3sq-fancontrol.drv1926required (system, features): (aarch64-linux, [])19271 available machines:1928(systems, maxjobs, supportedFeatures, mandatoryFeatures)1929([aarch64-darwin, x86_64-darwin], 8, [big-parallel, recursive-nix], [])1930Failed to find a machine for remote build!1931derivation: 1x9x0kwcl1v98zaqgzxl82nxqswjby7a-Cargo.toml.drv1932required (system, features): (aarch64-linux, [])19331 available machines:1934(systems, maxjobs, supportedFeatures, mandatoryFeatures)1935([aarch64-darwin, x86_64-darwin], 8, [big-parallel, recursive-nix], [])1936Failed to find a machine for remote build!1937derivation: 2id1y8d3wg7g9y6jaky2x2f2nvlbrqzd-Cargo.toml.drv1938required (system, features): (aarch64-linux, [])19391 available machines:1940(systems, maxjobs, supportedFeatures, mandatoryFeatures)1941([aarch64-darwin, x86_64-darwin], 8, [big-parallel, recursive-nix], [])1942Failed to find a machine for remote build!1943derivation: 3amlpy8ys0m54n3p9723msm08i0wk1a0-Cargo.toml.drv1944required (system, features): (aarch64-linux, [])19451 available machines:1946(systems, maxjobs, supportedFeatures, mandatoryFeatures)1947([aarch64-darwin, x86_64-darwin], 8, [big-parallel, recursive-nix], [])1948Failed to find a machine for remote build!1949derivation: 432cnysqhmrwfyrcm5hyxlgzhrj9x3m6-Cargo.toml.drv1950required (system, features): (aarch64-linux, [])19511 available machines:1952(systems, maxjobs, supportedFeatures, mandatoryFeatures)1953([aarch64-darwin, x86_64-darwin], 8, [big-parallel, recursive-nix], [])1954Failed to find a machine for remote build!1955derivation: 43arhs8nm6v4vf7nfk97qkv4p1053nvj-Cargo.toml.drv1956required (system, features): (aarch64-linux, [])19571 available machines:1958(systems, maxjobs, supportedFeatures, mandatoryFeatures)1959([aarch64-darwin, x86_64-darwin], 8, [big-parallel, recursive-nix], [])1960Failed to find a machine for remote build!1961derivation: 4lshz3gif6flvg9mpjhf8pb3yydgwmzw-Cargo.toml.drv1962required (system, features): (aarch64-linux, [])19631 available machines:1964(systems, maxjobs, supportedFeatures, mandatoryFeatures)1965([aarch64-darwin, x86_64-darwin], 8, [big-parallel, recursive-nix], [])1966Failed to find a machine for remote build!1967derivation: 60q5wdfy1kj5q5a5vbfvdlk8iq7ng6d5-Cargo.toml.drv1968required (system, features): (aarch64-linux, [])19691 available machines:1970(systems, maxjobs, supportedFeatures, mandatoryFeatures)1971([aarch64-darwin, x86_64-darwin], 8, [big-parallel, recursive-nix], [])1972Failed to find a machine for remote build!1973derivation: 81grx3pg843v62fhgvxscpl9h1whjlqw-Cargo.toml.drv1974required (system, features): (aarch64-linux, [])19751 available machines:1976(systems, maxjobs, supportedFeatures, mandatoryFeatures)1977([aarch64-darwin, x86_64-darwin], 8, [big-parallel, recursive-nix], [])1978Failed to find a machine for remote build!1979derivation: 8cb23c972azkb8byagg3y793dl0jwdn0-Cargo.toml.drv1980required (system, features): (aarch64-linux, [])19811 available machines:1982(systems, maxjobs, supportedFeatures, mandatoryFeatures)1983([aarch64-darwin, x86_64-darwin], 8, [big-parallel, recursive-nix], [])1984Failed to find a machine for remote build!1985derivation: a15cphdhwwrp76hkc34mcb5bdcb4d2ic-Cargo.toml.drv1986required (system, features): (aarch64-linux, [])19871 available machines:1988(systems, maxjobs, supportedFeatures, mandatoryFeatures)1989([aarch64-darwin, x86_64-darwin], 8, [big-parallel, recursive-nix], [])1990Failed to find a machine for remote build!1991derivation: axp4wbpxqhrz77qnsz952cild54ki8az-Cargo.toml.drv1992required (system, features): (aarch64-linux, [])19931 available machines:1994(systems, maxjobs, supportedFeatures, mandatoryFeatures)1995([aarch64-darwin, x86_64-darwin], 8, [big-parallel, recursive-nix], [])1996Failed to find a machine for remote build!1997derivation: c2rryc71l5nb25h44x5kch8jm2f5j4yq-Cargo.toml.drv1998required (system, features): (aarch64-linux, [])19991 available machines:2000(systems, maxjobs, supportedFeatures, mandatoryFeatures)2001([aarch64-darwin, x86_64-darwin], 8, [big-parallel, recursive-nix], [])2002Failed to find a machine for remote build!2003derivation: cpaxa53pyq1r2284zsds822in6zigbz3-Cargo.toml.drv2004required (system, features): (aarch64-linux, [])20051 available machines:2006(systems, maxjobs, supportedFeatures, mandatoryFeatures)2007([aarch64-darwin, x86_64-darwin], 8, [big-parallel, recursive-nix], [])2008Failed to find a machine for remote build!2009derivation: cpvj4775zmb6gan3vj4jka4qq9024jis-Cargo.toml.drv2010required (system, features): (aarch64-linux, [])20111 available machines:2012(systems, maxjobs, supportedFeatures, mandatoryFeatures)2013([aarch64-darwin, x86_64-darwin], 8, [big-parallel, recursive-nix], [])2014Failed to find a machine for remote build!2015derivation: d6q3q9kzg232z2qzvjqx8lwvrhc1a9p9-Cargo.toml.drv2016required (system, features): (aarch64-linux, [])20171 available machines:2018(systems, maxjobs, supportedFeatures, mandatoryFeatures)2019([aarch64-darwin, x86_64-darwin], 8, [big-parallel, recursive-nix], [])2020Failed to find a machine for remote build!2021derivation: dgdwicpmj3d2sryq13l83v4xq1jbziix-Cargo.toml.drv2022required (system, features): (aarch64-linux, [])20231 available machines:2024(systems, maxjobs, supportedFeatures, mandatoryFeatures)2025([aarch64-darwin, x86_64-darwin], 8, [big-parallel, recursive-nix], [])2026Failed to find a machine for remote build!2027derivation: djs8cgkgf23cl682zqnwa29938ckvbkk-Cargo.toml.drv2028required (system, features): (aarch64-linux, [])20291 available machines:2030(systems, maxjobs, supportedFeatures, mandatoryFeatures)2031([aarch64-darwin, x86_64-darwin], 8, [big-parallel, recursive-nix], [])2032Failed to find a machine for remote build!2033derivation: dncbsswnzcn66h1sf11n8ix9sjjzl08r-Cargo.toml.drv2034required (system, features): (aarch64-linux, [])20351 available machines:2036(systems, maxjobs, supportedFeatures, mandatoryFeatures)2037([aarch64-darwin, x86_64-darwin], 8, [big-parallel, recursive-nix], [])2038Failed to find a machine for remote build!2039derivation: fby9nlz26iilb65cj2vhh5kpsxgdkj79-Cargo.toml.drv2040required (system, features): (aarch64-linux, [])20411 available machines:2042(systems, maxjobs, supportedFeatures, mandatoryFeatures)2043([aarch64-darwin, x86_64-darwin], 8, [big-parallel, recursive-nix], [])2044Failed to find a machine for remote build!2045derivation: fnymg6xkgd18a0r89kqgi4acc9ll3wzy-Cargo.toml.drv2046required (system, features): (aarch64-linux, [])20471 available machines:2048(systems, maxjobs, supportedFeatures, mandatoryFeatures)2049([aarch64-darwin, x86_64-darwin], 8, [big-parallel, recursive-nix], [])2050Failed to find a machine for remote build!2051derivation: gzp41nzhlj65pnr21rsv6rx609d6hvqd-Cargo.toml.drv2052required (system, features): (aarch64-linux, [])20531 available machines:2054(systems, maxjobs, supportedFeatures, mandatoryFeatures)2055([aarch64-darwin, x86_64-darwin], 8, [big-parallel, recursive-nix], [])2056Failed to find a machine for remote build!2057derivation: h078x54264yz8ndq9slkbxprag38p73w-Cargo.toml.drv2058required (system, features): (aarch64-linux, [])20591 available machines:2060(systems, maxjobs, supportedFeatures, mandatoryFeatures)2061([aarch64-darwin, x86_64-darwin], 8, [big-parallel, recursive-nix], [])2062Failed to find a machine for remote build!2063derivation: jv2n7wmvplzqfrvz3qvskly2rh96rggb-Cargo.toml.drv2064required (system, features): (aarch64-linux, [])20651 available machines:2066(systems, maxjobs, supportedFeatures, mandatoryFeatures)2067([aarch64-darwin, x86_64-darwin], 8, [big-parallel, recursive-nix], [])2068Failed to find a machine for remote build!2069derivation: kva8hr0hxr71pf7ib32vgnvlq4mslk9y-Cargo.toml.drv2070required (system, features): (aarch64-linux, [])20711 available machines:2072(systems, maxjobs, supportedFeatures, mandatoryFeatures)2073([aarch64-darwin, x86_64-darwin], 8, [big-parallel, recursive-nix], [])2074Failed to find a machine for remote build!2075derivation: la0jkip2j8272582s85km95w4w7ych95-Cargo.toml.drv2076required (system, features): (aarch64-linux, [])20771 available machines:2078(systems, maxjobs, supportedFeatures, mandatoryFeatures)2079([aarch64-darwin, x86_64-darwin], 8, [big-parallel, recursive-nix], [])2080Failed to find a machine for remote build!2081derivation: nxi5fhcrlfbh2j0a2ffkjk52b6ar2cvj-Cargo.toml.drv2082required (system, features): (aarch64-linux, [])20831 available machines:2084(systems, maxjobs, supportedFeatures, mandatoryFeatures)2085([aarch64-darwin, x86_64-darwin], 8, [big-parallel, recursive-nix], [])2086Failed to find a machine for remote build!2087derivation: pnki7znj6bqr330h1kv0rvpiwfcd5l6s-Cargo.toml.drv2088required (system, features): (aarch64-linux, [])20891 available machines:2090(systems, maxjobs, supportedFeatures, mandatoryFeatures)2091([aarch64-darwin, x86_64-darwin], 8, [big-parallel, recursive-nix], [])2092Failed to find a machine for remote build!2093derivation: q2m3qswdclrp4lbl526chlsn95v1ldaq-Cargo.toml.drv2094required (system, features): (aarch64-linux, [])20951 available machines:2096(systems, maxjobs, supportedFeatures, mandatoryFeatures)2097([aarch64-darwin, x86_64-darwin], 8, [big-parallel, recursive-nix], [])2098Failed to find a machine for remote build!2099derivation: qkx5pwlrb6k20py7kijfdlzmc82adic2-Cargo.toml.drv2100required (system, features): (aarch64-linux, [])21011 available machines:2102(systems, maxjobs, supportedFeatures, mandatoryFeatures)2103([aarch64-darwin, x86_64-darwin], 8, [big-parallel, recursive-nix], [])2104Failed to find a machine for remote build!2105derivation: qz25ds3zblcy6pq4gcpbh14x6bq1h45v-Cargo.toml.drv2106required (system, features): (aarch64-linux, [])21071 available machines:2108(systems, maxjobs, supportedFeatures, mandatoryFeatures)2109([aarch64-darwin, x86_64-darwin], 8, [big-parallel, recursive-nix], [])2110Failed to find a machine for remote build!2111derivation: rb4ipzh3l32ix2jwa0l3n1k6fsx0hfwf-Cargo.toml.drv2112required (system, features): (aarch64-linux, [])21131 available machines:2114(systems, maxjobs, supportedFeatures, mandatoryFeatures)2115([aarch64-darwin, x86_64-darwin], 8, [big-parallel, recursive-nix], [])2116Failed to find a machine for remote build!2117derivation: rhlksgdh4db0rxbc4rjb2k75mf1p1vzp-Cargo.toml.drv2118required (system, features): (aarch64-linux, [])21191 available machines:2120(systems, maxjobs, supportedFeatures, mandatoryFeatures)2121([aarch64-darwin, x86_64-darwin], 8, [big-parallel, recursive-nix], [])2122Failed to find a machine for remote build!2123derivation: rhmk44p78cs32dq1z18vjmhpqknrcjh8-Cargo.toml.drv2124required (system, features): (aarch64-linux, [])21251 available machines:2126(systems, maxjobs, supportedFeatures, mandatoryFeatures)2127([aarch64-darwin, x86_64-darwin], 8, [big-parallel, recursive-nix], [])2128Failed to find a machine for remote build!2129derivation: rwln77wd3b2mia7yq8qzg8kjch6j1z5h-Cargo.toml.drv2130required (system, features): (aarch64-linux, [])21311 available machines:2132(systems, maxjobs, supportedFeatures, mandatoryFeatures)2133([aarch64-darwin, x86_64-darwin], 8, [big-parallel, recursive-nix], [])2134Failed to find a machine for remote build!2135derivation: wvj878qbd700skbsqpf1xf2yr9qkidz0-Cargo.toml.drv2136required (system, features): (aarch64-linux, [])21371 available machines:2138(systems, maxjobs, supportedFeatures, mandatoryFeatures)2139([aarch64-darwin, x86_64-darwin], 8, [big-parallel, recursive-nix], [])2140Failed to find a machine for remote build!2141derivation: z5jhkjan1x51yypq703m27cpyrw503f5-Cargo.toml.drv2142required (system, features): (aarch64-linux, [])21431 available machines:2144(systems, maxjobs, supportedFeatures, mandatoryFeatures)2145([aarch64-darwin, x86_64-darwin], 8, [big-parallel, recursive-nix], [])2146Failed to find a machine for remote build!2147derivation: xqc8w57zbw9fjzv9k4grm5v4hi4md5yg-security-wrapper-smartctl-aarch64-unknown-linux-musl.drv2148required (system, features): (aarch64-linux, [])21491 available machines:2150(systems, maxjobs, supportedFeatures, mandatoryFeatures)2151([aarch64-darwin, x86_64-darwin], 8, [big-parallel, recursive-nix], [])2152Failed to find a machine for remote build!2153derivation: dkw6jzs3kfsdlv3n2g8agiinril34xrr-glibc-locales-2.42-84.drv2154required (system, features): (aarch64-linux, [])21551 available machines:2156(systems, maxjobs, supportedFeatures, mandatoryFeatures)2157([aarch64-darwin, x86_64-darwin], 8, [big-parallel, recursive-nix], [])2158Failed to find a machine for remote build!2159derivation: a31dg9va1akpag8k3pqdnkvv82xmizp8-nix-tarmac-0.1.0.drv2160required (system, features): (aarch64-linux, [])21611 available machines:2162(systems, maxjobs, supportedFeatures, mandatoryFeatures)2163([aarch64-darwin, x86_64-darwin], 8, [big-parallel, recursive-nix], [])2164Failed to find a machine for remote build!2165derivation: b6xrvdqf47whabx1g995z54322ir3a63-nix-tarmac-0.1.0.drv2166required (system, features): (aarch64-linux, [])21671 available machines:2168(systems, maxjobs, supportedFeatures, mandatoryFeatures)2169([aarch64-darwin, x86_64-darwin], 8, [big-parallel, recursive-nix], [])2170Failed to find a machine for remote build!2171derivation: 3qxjznih15cksciqlbsqaxxfy8qsf1ws-check-sshd-config.drv2172required (system, features): (aarch64-linux, [])21731 available machines:2174(systems, maxjobs, supportedFeatures, mandatoryFeatures)2175([aarch64-darwin, x86_64-darwin], 8, [big-parallel, recursive-nix], [])2176Failed to find a machine for remote build!2177derivation: 4nwx7nxn8hgxakcm4kwgr7v5jzv2rb68-stdenv-linux.drv2178required (system, features): (aarch64-linux, [])21791 available machines:2180(systems, maxjobs, supportedFeatures, mandatoryFeatures)2181([aarch64-darwin, x86_64-darwin], 8, [big-parallel, recursive-nix], [])2182Failed to find a machine for remote build!2183derivation: 2rn213bcjbh7wf6rvwl3df6lsz1iidw7-cargo-package-actix-codec-0.5.2.drv2184required (system, features): (aarch64-linux, [])21851 available machines:2186(systems, maxjobs, supportedFeatures, mandatoryFeatures)2187([aarch64-darwin, x86_64-darwin], 8, [big-parallel, recursive-nix], [])2188Failed to find a machine for remote build!2189derivation: kyh10khacy54nsaxpg3qc873kx8nkv4k-cargo-package-actix-files-0.6.10.drv2190required (system, features): (aarch64-linux, [])21911 available machines:2192(systems, maxjobs, supportedFeatures, mandatoryFeatures)2193([aarch64-darwin, x86_64-darwin], 8, [big-parallel, recursive-nix], [])2194Failed to find a machine for remote build!2195derivation: pj4z7yli5ss9vr2lb1xd90l6s4pd10fl-cargo-package-actix-http-3.13.3.drv2196required (system, features): (aarch64-linux, [])21971 available machines:2198(systems, maxjobs, supportedFeatures, mandatoryFeatures)2199([aarch64-darwin, x86_64-darwin], 8, [big-parallel, recursive-nix], [])2200Failed to find a machine for remote build!2201derivation: yzcs5vzna6j0z3gqlp3z9b2jkb8dxp3f-cargo-package-actix-macros-0.2.4.drv2202required (system, features): (aarch64-linux, [])22031 available machines:2204(systems, maxjobs, supportedFeatures, mandatoryFeatures)2205([aarch64-darwin, x86_64-darwin], 8, [big-parallel, recursive-nix], [])2206Failed to find a machine for remote build!2207derivation: r15sfq0xybzdpd162n63ipm7gndrvdfk-cargo-package-actix-router-0.5.4.drv2208required (system, features): (aarch64-linux, [])22091 available machines:2210(systems, maxjobs, supportedFeatures, mandatoryFeatures)2211([aarch64-darwin, x86_64-darwin], 8, [big-parallel, recursive-nix], [])2212Failed to find a machine for remote build!2213derivation: xsbflla4gsy3izhvna318lq8fmjqr3fb-cargo-package-actix-rt-2.11.0.drv2214required (system, features): (aarch64-linux, [])22151 available machines:2216(systems, maxjobs, supportedFeatures, mandatoryFeatures)2217([aarch64-darwin, x86_64-darwin], 8, [big-parallel, recursive-nix], [])2218Failed to find a machine for remote build!2219derivation: 4lmg9m5fcdgx9904bx9j5pi5v042qsam-cargo-package-actix-server-2.7.0.drv2220required (system, features): (aarch64-linux, [])22211 available machines:2222(systems, maxjobs, supportedFeatures, mandatoryFeatures)2223([aarch64-darwin, x86_64-darwin], 8, [big-parallel, recursive-nix], [])2224Failed to find a machine for remote build!2225derivation: 4sr71p4flx5wh1nhdkkbs7pjfwy6qhq0-cargo-package-actix-service-2.0.3.drv2226required (system, features): (aarch64-linux, [])22271 available machines:2228(systems, maxjobs, supportedFeatures, mandatoryFeatures)2229([aarch64-darwin, x86_64-darwin], 8, [big-parallel, recursive-nix], [])2230Failed to find a machine for remote build!2231derivation: h5s9kc3w0sjafay1cdnvz5dwxlkd5ix7-cargo-package-actix-tls-3.5.0.drv2232required (system, features): (aarch64-linux, [])22331 available machines:2234(systems, maxjobs, supportedFeatures, mandatoryFeatures)2235([aarch64-darwin, x86_64-darwin], 8, [big-parallel, recursive-nix], [])2236Failed to find a machine for remote build!2237derivation: i8024nhb39c8prv3zaaryrg7fa3cpsma-cargo-package-actix-utils-3.0.1.drv2238required (system, features): (aarch64-linux, [])22391 available machines:2240(systems, maxjobs, supportedFeatures, mandatoryFeatures)2241([aarch64-darwin, x86_64-darwin], 8, [big-parallel, recursive-nix], [])2242Failed to find a machine for remote build!2243derivation: b9d40f5lcf2k1jim52198yp1yiq0vxci-cargo-package-actix-web-4.15.0.drv2244required (system, features): (aarch64-linux, [])22451 available machines:2246(systems, maxjobs, supportedFeatures, mandatoryFeatures)2247([aarch64-darwin, x86_64-darwin], 8, [big-parallel, recursive-nix], [])2248Failed to find a machine for remote build!2249derivation: hs315d6kwcjb2i71qscxsa4ll6bghmpy-cargo-package-actix-web-codegen-4.3.0.drv2250required (system, features): (aarch64-linux, [])22511 available machines:2252(systems, maxjobs, supportedFeatures, mandatoryFeatures)2253([aarch64-darwin, x86_64-darwin], 8, [big-parallel, recursive-nix], [])2254Failed to find a machine for remote build!2255derivation: 15q79qhpb4njxw52ri007bp20xz91q1g-cargo-package-aho-corasick-1.1.4.drv2256required (system, features): (aarch64-linux, [])22571 available machines:2258(systems, maxjobs, supportedFeatures, mandatoryFeatures)2259([aarch64-darwin, x86_64-darwin], 8, [big-parallel, recursive-nix], [])2260Failed to find a machine for remote build!2261derivation: ha35q9cywpxh89rdkprysiism2n8x423-cargo-package-alloca-0.4.0.drv2262required (system, features): (aarch64-linux, [])22631 available machines:2264(systems, maxjobs, supportedFeatures, mandatoryFeatures)2265([aarch64-darwin, x86_64-darwin], 8, [big-parallel, recursive-nix], [])2266Failed to find a machine for remote build!2267derivation: 3h9a4nw3g1p5vlj6xaibz00nsvg3yc0f-cargo-package-anes-0.1.6.drv2268required (system, features): (aarch64-linux, [])22691 available machines:2270(systems, maxjobs, supportedFeatures, mandatoryFeatures)2271([aarch64-darwin, x86_64-darwin], 8, [big-parallel, recursive-nix], [])2272Failed to find a machine for remote build!2273derivation: lpcw4m2dzw3dkgkd89aqj9nhkazl2qg6-cargo-package-anstyle-1.0.14.drv2274required (system, features): (aarch64-linux, [])22751 available machines:2276(systems, maxjobs, supportedFeatures, mandatoryFeatures)2277([aarch64-darwin, x86_64-darwin], 8, [big-parallel, recursive-nix], [])2278Failed to find a machine for remote build!2279derivation: vnxw047s97qjsg5zq5l587rwcv6krxrz-cargo-package-arrayvec-0.7.6.drv2280required (system, features): (aarch64-linux, [])22811 available machines:2282(systems, maxjobs, supportedFeatures, mandatoryFeatures)2283([aarch64-darwin, x86_64-darwin], 8, [big-parallel, recursive-nix], [])2284Failed to find a machine for remote build!2285derivation: b7j1dcwfsaa14b1vzk00siz6zpnpx82x-cargo-package-askama_escape-0.16.0.drv2286required (system, features): (aarch64-linux, [])22871 available machines:2288(systems, maxjobs, supportedFeatures, mandatoryFeatures)2289([aarch64-darwin, x86_64-darwin], 8, [big-parallel, recursive-nix], [])2290Failed to find a machine for remote build!2291derivation: q6mppv3lc52gvg4j0vzzsbw08xw3fm4s-cargo-package-async-compression-0.4.44.drv2292required (system, features): (aarch64-linux, [])22931 available machines:2294(systems, maxjobs, supportedFeatures, mandatoryFeatures)2295([aarch64-darwin, x86_64-darwin], 8, [big-parallel, recursive-nix], [])2296Failed to find a machine for remote build!2297derivation: xfl34z9r8sdmjy6c2b210synmwfjn37a-cargo-package-async-stream-0.3.6.drv2298required (system, features): (aarch64-linux, [])22991 available machines:2300(systems, maxjobs, supportedFeatures, mandatoryFeatures)2301([aarch64-darwin, x86_64-darwin], 8, [big-parallel, recursive-nix], [])2302Failed to find a machine for remote build!2303derivation: gvflmhbdknq42ym08v053jrq0m5956qk-cargo-package-async-stream-impl-0.3.6.drv2304required (system, features): (aarch64-linux, [])23051 available machines:2306(systems, maxjobs, supportedFeatures, mandatoryFeatures)2307([aarch64-darwin, x86_64-darwin], 8, [big-parallel, recursive-nix], [])2308Failed to find a machine for remote build!2309derivation: 1bkbp3fxcgp1n7lmykxmnycg5zj16b30-cargo-package-autocfg-1.5.0.drv2310required (system, features): (aarch64-linux, [])23111 available machines:2312(systems, maxjobs, supportedFeatures, mandatoryFeatures)2313([aarch64-darwin, x86_64-darwin], 8, [big-parallel, recursive-nix], [])2314Failed to find a machine for remote build!2315derivation: 7xlj574d7nlsdmljz7ggw4ivhm1p7sgn-cargo-package-bit-set-0.8.0.drv2316required (system, features): (aarch64-linux, [])23171 available machines:2318(systems, maxjobs, supportedFeatures, mandatoryFeatures)2319([aarch64-darwin, x86_64-darwin], 8, [big-parallel, recursive-nix], [])2320Failed to find a machine for remote build!2321derivation: wdmdd2gq1ymiqgmb6kh2qxb35qpws7aq-cargo-package-bit-vec-0.8.0.drv2322required (system, features): (aarch64-linux, [])23231 available machines:2324(systems, maxjobs, supportedFeatures, mandatoryFeatures)2325([aarch64-darwin, x86_64-darwin], 8, [big-parallel, recursive-nix], [])2326Failed to find a machine for remote build!2327derivation: 0dpp58zp7wqv52qkva3vh266yqrbcjan-cargo-package-bitflags-2.11.1.drv2328required (system, features): (aarch64-linux, [])23291 available machines:2330(systems, maxjobs, supportedFeatures, mandatoryFeatures)2331([aarch64-darwin, x86_64-darwin], 8, [big-parallel, recursive-nix], [])2332Failed to find a machine for remote build!2333derivation: wf52lcna80fn51q0n37mivkaymsq477c-cargo-package-blake3-1.8.7.drv2334required (system, features): (aarch64-linux, [])23351 available machines:2336(systems, maxjobs, supportedFeatures, mandatoryFeatures)2337([aarch64-darwin, x86_64-darwin], 8, [big-parallel, recursive-nix], [])2338Failed to find a machine for remote build!2339derivation: 26kbfc3l0m1y4blxxvn694xfcgk3c1q7-cargo-package-block-buffer-0.12.0.drv2340required (system, features): (aarch64-linux, [])23411 available machines:2342(systems, maxjobs, supportedFeatures, mandatoryFeatures)2343([aarch64-darwin, x86_64-darwin], 8, [big-parallel, recursive-nix], [])2344Failed to find a machine for remote build!2345derivation: 5bi5342pkn77j9igrkdgwcg1340ih3qr-cargo-package-bstr-1.13.1.drv2346required (system, features): (aarch64-linux, [])23471 available machines:2348(systems, maxjobs, supportedFeatures, mandatoryFeatures)2349([aarch64-darwin, x86_64-darwin], 8, [big-parallel, recursive-nix], [])2350Failed to find a machine for remote build!2351derivation: axs0zf5qp6k97i9pvlvq288826xzbir7-cargo-package-bumpalo-3.20.2.drv2352required (system, features): (aarch64-linux, [])23531 available machines:2354(systems, maxjobs, supportedFeatures, mandatoryFeatures)2355([aarch64-darwin, x86_64-darwin], 8, [big-parallel, recursive-nix], [])2356Failed to find a machine for remote build!2357derivation: yvhzrl4s511f3czy0jdc9b42s5y5lafs-cargo-package-bytes-1.12.1.drv2358required (system, features): (aarch64-linux, [])23591 available machines:2360(systems, maxjobs, supportedFeatures, mandatoryFeatures)2361([aarch64-darwin, x86_64-darwin], 8, [big-parallel, recursive-nix], [])2362Failed to find a machine for remote build!2363derivation: ij0anwbk5wjl42ixp2wd7q62046n26vm-cargo-package-bytestring-1.5.0.drv2364required (system, features): (aarch64-linux, [])23651 available machines:2366(systems, maxjobs, supportedFeatures, mandatoryFeatures)2367([aarch64-darwin, x86_64-darwin], 8, [big-parallel, recursive-nix], [])2368Failed to find a machine for remote build!2369derivation: l7c8i2sbr0sdcdnf0wfscjjw3qahc8hs-cargo-package-bzip2-0.6.1.drv2370required (system, features): (aarch64-linux, [])23711 available machines:2372(systems, maxjobs, supportedFeatures, mandatoryFeatures)2373([aarch64-darwin, x86_64-darwin], 8, [big-parallel, recursive-nix], [])2374Failed to find a machine for remote build!2375derivation: bzymkq74i21frf6r54m16m518mij5l0d-cargo-package-cast-0.3.0.drv2376required (system, features): (aarch64-linux, [])23771 available machines:2378(systems, maxjobs, supportedFeatures, mandatoryFeatures)2379([aarch64-darwin, x86_64-darwin], 8, [big-parallel, recursive-nix], [])2380Failed to find a machine for remote build!2381derivation: ijnfqvzfj0p43bsm6kh87j9rpln77xvx-cargo-package-cc-1.2.60.drv2382required (system, features): (aarch64-linux, [])23831 available machines:2384(systems, maxjobs, supportedFeatures, mandatoryFeatures)2385([aarch64-darwin, x86_64-darwin], 8, [big-parallel, recursive-nix], [])2386Failed to find a machine for remote build!2387derivation: 3fnpvkj1wnsmlcgzscrgjhqvd81ysq7w-cargo-package-cfg-if-1.0.4.drv2388required (system, features): (aarch64-linux, [])23891 available machines:2390(systems, maxjobs, supportedFeatures, mandatoryFeatures)2391([aarch64-darwin, x86_64-darwin], 8, [big-parallel, recursive-nix], [])2392Failed to find a machine for remote build!2393derivation: z0z62lxizgz80034r5scmg0i794i92a0-cargo-package-cfg_aliases-0.2.1.drv2394required (system, features): (aarch64-linux, [])23951 available machines:2396(systems, maxjobs, supportedFeatures, mandatoryFeatures)2397([aarch64-darwin, x86_64-darwin], 8, [big-parallel, recursive-nix], [])2398Failed to find a machine for remote build!2399derivation: cgi2y4si6zd7mh095w9rv9swvj90xs6b-cargo-package-ciborium-0.2.2.drv2400required (system, features): (aarch64-linux, [])24011 available machines:2402(systems, maxjobs, supportedFeatures, mandatoryFeatures)2403([aarch64-darwin, x86_64-darwin], 8, [big-parallel, recursive-nix], [])2404Failed to find a machine for remote build!2405derivation: za9v2ny7bnf22wg8iqqlzd1kgap99n2h-cargo-package-ciborium-io-0.2.2.drv2406required (system, features): (aarch64-linux, [])24071 available machines:2408(systems, maxjobs, supportedFeatures, mandatoryFeatures)2409([aarch64-darwin, x86_64-darwin], 8, [big-parallel, recursive-nix], [])2410Failed to find a machine for remote build!2411derivation: yci3w2sjk5l8dvq73wgkwf0mgaymm6b4-cargo-package-ciborium-ll-0.2.2.drv2412required (system, features): (aarch64-linux, [])24131 available machines:2414(systems, maxjobs, supportedFeatures, mandatoryFeatures)2415([aarch64-darwin, x86_64-darwin], 8, [big-parallel, recursive-nix], [])2416Failed to find a machine for remote build!2417derivation: 1lllbi3xkbw3aakqm70nxqr793z73fha-cargo-package-clap-4.6.1.drv2418required (system, features): (aarch64-linux, [])24191 available machines:2420(systems, maxjobs, supportedFeatures, mandatoryFeatures)2421([aarch64-darwin, x86_64-darwin], 8, [big-parallel, recursive-nix], [])2422Failed to find a machine for remote build!2423derivation: s4wahjvyl80852wrf6v27gqspn3s4mkb-cargo-package-clap_builder-4.6.0.drv2424required (system, features): (aarch64-linux, [])24251 available machines:2426(systems, maxjobs, supportedFeatures, mandatoryFeatures)2427([aarch64-darwin, x86_64-darwin], 8, [big-parallel, recursive-nix], [])2428Failed to find a machine for remote build!2429derivation: 39agnnmnf7wj50jz81l5nggbrz2bab1c-cargo-package-clap_derive-4.6.1.drv2430required (system, features): (aarch64-linux, [])24311 available machines:2432(systems, maxjobs, supportedFeatures, mandatoryFeatures)2433([aarch64-darwin, x86_64-darwin], 8, [big-parallel, recursive-nix], [])2434Failed to find a machine for remote build!2435derivation: q67cp4039zkxh7i00xw7zg7vf5bycv90-cargo-package-clap_lex-1.1.0.drv2436required (system, features): (aarch64-linux, [])24371 available machines:2438(systems, maxjobs, supportedFeatures, mandatoryFeatures)2439([aarch64-darwin, x86_64-darwin], 8, [big-parallel, recursive-nix], [])2440Failed to find a machine for remote build!2441derivation: rai8j8pm0pi6q2vyayhwbnvf4ly1f7dx-cargo-package-compression-codecs-0.4.39.drv2442required (system, features): (aarch64-linux, [])24431 available machines:2444(systems, maxjobs, supportedFeatures, mandatoryFeatures)2445([aarch64-darwin, x86_64-darwin], 8, [big-parallel, recursive-nix], [])2446Failed to find a machine for remote build!2447derivation: wrfifpx1fnw8ic0x1lw8nil8b9593qb8-cargo-package-compression-core-0.4.33.drv2448required (system, features): (aarch64-linux, [])24491 available machines:2450(systems, maxjobs, supportedFeatures, mandatoryFeatures)2451([aarch64-darwin, x86_64-darwin], 8, [big-parallel, recursive-nix], [])2452Failed to find a machine for remote build!2453derivation: 2iw61l5ikfkqbhfr3yxprjg9h4wcvjvi-cargo-package-const-oid-0.10.2.drv2454required (system, features): (aarch64-linux, [])24551 available machines:2456(systems, maxjobs, supportedFeatures, mandatoryFeatures)2457([aarch64-darwin, x86_64-darwin], 8, [big-parallel, recursive-nix], [])2458Failed to find a machine for remote build!2459derivation: hbrwr6m6cpisrf6d7dc51zmrzkikry2h-cargo-package-constant_time_eq-0.4.2.drv2460required (system, features): (aarch64-linux, [])24611 available machines:2462(systems, maxjobs, supportedFeatures, mandatoryFeatures)2463([aarch64-darwin, x86_64-darwin], 8, [big-parallel, recursive-nix], [])2464Failed to find a machine for remote build!2465derivation: 8g810041q6nijdpcnblmrlr1l72mah0d-cargo-package-convert_case-0.10.0.drv2466required (system, features): (aarch64-linux, [])24671 available machines:2468(systems, maxjobs, supportedFeatures, mandatoryFeatures)2469([aarch64-darwin, x86_64-darwin], 8, [big-parallel, recursive-nix], [])2470Failed to find a machine for remote build!2471derivation: bx4q3j3ng2v1rlkgkcvfifsabbabls6v-cargo-package-cpufeatures-0.3.0.drv2472required (system, features): (aarch64-linux, [])24731 available machines:2474(systems, maxjobs, supportedFeatures, mandatoryFeatures)2475([aarch64-darwin, x86_64-darwin], 8, [big-parallel, recursive-nix], [])2476Failed to find a machine for remote build!2477derivation: hw7nnj679k367r53in41h878hmasv3bx-cargo-package-criterion-0.8.2.drv2478required (system, features): (aarch64-linux, [])24791 available machines:2480(systems, maxjobs, supportedFeatures, mandatoryFeatures)2481([aarch64-darwin, x86_64-darwin], 8, [big-parallel, recursive-nix], [])2482Failed to find a machine for remote build!2483derivation: 98jq4jwzil47vfcqbgyyx71w5xkvzbg5-cargo-package-criterion-plot-0.8.2.drv2484required (system, features): (aarch64-linux, [])24851 available machines:2486(systems, maxjobs, supportedFeatures, mandatoryFeatures)2487([aarch64-darwin, x86_64-darwin], 8, [big-parallel, recursive-nix], [])2488Failed to find a machine for remote build!2489derivation: 5d407da35krwg98xnbxb9ly9g6k3wpm5-cargo-package-crossbeam-deque-0.8.6.drv2490required (system, features): (aarch64-linux, [])24911 available machines:2492(systems, maxjobs, supportedFeatures, mandatoryFeatures)2493([aarch64-darwin, x86_64-darwin], 8, [big-parallel, recursive-nix], [])2494Failed to find a machine for remote build!2495derivation: 0w9kfbjyvd7c8m20ldihl9xgxp098zpa-cargo-package-crossbeam-epoch-0.9.18.drv2496required (system, features): (aarch64-linux, [])24971 available machines:2498(systems, maxjobs, supportedFeatures, mandatoryFeatures)2499([aarch64-darwin, x86_64-darwin], 8, [big-parallel, recursive-nix], [])2500Failed to find a machine for remote build!2501derivation: aicxm1bkfbss9z3im162qc503krmr01x-cargo-package-crossbeam-utils-0.8.21.drv2502required (system, features): (aarch64-linux, [])25031 available machines:2504(systems, maxjobs, supportedFeatures, mandatoryFeatures)2505([aarch64-darwin, x86_64-darwin], 8, [big-parallel, recursive-nix], [])2506Failed to find a machine for remote build!2507derivation: bjm5bgkjdr2gcr7x02z98w6yswwrcwzz-cargo-package-crunchy-0.2.4.drv2508required (system, features): (aarch64-linux, [])25091 available machines:2510(systems, maxjobs, supportedFeatures, mandatoryFeatures)2511([aarch64-darwin, x86_64-darwin], 8, [big-parallel, recursive-nix], [])2512Failed to find a machine for remote build!2513derivation: mkqyjcsav7r2sg8zc5wvyq29ljqr73l0-cargo-package-crypto-common-0.2.1.drv2514required (system, features): (aarch64-linux, [])25151 available machines:2516(systems, maxjobs, supportedFeatures, mandatoryFeatures)2517([aarch64-darwin, x86_64-darwin], 8, [big-parallel, recursive-nix], [])2518Failed to find a machine for remote build!2519derivation: rizpk4xdr7p3hxh49ymvykqghaa34qyf-cargo-package-curve25519-dalek-5.0.0.drv2520required (system, features): (aarch64-linux, [])25211 available machines:2522(systems, maxjobs, supportedFeatures, mandatoryFeatures)2523([aarch64-darwin, x86_64-darwin], 8, [big-parallel, recursive-nix], [])2524Failed to find a machine for remote build!2525derivation: 6af6188fkcqf539addi6i37zpm15l617-cargo-package-curve25519-dalek-derive-0.1.1.drv2526required (system, features): (aarch64-linux, [])25271 available machines:2528(systems, maxjobs, supportedFeatures, mandatoryFeatures)2529([aarch64-darwin, x86_64-darwin], 8, [big-parallel, recursive-nix], [])2530Failed to find a machine for remote build!2531derivation: w8g9rdzmx77783ad2vvrayw6bl8vp2v1-cargo-package-data-encoding-2.11.1.drv2532required (system, features): (aarch64-linux, [])25331 available machines:2534(systems, maxjobs, supportedFeatures, mandatoryFeatures)2535([aarch64-darwin, x86_64-darwin], 8, [big-parallel, recursive-nix], [])2536Failed to find a machine for remote build!2537derivation: 4kdk78m35j4ax27aqmimy8b8kfbixs38-cargo-package-deranged-0.5.8.drv2538required (system, features): (aarch64-linux, [])25391 available machines:2540(systems, maxjobs, supportedFeatures, mandatoryFeatures)2541([aarch64-darwin, x86_64-darwin], 8, [big-parallel, recursive-nix], [])2542Failed to find a machine for remote build!2543derivation: ghs7acxra6vq1dlqnp3r7kk3gza4bkvv-cargo-package-derive_more-2.1.1.drv2544required (system, features): (aarch64-linux, [])25451 available machines:2546(systems, maxjobs, supportedFeatures, mandatoryFeatures)2547([aarch64-darwin, x86_64-darwin], 8, [big-parallel, recursive-nix], [])2548Failed to find a machine for remote build!2549derivation: drsxdryvqigz0mv1w4gs316rsmfcbcqi-cargo-package-derive_more-impl-2.1.1.drv2550required (system, features): (aarch64-linux, [])25511 available machines:2552(systems, maxjobs, supportedFeatures, mandatoryFeatures)2553([aarch64-darwin, x86_64-darwin], 8, [big-parallel, recursive-nix], [])2554Failed to find a machine for remote build!2555derivation: 3li3yziy3ydfbczg1b8335d5h9bi1inz-cargo-package-digest-0.11.2.drv2556required (system, features): (aarch64-linux, [])25571 available machines:2558(systems, maxjobs, supportedFeatures, mandatoryFeatures)2559([aarch64-darwin, x86_64-darwin], 8, [big-parallel, recursive-nix], [])2560Failed to find a machine for remote build!2561derivation: 0df5nkxg98v74yjr23am4qn1b3xambrm-cargo-package-displaydoc-0.2.5.drv2562required (system, features): (aarch64-linux, [])25631 available machines:2564(systems, maxjobs, supportedFeatures, mandatoryFeatures)2565([aarch64-darwin, x86_64-darwin], 8, [big-parallel, recursive-nix], [])2566Failed to find a machine for remote build!2567derivation: ki3bjqrw2iqy6w7mq1dk27zh3212l741-cargo-package-ed25519-3.0.0.drv2568required (system, features): (aarch64-linux, [])25691 available machines:2570(systems, maxjobs, supportedFeatures, mandatoryFeatures)2571([aarch64-darwin, x86_64-darwin], 8, [big-parallel, recursive-nix], [])2572Failed to find a machine for remote build!2573derivation: vb2jx0hp9a0hixmdb5gh8849kdswf7b4-cargo-package-ed25519-dalek-3.0.0.drv2574required (system, features): (aarch64-linux, [])25751 available machines:2576(systems, maxjobs, supportedFeatures, mandatoryFeatures)2577([aarch64-darwin, x86_64-darwin], 8, [big-parallel, recursive-nix], [])2578Failed to find a machine for remote build!2579derivation: xq7lqrcm76a3cqqz2qrdwxxyngq9nyya-cargo-package-either-1.15.0.drv2580required (system, features): (aarch64-linux, [])25811 available machines:2582(systems, maxjobs, supportedFeatures, mandatoryFeatures)2583([aarch64-darwin, x86_64-darwin], 8, [big-parallel, recursive-nix], [])2584Failed to find a machine for remote build!2585derivation: 18c1jkdnyrnf2lai36zbb4sjx6zraw2n-cargo-package-encoding_rs-0.8.35.drv2586required (system, features): (aarch64-linux, [])25871 available machines:2588(systems, maxjobs, supportedFeatures, mandatoryFeatures)2589([aarch64-darwin, x86_64-darwin], 8, [big-parallel, recursive-nix], [])2590Failed to find a machine for remote build!2591derivation: 80chfmhg9nbsnpyls3wqy8jcp1l0az9f-cargo-package-equivalent-1.0.2.drv2592required (system, features): (aarch64-linux, [])25931 available machines:2594(systems, maxjobs, supportedFeatures, mandatoryFeatures)2595([aarch64-darwin, x86_64-darwin], 8, [big-parallel, recursive-nix], [])2596Failed to find a machine for remote build!2597derivation: ir57y4a3ycwj9qcnhpi6513fm28c7xh3-cargo-package-errno-0.3.14.drv2598required (system, features): (aarch64-linux, [])25991 available machines:2600(systems, maxjobs, supportedFeatures, mandatoryFeatures)2601([aarch64-darwin, x86_64-darwin], 8, [big-parallel, recursive-nix], [])2602Failed to find a machine for remote build!2603derivation: p5dipyhxnvrfk9xlcsrxwxpilnphi09d-cargo-package-fallible-iterator-0.3.0.drv2604required (system, features): (aarch64-linux, [])26051 available machines:2606(systems, maxjobs, supportedFeatures, mandatoryFeatures)2607([aarch64-darwin, x86_64-darwin], 8, [big-parallel, recursive-nix], [])2608Failed to find a machine for remote build!2609derivation: vh51vsv9fcqz0cjzc1sgkjqhl3mf9flj-cargo-package-find-msvc-tools-0.1.9.drv2610required (system, features): (aarch64-linux, [])26111 available machines:2612(systems, maxjobs, supportedFeatures, mandatoryFeatures)2613([aarch64-darwin, x86_64-darwin], 8, [big-parallel, recursive-nix], [])2614Failed to find a machine for remote build!2615derivation: ikqqady2cpsf1wq0n8h9gdr27pffl7dv-cargo-package-futures-task-0.3.34.drv2616required (system, features): (aarch64-linux, [])26171 available machines:2618(systems, maxjobs, supportedFeatures, mandatoryFeatures)2619([aarch64-darwin, x86_64-darwin], 8, [big-parallel, recursive-nix], [])2620Failed to find a machine for remote build!2621derivation: wda7s86iz98l3znn1m0wmyl8mg8nzrb2-cargo-package-futures-util-0.3.34.drv2622required (system, features): (aarch64-linux, [])26231 available machines:2624(systems, maxjobs, supportedFeatures, mandatoryFeatures)2625([aarch64-darwin, x86_64-darwin], 8, [big-parallel, recursive-nix], [])2626Failed to find a machine for remote build!2627derivation: mfbfkdn01av47dnldnr2lyyj7wyba6iw-cargo-package-getrandom-0.3.4.drv2628required (system, features): (aarch64-linux, [])26291 available machines:2630(systems, maxjobs, supportedFeatures, mandatoryFeatures)2631([aarch64-darwin, x86_64-darwin], 8, [big-parallel, recursive-nix], [])2632Failed to find a machine for remote build!2633derivation: f5lldlcwr425w8yc0wy5323bmkpwjw6i-cargo-package-glob-0.3.3.drv2634required (system, features): (aarch64-linux, [])26351 available machines:2636(systems, maxjobs, supportedFeatures, mandatoryFeatures)2637([aarch64-darwin, x86_64-darwin], 8, [big-parallel, recursive-nix], [])2638Failed to find a machine for remote build!2639derivation: lx0lcd5z0yg2ijw54zmdbr9zfjhfz7h5-cargo-package-hashbrown-0.16.1.drv2640required (system, features): (aarch64-linux, [])26411 available machines:2642(systems, maxjobs, supportedFeatures, mandatoryFeatures)2643([aarch64-darwin, x86_64-darwin], 8, [big-parallel, recursive-nix], [])2644Failed to find a machine for remote build!2645derivation: 4yfy4m7qxfsxz85kyxhxvicsb0vw2xv3-cargo-package-heck-0.5.0.drv2646required (system, features): (aarch64-linux, [])26471 available machines:2648(systems, maxjobs, supportedFeatures, mandatoryFeatures)2649([aarch64-darwin, x86_64-darwin], 8, [big-parallel, recursive-nix], [])2650Failed to find a machine for remote build!2651derivation: l4my3ixpdi3vmlr39r445907svi44d0s-cargo-package-http-0.2.12.drv2652required (system, features): (aarch64-linux, [])26531 available machines:2654(systems, maxjobs, supportedFeatures, mandatoryFeatures)2655([aarch64-darwin, x86_64-darwin], 8, [big-parallel, recursive-nix], [])2656Failed to find a machine for remote build!2657derivation: bq16lkbzarb3afgpm01rajcpgij03ars-cargo-package-httparse-1.10.1.drv2658required (system, features): (aarch64-linux, [])26591 available machines:2660(systems, maxjobs, supportedFeatures, mandatoryFeatures)2661([aarch64-darwin, x86_64-darwin], 8, [big-parallel, recursive-nix], [])2662Failed to find a machine for remote build!2663derivation: zgwr3pr9j894x687fvv7frywz8jmq6hb-cargo-package-hybrid-array-0.4.11.drv2664required (system, features): (aarch64-linux, [])26651 available machines:2666(systems, maxjobs, supportedFeatures, mandatoryFeatures)2667([aarch64-darwin, x86_64-darwin], 8, [big-parallel, recursive-nix], [])2668Failed to find a machine for remote build!2669derivation: 3qckamphx3pab9gwf7az1lcxksbv2h98-cargo-package-icu_locale_core-2.2.0.drv2670required (system, features): (aarch64-linux, [])26711 available machines:2672(systems, maxjobs, supportedFeatures, mandatoryFeatures)2673([aarch64-darwin, x86_64-darwin], 8, [big-parallel, recursive-nix], [])2674Failed to find a machine for remote build!2675derivation: 8wgqfrc3zg7jxsfx7vy2cj3g1rfgmjln-cargo-package-icu_normalizer_data-2.2.0.drv2676required (system, features): (aarch64-linux, [])26771 available machines:2678(systems, maxjobs, supportedFeatures, mandatoryFeatures)2679([aarch64-darwin, x86_64-darwin], 8, [big-parallel, recursive-nix], [])2680Failed to find a machine for remote build!2681derivation: ijx1xynd2yqnw551grcqn3yv7x0lx7q2-cargo-package-icu_properties_data-2.2.0.drv2682required (system, features): (aarch64-linux, [])26831 available machines:2684(systems, maxjobs, supportedFeatures, mandatoryFeatures)2685([aarch64-darwin, x86_64-darwin], 8, [big-parallel, recursive-nix], [])2686Failed to find a machine for remote build!2687derivation: jv26x04fplf0izarbb7408s1lvp2yy8c-cargo-package-idna_adapter-1.2.1.drv2688required (system, features): (aarch64-linux, [])26891 available machines:2690(systems, maxjobs, supportedFeatures, mandatoryFeatures)2691([aarch64-darwin, x86_64-darwin], 8, [big-parallel, recursive-nix], [])2692Failed to find a machine for remote build!2693derivation: ark9a747ny3j0fn9b1na5vq0rn1ihbrx-cargo-package-impl-more-0.3.1.drv2694required (system, features): (aarch64-linux, [])26951 available machines:2696(systems, maxjobs, supportedFeatures, mandatoryFeatures)2697([aarch64-darwin, x86_64-darwin], 8, [big-parallel, recursive-nix], [])2698Failed to find a machine for remote build!2699derivation: kidhiff9qwdpzh7a0y58mzyx8akpk52y-cargo-package-itoa-1.0.18.drv2700required (system, features): (aarch64-linux, [])27011 available machines:2702(systems, maxjobs, supportedFeatures, mandatoryFeatures)2703([aarch64-darwin, x86_64-darwin], 8, [big-parallel, recursive-nix], [])2704Failed to find a machine for remote build!2705derivation: i758a26qbvm1hg48rhz8cx3246nzzqkh-cargo-package-language-tags-0.3.2.drv2706required (system, features): (aarch64-linux, [])27071 available machines:2708(systems, maxjobs, supportedFeatures, mandatoryFeatures)2709([aarch64-darwin, x86_64-darwin], 8, [big-parallel, recursive-nix], [])2710Failed to find a machine for remote build!2711derivation: iv38h33v50lmqdxz3skd0yf2iirkg921-cargo-package-lazy_static-1.5.0.drv2712required (system, features): (aarch64-linux, [])27131 available machines:2714(systems, maxjobs, supportedFeatures, mandatoryFeatures)2715([aarch64-darwin, x86_64-darwin], 8, [big-parallel, recursive-nix], [])2716Failed to find a machine for remote build!2717derivation: v1nlfdii50mhczqp0bgvplvmc81kg7qp-cargo-package-libc-0.2.189.drv2718required (system, features): (aarch64-linux, [])27191 available machines:2720(systems, maxjobs, supportedFeatures, mandatoryFeatures)2721([aarch64-darwin, x86_64-darwin], 8, [big-parallel, recursive-nix], [])2722Failed to find a machine for remote build!2723derivation: shvsira0dk35nikxr2y7fdyxvidhs7rf-cargo-package-linux-raw-sys-0.12.1.drv2724required (system, features): (aarch64-linux, [])27251 available machines:2726(systems, maxjobs, supportedFeatures, mandatoryFeatures)2727([aarch64-darwin, x86_64-darwin], 8, [big-parallel, recursive-nix], [])2728Failed to find a machine for remote build!2729derivation: 9i7r1dldwbv9plfxczf4n27v5qr227v8-cargo-package-lock_api-0.4.14.drv2730required (system, features): (aarch64-linux, [])27311 available machines:2732(systems, maxjobs, supportedFeatures, mandatoryFeatures)2733([aarch64-darwin, x86_64-darwin], 8, [big-parallel, recursive-nix], [])2734Failed to find a machine for remote build!2735derivation: 7f830wjxs8jkdirfj7lzq05r665jmxcs-cargo-package-matchers-0.2.0.drv2736required (system, features): (aarch64-linux, [])27371 available machines:2738(systems, maxjobs, supportedFeatures, mandatoryFeatures)2739([aarch64-darwin, x86_64-darwin], 8, [big-parallel, recursive-nix], [])2740Failed to find a machine for remote build!2741derivation: bqhb2dcdh2j6q4cwv1816yznm472bpjz-cargo-package-md5-0.8.1.drv2742required (system, features): (aarch64-linux, [])27431 available machines:2744(systems, maxjobs, supportedFeatures, mandatoryFeatures)2745([aarch64-darwin, x86_64-darwin], 8, [big-parallel, recursive-nix], [])2746Failed to find a machine for remote build!2747derivation: bnjzvpdd632amnbys3pipx3ibicv65s4-cargo-package-mime-0.3.17.drv2748required (system, features): (aarch64-linux, [])27491 available machines:2750(systems, maxjobs, supportedFeatures, mandatoryFeatures)2751([aarch64-darwin, x86_64-darwin], 8, [big-parallel, recursive-nix], [])2752Failed to find a machine for remote build!2753derivation: g51fj4jwn4bm2ip03q125i2s40vh9v93-cargo-package-mio-1.2.0.drv2754required (system, features): (aarch64-linux, [])27551 available machines:2756(systems, maxjobs, supportedFeatures, mandatoryFeatures)2757([aarch64-darwin, x86_64-darwin], 8, [big-parallel, recursive-nix], [])2758Failed to find a machine for remote build!2759derivation: pz13jnni2bqqccfsf85wi2jwff30v3v9-cargo-package-nu-ansi-term-0.50.3.drv2760required (system, features): (aarch64-linux, [])27611 available machines:2762(systems, maxjobs, supportedFeatures, mandatoryFeatures)2763([aarch64-darwin, x86_64-darwin], 8, [big-parallel, recursive-nix], [])2764Failed to find a machine for remote build!2765derivation: bm4wlm94bvrapc5apmbas25kfdjb99nl-cargo-package-num_enum-0.7.6.drv2766required (system, features): (aarch64-linux, [])27671 available machines:2768(systems, maxjobs, supportedFeatures, mandatoryFeatures)2769([aarch64-darwin, x86_64-darwin], 8, [big-parallel, recursive-nix], [])2770Failed to find a machine for remote build!2771derivation: as7ajlr0jk4h573pcdy3nz73cgjgpjlh-cargo-package-oorandom-11.1.5.drv2772required (system, features): (aarch64-linux, [])27731 available machines:2774(systems, maxjobs, supportedFeatures, mandatoryFeatures)2775([aarch64-darwin, x86_64-darwin], 8, [big-parallel, recursive-nix], [])2776Failed to find a machine for remote build!2777derivation: jsynhgc9yrhgjm2fk99hxf9s22gq5951-cargo-package-parking_lot_core-0.9.12.drv2778required (system, features): (aarch64-linux, [])27791 available machines:2780(systems, maxjobs, supportedFeatures, mandatoryFeatures)2781([aarch64-darwin, x86_64-darwin], 8, [big-parallel, recursive-nix], [])2782Failed to find a machine for remote build!2783derivation: i20kllyd00jikklif85g1anxx6hqfwlm-cargo-package-percent-encoding-2.3.2.drv2784required (system, features): (aarch64-linux, [])27851 available machines:2786(systems, maxjobs, supportedFeatures, mandatoryFeatures)2787([aarch64-darwin, x86_64-darwin], 8, [big-parallel, recursive-nix], [])2788Failed to find a machine for remote build!2789derivation: jz13xik39z436iw1faimwbi9y58jrhji-cargo-package-pkg-config-0.3.33.drv2790required (system, features): (aarch64-linux, [])27911 available machines:2792(systems, maxjobs, supportedFeatures, mandatoryFeatures)2793([aarch64-darwin, x86_64-darwin], 8, [big-parallel, recursive-nix], [])2794Failed to find a machine for remote build!2795derivation: dn5090b7g1mzm6hbp342n2sy7jk00clb-cargo-package-plotters-backend-0.3.7.drv2796required (system, features): (aarch64-linux, [])27971 available machines:2798(systems, maxjobs, supportedFeatures, mandatoryFeatures)2799([aarch64-darwin, x86_64-darwin], 8, [big-parallel, recursive-nix], [])2800Failed to find a machine for remote build!2801derivation: gma7qi513hy0ykqn1acpywyr4ffs8jsx-cargo-package-potential_utf-0.1.5.drv2802required (system, features): (aarch64-linux, [])28031 available machines:2804(systems, maxjobs, supportedFeatures, mandatoryFeatures)2805([aarch64-darwin, x86_64-darwin], 8, [big-parallel, recursive-nix], [])2806Failed to find a machine for remote build!2807derivation: 8rnfpf0n9x8nx6b0cn1v00ga6635lb7b-cargo-package-ppv-lite86-0.2.21.drv2808required (system, features): (aarch64-linux, [])28091 available machines:2810(systems, maxjobs, supportedFeatures, mandatoryFeatures)2811([aarch64-darwin, x86_64-darwin], 8, [big-parallel, recursive-nix], [])2812Failed to find a machine for remote build!2813derivation: jhj5bpwnv8djy97hvsfnai7kn7bgdm60-cargo-package-prometheus-0.14.0.drv2814required (system, features): (aarch64-linux, [])28151 available machines:2816(systems, maxjobs, supportedFeatures, mandatoryFeatures)2817([aarch64-darwin, x86_64-darwin], 8, [big-parallel, recursive-nix], [])2818Failed to find a machine for remote build!2819derivation: 5i7jjypdzc8lrnprrk6bhr33bpgqjr1n-cargo-package-proptest-derive-0.8.0.drv2820required (system, features): (aarch64-linux, [])28211 available machines:2822(systems, maxjobs, supportedFeatures, mandatoryFeatures)2823([aarch64-darwin, x86_64-darwin], 8, [big-parallel, recursive-nix], [])2824Failed to find a machine for remote build!2825derivation: hldzv4y8rwkiq38ilr2lsym9vczk6kby-cargo-package-quote-1.0.47.drv2826required (system, features): (aarch64-linux, [])28271 available machines:2828(systems, maxjobs, supportedFeatures, mandatoryFeatures)2829([aarch64-darwin, x86_64-darwin], 8, [big-parallel, recursive-nix], [])2830Failed to find a machine for remote build!2831derivation: 3asl0rirl8skw1km5y09yzn48cnfmjgk-cargo-package-rand_core-0.9.5.drv2832required (system, features): (aarch64-linux, [])28331 available machines:2834(systems, maxjobs, supportedFeatures, mandatoryFeatures)2835([aarch64-darwin, x86_64-darwin], 8, [big-parallel, recursive-nix], [])2836Failed to find a machine for remote build!2837derivation: yv66jdxdamw5h2am44kr5mc63bgi4l1m-cargo-package-rayon-core-1.13.0.drv2838required (system, features): (aarch64-linux, [])28391 available machines:2840(systems, maxjobs, supportedFeatures, mandatoryFeatures)2841([aarch64-darwin, x86_64-darwin], 8, [big-parallel, recursive-nix], [])2842Failed to find a machine for remote build!2843derivation: s02a0nly5idc9cdapm9zzgm7yhmbh2ca-cargo-package-regex-automata-0.4.14.drv2844required (system, features): (aarch64-linux, [])28451 available machines:2846(systems, maxjobs, supportedFeatures, mandatoryFeatures)2847([aarch64-darwin, x86_64-darwin], 8, [big-parallel, recursive-nix], [])2848Failed to find a machine for remote build!2849derivation: gf7h651d3kl6ngzsbyn727jnjmhyxxa5-cargo-package-regex-syntax-0.8.10.drv2850required (system, features): (aarch64-linux, [])28511 available machines:2852(systems, maxjobs, supportedFeatures, mandatoryFeatures)2853([aarch64-darwin, x86_64-darwin], 8, [big-parallel, recursive-nix], [])2854Failed to find a machine for remote build!2855derivation: 8qkmrcl0vvhxza5a3j700kaln8a9x4dx-cargo-package-relative-path-1.9.3.drv2856required (system, features): (aarch64-linux, [])28571 available machines:2858(systems, maxjobs, supportedFeatures, mandatoryFeatures)2859([aarch64-darwin, x86_64-darwin], 8, [big-parallel, recursive-nix], [])2860Failed to find a machine for remote build!2861derivation: ysd4wl067cb45c0la6m6pk6s4kc1vgg5-cargo-package-ring-0.17.14.drv2862required (system, features): (aarch64-linux, [])28631 available machines:2864(systems, maxjobs, supportedFeatures, mandatoryFeatures)2865([aarch64-darwin, x86_64-darwin], 8, [big-parallel, recursive-nix], [])2866Failed to find a machine for remote build!2867derivation: s76nc0vsf2hxwsndbw5yfxlq8vmm47h2-cargo-package-rsqlite-vfs-0.1.0.drv2868required (system, features): (aarch64-linux, [])28691 available machines:2870(systems, maxjobs, supportedFeatures, mandatoryFeatures)2871([aarch64-darwin, x86_64-darwin], 8, [big-parallel, recursive-nix], [])2872Failed to find a machine for remote build!2873derivation: 3dhbwvg3pi5m3w9rli827ydp3vcn1qan-cargo-package-rstest_macros-0.26.1.drv2874required (system, features): (aarch64-linux, [])28751 available machines:2876(systems, maxjobs, supportedFeatures, mandatoryFeatures)2877([aarch64-darwin, x86_64-darwin], 8, [big-parallel, recursive-nix], [])2878Failed to find a machine for remote build!2879derivation: x15kdm2yg0snr6ysjx9bd2r96ry79qxg-cargo-package-rustc_version-0.4.1.drv2880required (system, features): (aarch64-linux, [])28811 available machines:2882(systems, maxjobs, supportedFeatures, mandatoryFeatures)2883([aarch64-darwin, x86_64-darwin], 8, [big-parallel, recursive-nix], [])2884Failed to find a machine for remote build!2885derivation: 0qf0j0isbijhaa54bjwfv5qmj88ms1jv-cargo-package-rustls-pki-types-1.15.1.drv2886required (system, features): (aarch64-linux, [])28871 available machines:2888(systems, maxjobs, supportedFeatures, mandatoryFeatures)2889([aarch64-darwin, x86_64-darwin], 8, [big-parallel, recursive-nix], [])2890Failed to find a machine for remote build!2891derivation: apsgazpndy0r14q8cgp97cxy228igcmr-cargo-package-rustversion-1.0.22.drv2892required (system, features): (aarch64-linux, [])28931 available machines:2894(systems, maxjobs, supportedFeatures, mandatoryFeatures)2895([aarch64-darwin, x86_64-darwin], 8, [big-parallel, recursive-nix], [])2896Failed to find a machine for remote build!2897derivation: yk0cr9wg6dajyy49f1ap6lpbkaa79jfc-cargo-package-ryu-1.0.23.drv2898required (system, features): (aarch64-linux, [])28991 available machines:2900(systems, maxjobs, supportedFeatures, mandatoryFeatures)2901([aarch64-darwin, x86_64-darwin], 8, [big-parallel, recursive-nix], [])2902Failed to find a machine for remote build!2903derivation: w1yh1v78v8hkyghivs373p1kqv90airi-cargo-package-serde-1.0.229.drv2904required (system, features): (aarch64-linux, [])29051 available machines:2906(systems, maxjobs, supportedFeatures, mandatoryFeatures)2907([aarch64-darwin, x86_64-darwin], 8, [big-parallel, recursive-nix], [])2908Failed to find a machine for remote build!2909derivation: k1ma9648g8kfnjkh1pac0dpw1p4arxz8-cargo-package-serde_derive-1.0.229.drv2910required (system, features): (aarch64-linux, [])29111 available machines:2912(systems, maxjobs, supportedFeatures, mandatoryFeatures)2913([aarch64-darwin, x86_64-darwin], 8, [big-parallel, recursive-nix], [])2914Failed to find a machine for remote build!2915derivation: 9rrjvz8l89k63ykb0yjn7mfvwmnxw9rp-cargo-package-serde_spanned-1.1.1.drv2916required (system, features): (aarch64-linux, [])29171 available machines:2918(systems, maxjobs, supportedFeatures, mandatoryFeatures)2919([aarch64-darwin, x86_64-darwin], 8, [big-parallel, recursive-nix], [])2920Failed to find a machine for remote build!2921derivation: 2hv13h2sxln7sfli1wwyg2khlkvpbc8a-cargo-package-sha1-0.11.0.drv2922required (system, features): (aarch64-linux, [])29231 available machines:2924(systems, maxjobs, supportedFeatures, mandatoryFeatures)2925([aarch64-darwin, x86_64-darwin], 8, [big-parallel, recursive-nix], [])2926Failed to find a machine for remote build!2927derivation: lpq9da73sr6czqpb2k62688hgjl5r3m9-cargo-package-sha2-0.11.0.drv2928required (system, features): (aarch64-linux, [])29291 available machines:2930(systems, maxjobs, supportedFeatures, mandatoryFeatures)2931([aarch64-darwin, x86_64-darwin], 8, [big-parallel, recursive-nix], [])2932Failed to find a machine for remote build!2933derivation: grqnvsxingjl5zxzxs6nd4z3j2mr6mix-cargo-package-shlex-1.3.0.drv2934required (system, features): (aarch64-linux, [])29351 available machines:2936(systems, maxjobs, supportedFeatures, mandatoryFeatures)2937([aarch64-darwin, x86_64-darwin], 8, [big-parallel, recursive-nix], [])2938Failed to find a machine for remote build!2939derivation: pn4ryk0jcryi14dspym9hmjkjnflhq81-cargo-package-signature-3.0.0.drv2940required (system, features): (aarch64-linux, [])29411 available machines:2942(systems, maxjobs, supportedFeatures, mandatoryFeatures)2943([aarch64-darwin, x86_64-darwin], 8, [big-parallel, recursive-nix], [])2944Failed to find a machine for remote build!2945derivation: mk8k1mla1318l2izzx52xk6fnxixlqnv-cargo-package-smallvec-1.15.1.drv2946required (system, features): (aarch64-linux, [])29471 available machines:2948(systems, maxjobs, supportedFeatures, mandatoryFeatures)2949([aarch64-darwin, x86_64-darwin], 8, [big-parallel, recursive-nix], [])2950Failed to find a machine for remote build!2951derivation: ddcqnzjqqxw17md4rypcy1vzdl89j9h9-cargo-package-socket2-0.6.3.drv2952required (system, features): (aarch64-linux, [])29531 available machines:2954(systems, maxjobs, supportedFeatures, mandatoryFeatures)2955([aarch64-darwin, x86_64-darwin], 8, [big-parallel, recursive-nix], [])2956Failed to find a machine for remote build!2957derivation: sqrslqkwsy3rpfbn5jkjwxgnvjb5l77k-cargo-package-stable_deref_trait-1.2.1.drv2958required (system, features): (aarch64-linux, [])29591 available machines:2960(systems, maxjobs, supportedFeatures, mandatoryFeatures)2961([aarch64-darwin, x86_64-darwin], 8, [big-parallel, recursive-nix], [])2962Failed to find a machine for remote build!2963derivation: cx1cc1hnfkjzfj05vhwvw8bm4s1ihh03-cargo-package-subtle-2.6.1.drv2964required (system, features): (aarch64-linux, [])29651 available machines:2966(systems, maxjobs, supportedFeatures, mandatoryFeatures)2967([aarch64-darwin, x86_64-darwin], 8, [big-parallel, recursive-nix], [])2968Failed to find a machine for remote build!2969derivation: 6jnn0j1g2fmqmbrqzk1p7dklx50d42r8-cargo-package-syn-3.0.5.drv2970required (system, features): (aarch64-linux, [])29711 available machines:2972(systems, maxjobs, supportedFeatures, mandatoryFeatures)2973([aarch64-darwin, x86_64-darwin], 8, [big-parallel, recursive-nix], [])2974Failed to find a machine for remote build!2975derivation: 91qyfbvv7cppz324mxb52l7kxd90mnfb-cargo-package-tokio-macros-2.7.0.drv2976required (system, features): (aarch64-linux, [])29771 available machines:2978(systems, maxjobs, supportedFeatures, mandatoryFeatures)2979([aarch64-darwin, x86_64-darwin], 8, [big-parallel, recursive-nix], [])2980Failed to find a machine for remote build!2981derivation: 6xjphvqvi65wbgzk8cmnj046xa163jlf-cargo-package-tokio-stream-0.1.18.drv2982required (system, features): (aarch64-linux, [])29831 available machines:2984(systems, maxjobs, supportedFeatures, mandatoryFeatures)2985([aarch64-darwin, x86_64-darwin], 8, [big-parallel, recursive-nix], [])2986Failed to find a machine for remote build!2987derivation: 14mc5bza46fh97ksxxzcpvvl20cgmrca-cargo-package-tokio-util-0.7.19.drv2988required (system, features): (aarch64-linux, [])29891 available machines:2990(systems, maxjobs, supportedFeatures, mandatoryFeatures)2991([aarch64-darwin, x86_64-darwin], 8, [big-parallel, recursive-nix], [])2992Failed to find a machine for remote build!2993derivation: 7q0r427bw2z6rjhdsa526ac7rkj8x6nq-cargo-package-toml_datetime-1.1.1+spec-1.1.0.drv2994required (system, features): (aarch64-linux, [])29951 available machines:2996(systems, maxjobs, supportedFeatures, mandatoryFeatures)2997([aarch64-darwin, x86_64-darwin], 8, [big-parallel, recursive-nix], [])2998Failed to find a machine for remote build!2999derivation: rxp47xigdb39z4g4c6slqqzp28i65y62-cargo-package-toml_edit-0.25.11+spec-1.1.0.drv3000required (system, features): (aarch64-linux, [])30011 available machines:3002(systems, maxjobs, supportedFeatures, mandatoryFeatures)3003([aarch64-darwin, x86_64-darwin], 8, [big-parallel, recursive-nix], [])3004Failed to find a machine for remote build!3005derivation: wmq4slh28s45mrpdidsail69cgasp0kf-cargo-package-toml_parser-1.1.2+spec-1.1.0.drv3006required (system, features): (aarch64-linux, [])30071 available machines:3008(systems, maxjobs, supportedFeatures, mandatoryFeatures)3009([aarch64-darwin, x86_64-darwin], 8, [big-parallel, recursive-nix], [])3010Failed to find a machine for remote build!3011derivation: 719af5l5lsmzs1bbal8hwrszxyr6n1yy-cargo-package-toml_writer-1.1.2+spec-1.1.0.drv3012required (system, features): (aarch64-linux, [])30131 available machines:3014(systems, maxjobs, supportedFeatures, mandatoryFeatures)3015([aarch64-darwin, x86_64-darwin], 8, [big-parallel, recursive-nix], [])3016Failed to find a machine for remote build!3017derivation: 1kl59fi0wmk47dp9j1qzcijzgj4hvayh-cargo-package-tracing-attributes-0.1.31.drv3018required (system, features): (aarch64-linux, [])30191 available machines:3020(systems, maxjobs, supportedFeatures, mandatoryFeatures)3021([aarch64-darwin, x86_64-darwin], 8, [big-parallel, recursive-nix], [])3022Failed to find a machine for remote build!3023derivation: fwkkswz0abcmmlyjr6zc91gmyr3jmlb4-cargo-package-tracing-subscriber-0.3.23.drv3024required (system, features): (aarch64-linux, [])30251 available machines:3026(systems, maxjobs, supportedFeatures, mandatoryFeatures)3027([aarch64-darwin, x86_64-darwin], 8, [big-parallel, recursive-nix], [])3028Failed to find a machine for remote build!3029derivation: v7yqmkqk0zh016bdnj7hcfpkssj7xsh5-cargo-package-unarray-0.1.4.drv3030required (system, features): (aarch64-linux, [])30311 available machines:3032(systems, maxjobs, supportedFeatures, mandatoryFeatures)3033([aarch64-darwin, x86_64-darwin], 8, [big-parallel, recursive-nix], [])3034Failed to find a machine for remote build!3035derivation: 1yfj9paagvi597h51h7hh34a0k1648pa-cargo-package-unicode-ident-1.0.24.drv3036required (system, features): (aarch64-linux, [])30371 available machines:3038(systems, maxjobs, supportedFeatures, mandatoryFeatures)3039([aarch64-darwin, x86_64-darwin], 8, [big-parallel, recursive-nix], [])3040Failed to find a machine for remote build!3041derivation: 65q6m5gkiz19ddnsgyzym08mlqrrj786-cargo-package-unicode-xid-0.2.6.drv3042required (system, features): (aarch64-linux, [])30431 available machines:3044(systems, maxjobs, supportedFeatures, mandatoryFeatures)3045([aarch64-darwin, x86_64-darwin], 8, [big-parallel, recursive-nix], [])3046Failed to find a machine for remote build!3047derivation: cgiqgwnfcyfqzi0x4p5178cvh3yggcc2-cargo-package-url-2.5.8.drv3048required (system, features): (aarch64-linux, [])30491 available machines:3050(systems, maxjobs, supportedFeatures, mandatoryFeatures)3051([aarch64-darwin, x86_64-darwin], 8, [big-parallel, recursive-nix], [])3052Failed to find a machine for remote build!3053derivation: 2plj9z5zzlvgnyhl1nalr2qkra074mqa-cargo-package-utf8_iter-1.0.4.drv3054required (system, features): (aarch64-linux, [])30551 available machines:3056(systems, maxjobs, supportedFeatures, mandatoryFeatures)3057([aarch64-darwin, x86_64-darwin], 8, [big-parallel, recursive-nix], [])3058Failed to find a machine for remote build!3059derivation: 3rvzr7g7xplmxj9h9sq521fa5fcfzwjv-cargo-package-valuable-0.1.1.drv3060required (system, features): (aarch64-linux, [])30611 available machines:3062(systems, maxjobs, supportedFeatures, mandatoryFeatures)3063([aarch64-darwin, x86_64-darwin], 8, [big-parallel, recursive-nix], [])3064Failed to find a machine for remote build!3065derivation: yx3jx1xp3msic89v19wplwjgxhgq09m6-cargo-package-vcpkg-0.2.15.drv3066required (system, features): (aarch64-linux, [])30671 available machines:3068(systems, maxjobs, supportedFeatures, mandatoryFeatures)3069([aarch64-darwin, x86_64-darwin], 8, [big-parallel, recursive-nix], [])3070Failed to find a machine for remote build!3071derivation: c6nhy3v7jmcd2n2nkf7mzlq72sbj5xfm-cargo-package-wait-timeout-0.2.1.drv3072required (system, features): (aarch64-linux, [])30731 available machines:3074(systems, maxjobs, supportedFeatures, mandatoryFeatures)3075([aarch64-darwin, x86_64-darwin], 8, [big-parallel, recursive-nix], [])3076Failed to find a machine for remote build!3077derivation: 0bbknwwcss3f3bg2k1f8ig9ki81aha10-cargo-package-wasi-0.11.1+wasi-snapshot-preview1.drv3078required (system, features): (aarch64-linux, [])30791 available machines:3080(systems, maxjobs, supportedFeatures, mandatoryFeatures)3081([aarch64-darwin, x86_64-darwin], 8, [big-parallel, recursive-nix], [])3082Failed to find a machine for remote build!3083derivation: svjhazilnlsy4qi1ggzzfrlkqcjv7ylb-cargo-package-wasip2-1.0.3+wasi-0.2.9.drv3084required (system, features): (aarch64-linux, [])30851 available machines:3086(systems, maxjobs, supportedFeatures, mandatoryFeatures)3087([aarch64-darwin, x86_64-darwin], 8, [big-parallel, recursive-nix], [])3088Failed to find a machine for remote build!3089derivation: b23f4r1plyi1633bjic6mdfw7nwgs2xl-cargo-package-wasm-bindgen-macro-0.2.118.drv3090required (system, features): (aarch64-linux, [])30911 available machines:3092(systems, maxjobs, supportedFeatures, mandatoryFeatures)3093([aarch64-darwin, x86_64-darwin], 8, [big-parallel, recursive-nix], [])3094Failed to find a machine for remote build!3095derivation: 79ikh6x6gbv6qp29hjg7bk0iia7k4li8-cargo-package-wasm-bindgen-shared-0.2.118.drv3096required (system, features): (aarch64-linux, [])30971 available machines:3098(systems, maxjobs, supportedFeatures, mandatoryFeatures)3099([aarch64-darwin, x86_64-darwin], 8, [big-parallel, recursive-nix], [])3100Failed to find a machine for remote build!3101derivation: j0531y8mq3v62w0vvm2m7j6pz4gkmkfr-cargo-package-web-sys-0.3.95.drv3102required (system, features): (aarch64-linux, [])31031 available machines:3104(systems, maxjobs, supportedFeatures, mandatoryFeatures)3105([aarch64-darwin, x86_64-darwin], 8, [big-parallel, recursive-nix], [])3106Failed to find a machine for remote build!3107derivation: 2yn8w0cwicsh8l65z58y8zan0jhk9s85-cargo-package-winapi-i686-pc-windows-gnu-0.4.0.drv3108required (system, features): (aarch64-linux, [])31091 available machines:3110(systems, maxjobs, supportedFeatures, mandatoryFeatures)3111([aarch64-darwin, x86_64-darwin], 8, [big-parallel, recursive-nix], [])3112Failed to find a machine for remote build!3113derivation: mfg44djv9pj6885csf1cd1qbqlkyi4h7-cargo-package-winapi-x86_64-pc-windows-gnu-0.4.0.drv3114required (system, features): (aarch64-linux, [])31151 available machines:3116(systems, maxjobs, supportedFeatures, mandatoryFeatures)3117([aarch64-darwin, x86_64-darwin], 8, [big-parallel, recursive-nix], [])3118Failed to find a machine for remote build!3119derivation: rpz5faj1w3yhnvd52478r33ibx3353v0-cargo-package-windows-link-0.2.1.drv3120required (system, features): (aarch64-linux, [])31211 available machines:3122(systems, maxjobs, supportedFeatures, mandatoryFeatures)3123([aarch64-darwin, x86_64-darwin], 8, [big-parallel, recursive-nix], [])3124Failed to find a machine for remote build!3125derivation: jd89248d2bhysldy2mfl9p962lwvqs4n-cargo-package-windows-sys-0.52.0.drv3126required (system, features): (aarch64-linux, [])31271 available machines:3128(systems, maxjobs, supportedFeatures, mandatoryFeatures)3129([aarch64-darwin, x86_64-darwin], 8, [big-parallel, recursive-nix], [])3130Failed to find a machine for remote build!3131derivation: nfbvrsa6lyj2b81z3m4347mfign5ily7-cargo-package-windows-targets-0.52.6.drv3132required (system, features): (aarch64-linux, [])31331 available machines:3134(systems, maxjobs, supportedFeatures, mandatoryFeatures)3135([aarch64-darwin, x86_64-darwin], 8, [big-parallel, recursive-nix], [])3136Failed to find a machine for remote build!3137derivation: 2dyybljiy8lg1x2pd39p6hrby83jsfln-cargo-package-windows_aarch64_msvc-0.52.6.drv3138required (system, features): (aarch64-linux, [])31391 available machines:3140(systems, maxjobs, supportedFeatures, mandatoryFeatures)3141([aarch64-darwin, x86_64-darwin], 8, [big-parallel, recursive-nix], [])3142Failed to find a machine for remote build!3143derivation: p421hkc328i37hx962l4kdaggsankay7-cargo-package-windows_i686_gnullvm-0.52.6.drv3144required (system, features): (aarch64-linux, [])31451 available machines:3146(systems, maxjobs, supportedFeatures, mandatoryFeatures)3147([aarch64-darwin, x86_64-darwin], 8, [big-parallel, recursive-nix], [])3148Failed to find a machine for remote build!3149derivation: l2na3300137lna5a4gli3nd2dk1pfd39-cargo-package-windows_x86_64_gnullvm-0.52.6.drv3150required (system, features): (aarch64-linux, [])31511 available machines:3152(systems, maxjobs, supportedFeatures, mandatoryFeatures)3153([aarch64-darwin, x86_64-darwin], 8, [big-parallel, recursive-nix], [])3154Failed to find a machine for remote build!3155derivation: b9c0gx26sgxj91i5fb1y7x7w1sghhjjg-cargo-package-winnow-1.0.1.drv3156required (system, features): (aarch64-linux, [])31571 available machines:3158(systems, maxjobs, supportedFeatures, mandatoryFeatures)3159([aarch64-darwin, x86_64-darwin], 8, [big-parallel, recursive-nix], [])3160Failed to find a machine for remote build!3161derivation: db40xadznzvgm2l6dfh1mp2vqdf7sbl9-cargo-package-writeable-0.6.3.drv3162required (system, features): (aarch64-linux, [])31631 available machines:3164(systems, maxjobs, supportedFeatures, mandatoryFeatures)3165([aarch64-darwin, x86_64-darwin], 8, [big-parallel, recursive-nix], [])3166Failed to find a machine for remote build!3167derivation: 6g93gd6zdascvx0086brkzxnynqbggnb-cargo-package-yoke-derive-0.8.2.drv3168required (system, features): (aarch64-linux, [])31691 available machines:3170(systems, maxjobs, supportedFeatures, mandatoryFeatures)3171([aarch64-darwin, x86_64-darwin], 8, [big-parallel, recursive-nix], [])3172Failed to find a machine for remote build!3173derivation: blzzd003nwaxai7a8ywl6fp1l8dgvmsb-cargo-package-zerocopy-derive-0.8.56.drv3174required (system, features): (aarch64-linux, [])31751 available machines:3176(systems, maxjobs, supportedFeatures, mandatoryFeatures)3177([aarch64-darwin, x86_64-darwin], 8, [big-parallel, recursive-nix], [])3178Failed to find a machine for remote build!3179derivation: jq19m8hm6yv18bm9vqf15nji6r2bmcvb-cargo-package-zerofrom-derive-0.1.7.drv3180required (system, features): (aarch64-linux, [])31811 available machines:3182(systems, maxjobs, supportedFeatures, mandatoryFeatures)3183([aarch64-darwin, x86_64-darwin], 8, [big-parallel, recursive-nix], [])3184Failed to find a machine for remote build!3185derivation: rfid3s4cbin9ppkd7m0q387h0apj8qlj-cargo-package-zerotrie-0.2.4.drv3186required (system, features): (aarch64-linux, [])31871 available machines:3188(systems, maxjobs, supportedFeatures, mandatoryFeatures)3189([aarch64-darwin, x86_64-darwin], 8, [big-parallel, recursive-nix], [])3190Failed to find a machine for remote build!3191derivation: q33x443v3fqf93c4sz5cfbaj7qfg06l4-cargo-package-zmij-1.0.21.drv3192required (system, features): (aarch64-linux, [])31931 available machines:3194(systems, maxjobs, supportedFeatures, mandatoryFeatures)3195([aarch64-darwin, x86_64-darwin], 8, [big-parallel, recursive-nix], [])3196Failed to find a machine for remote build!3197derivation: 493hlps0kbyg8r2agxyqwdfpiqphagjh-cargo-package-zstd-sys-2.0.16+zstd.1.5.7.drv3198required (system, features): (aarch64-linux, [])31991 available machines:3200(systems, maxjobs, supportedFeatures, mandatoryFeatures)3201([aarch64-darwin, x86_64-darwin], 8, [big-parallel, recursive-nix], [])3202Failed to find a machine for remote build!3203derivation: s8vk5r1774f1f2yvgc3a9fmf0x13ch6j-nix-store-2.36.0pre20260828_7f711bef.drv3204required (system, features): (aarch64-linux, [])32051 available machines:3206(systems, maxjobs, supportedFeatures, mandatoryFeatures)3207([aarch64-darwin, x86_64-darwin], 8, [big-parallel, recursive-nix], [])3208Failed to find a machine for remote build!3209derivation: id2vpqdld8rhrg11asagxbxiflxkyl38-zfs-kernel-2.4.4-7.2.5.drv3210required (system, features): (aarch64-linux, [])32111 available machines:3212(systems, maxjobs, supportedFeatures, mandatoryFeatures)3213([aarch64-darwin, x86_64-darwin], 8, [big-parallel, recursive-nix], [])3214Failed to find a machine for remote build!3215derivation: qdzadhix71s15hj2igf0x3dk2i2lzmln-nix-nswrapper-2.36.0pre.drv3216required (system, features): (aarch64-linux, [])32171 available machines:3218(systems, maxjobs, supportedFeatures, mandatoryFeatures)3219([aarch64-darwin, x86_64-darwin], 8, [big-parallel, recursive-nix], [])3220Failed to find a machine for remote build!3221derivation: q81wf7lbpy63nv24ggvnlavyrid57kjd-nix-store-2.36.0pre.drv3222required (system, features): (aarch64-linux, [])32231 available machines:3224(systems, maxjobs, supportedFeatures, mandatoryFeatures)3225([aarch64-darwin, x86_64-darwin], 8, [big-parallel, recursive-nix], [])3226Failed to find a machine for remote build!3227derivation: qpbzddzzs9hqzzy4wm3r8pzildk1pn7g-nix-util-c-2.36.0pre.drv3228required (system, features): (aarch64-linux, [])32291 available machines:3230(systems, maxjobs, supportedFeatures, mandatoryFeatures)3231([aarch64-darwin, x86_64-darwin], 8, [big-parallel, recursive-nix], [])3232Failed to find a machine for remote build!3233derivation: 8rl3zhmcm1wkpavmffjpdmi91lnpsaya-nix-util-test-support-2.36.0pre.drv3234required (system, features): (aarch64-linux, [])32351 available machines:3236(systems, maxjobs, supportedFeatures, mandatoryFeatures)3237([aarch64-darwin, x86_64-darwin], 8, [big-parallel, recursive-nix], [])3238Failed to find a machine for remote build!3239derivation: 0ig147nccqvjksm3bkjc8awjcp46f2c8-nix-util-tests-2.36.0pre.drv3240required (system, features): (aarch64-linux, [])32411 available machines:3242(systems, maxjobs, supportedFeatures, mandatoryFeatures)3243([aarch64-darwin, x86_64-darwin], 8, [big-parallel, recursive-nix], [])3244Failed to find a machine for remote build!3245derivation: wmh82xffispl641xr7djg7s7rl9jkaqa-harmonia-deps-3.2.0.drv3246required (system, features): (aarch64-linux, [])32471 available machines:3248(systems, maxjobs, supportedFeatures, mandatoryFeatures)3249([aarch64-darwin, x86_64-darwin], 8, [big-parallel, recursive-nix], [])3250Failed to find a machine for remote build!3251derivation: 9z1kkdgwv4dka2vb4nikl6n4kv5bd6ns-nix-fetchers-2.36.0pre20260828_7f711bef.drv3252required (system, features): (aarch64-linux, [])32531 available machines:3254(systems, maxjobs, supportedFeatures, mandatoryFeatures)3255([aarch64-darwin, x86_64-darwin], 8, [big-parallel, recursive-nix], [])3256Failed to find a machine for remote build!3257derivation: h3xfgrpi57dw87d2jlygsm8rv5742w18-nix-fetchers-2.36.0pre.drv3258required (system, features): (aarch64-linux, [])32591 available machines:3260(systems, maxjobs, supportedFeatures, mandatoryFeatures)3261([aarch64-darwin, x86_64-darwin], 8, [big-parallel, recursive-nix], [])3262Failed to find a machine for remote build!3263derivation: nfwk21li85s7fdqh5jh33z2hgffarqlb-nix-store-c-2.36.0pre.drv3264required (system, features): (aarch64-linux, [])32651 available machines:3266(systems, maxjobs, supportedFeatures, mandatoryFeatures)3267([aarch64-darwin, x86_64-darwin], 8, [big-parallel, recursive-nix], [])3268Failed to find a machine for remote build!3269derivation: r3rr67s9mgvjfkd9i9prxxqa88dr9zdd-nix-tarmac-0.1.0.drv3270required (system, features): (aarch64-linux, [])32711 available machines:3272(systems, maxjobs, supportedFeatures, mandatoryFeatures)3273([aarch64-darwin, x86_64-darwin], 8, [big-parallel, recursive-nix], [])3274Failed to find a machine for remote build!3275derivation: 8ihd210yi3kn4a0pyv3cqcdprmlv9701-linux-7.2.5-modules-shrunk.drv3276required (system, features): (aarch64-linux, [])32771 available machines:3278(systems, maxjobs, supportedFeatures, mandatoryFeatures)3279([aarch64-darwin, x86_64-darwin], 8, [big-parallel, recursive-nix], [])3280Failed to find a machine for remote build!3281derivation: 6wmaw262w01p52hzv9dgjpfla6d5950a-initrd-linux-7.2.5.drv3282required (system, features): (aarch64-linux, [])32831 available machines:3284(systems, maxjobs, supportedFeatures, mandatoryFeatures)3285([aarch64-darwin, x86_64-darwin], 8, [big-parallel, recursive-nix], [])3286Failed to find a machine for remote build!3287derivation: 1kfrzfk8sl43qj638qlx5n4ax1l7smh1-nix-store-test-support-2.36.0pre.drv3288required (system, features): (aarch64-linux, [])32891 available machines:3290(systems, maxjobs, supportedFeatures, mandatoryFeatures)3291([aarch64-darwin, x86_64-darwin], 8, [big-parallel, recursive-nix], [])3292Failed to find a machine for remote build!3293derivation: hp3bzjjm6lv57lqd3m3civlp2028rv0n-nix-expr-2.36.0pre.drv3294required (system, features): (aarch64-linux, [])32951 available machines:3296(systems, maxjobs, supportedFeatures, mandatoryFeatures)3297([aarch64-darwin, x86_64-darwin], 8, [big-parallel, recursive-nix], [])3298Failed to find a machine for remote build!3299derivation: 50hswb9qggi559vz079c2159kbrdsrdw-nix-tarmac-0.1.0.drv3300required (system, features): (aarch64-linux, [])33011 available machines:3302(systems, maxjobs, supportedFeatures, mandatoryFeatures)3303([aarch64-darwin, x86_64-darwin], 8, [big-parallel, recursive-nix], [])3304Failed to find a machine for remote build!3305derivation: kaf6a4m5cjzcvkmclgcg7w90jmz508m6-nix-store-tests-2.36.0pre.drv3306required (system, features): (aarch64-linux, [])33071 available machines:3308(systems, maxjobs, supportedFeatures, mandatoryFeatures)3309([aarch64-darwin, x86_64-darwin], 8, [big-parallel, recursive-nix], [])3310Failed to find a machine for remote build!3311derivation: 5mcpi4kiqmlbzxgsy06cmd4nvzdgwg6p-nix-util-tests-run-without-new-syscalls.drv3312required (system, features): (aarch64-linux, [])33131 available machines:3314(systems, maxjobs, supportedFeatures, mandatoryFeatures)3315([aarch64-darwin, x86_64-darwin], 8, [big-parallel, recursive-nix], [])3316Failed to find a machine for remote build!3317derivation: 6q3zb9wnm8bk94jxzyrdiy11p5lp9mar-nix-util-tests-run.drv3318required (system, features): (aarch64-linux, [])33191 available machines:3320(systems, maxjobs, supportedFeatures, mandatoryFeatures)3321([aarch64-darwin, x86_64-darwin], 8, [big-parallel, recursive-nix], [])3322error: Cannot build '/nix/store/5mcpi4kiqmlbzxgsy06cmd4nvzdgwg6p-nix-util-tests-run-without-new-syscalls.drv'.3323 Reason: builder failed with exit code 1.3324 Output paths:3325 /nix/store/pxkx355bpxvr2ydf1jbww4816r4xh6w6-nix-util-tests-run-without-new-syscalls3326 Last 25 log lines:3327 > [ RUN ] Unix/UrlPathTest.urlToString/absolute_path3328 > [ OK ] Unix/UrlPathTest.urlToString/absolute_path (0 ms)3329 > [ RUN ] Unix/UrlPathTest.urlToString/root_path3330 > [ OK ] Unix/UrlPathTest.urlToString/root_path (0 ms)3331 > [ RUN ] Unix/UrlPathTest.stringToUrl/absolute_path3332 > [ OK ] Unix/UrlPathTest.stringToUrl/absolute_path (0 ms)3333 > [ RUN ] Unix/UrlPathTest.stringToUrl/root_path3334 > [ OK ] Unix/UrlPathTest.stringToUrl/root_path (0 ms)3335 > [----------] 8 tests from Unix/UrlPathTest (0 ms total)3336 >3337 > [----------] Global test environment tear-down3338 > [==========] 818 tests from 156 test suites ran. (3186 ms total)3339 > [ PASSED ] 812 tests.3340 > [ SKIPPED ] 1 test, listed below:3341 > [ SKIPPED ] CompressionDecompression/CompressionDecompressionTest.invalidDecompression/none3342 > [ FAILED ] 5 tests, listed below:3343 > [ FAILED ] ParseURLSuccessCases/ParseURLSuccess.parsesAsExpected/5, where GetParam() = 288-byte object <31-00 00-00 00-00 00-00 10-BE E4-AA AA-AA 00-00 00-B1 FF-AA AA-AA 00-00 04-00 00-00 00-00 00-00 68-74 74-70 00-68 74-74 70-73 00-00 00-00 00-00 02-00 00-00 00-00 00-00 10-FC FE-AA AA-AA 00-00 ... 00-00 00-00 00-00 00-00 B8-B1 FF-AA AA-AA 00-00 B8-B1 FF-AA AA-AA 00-00 00-00 00-00 00-00 00-00 F0-B1 FF-AA AA-AA 00-00 00-00 00-00 00-00 00-00 00-65 6C-6C 6F-00 00-00 E8-B1 FF-AA AA-AA 00-00>3344 > [ FAILED ] ParseURLSuccessCases/ParseURLSuccess.toStringRoundTrips/5, where GetParam() = 288-byte object <31-00 00-00 00-00 00-00 10-BE E4-AA AA-AA 00-00 00-B1 FF-AA AA-AA 00-00 04-00 00-00 00-00 00-00 68-74 74-70 00-68 74-74 70-73 00-00 00-00 00-00 02-00 00-00 00-00 00-00 60-1B 00-AB AA-AA 00-00 ... 00-00 00-00 00-00 00-00 B8-B1 FF-AA AA-AA 00-00 B8-B1 FF-AA AA-AA 00-00 00-00 00-00 00-00 00-00 F0-B1 FF-AA AA-AA 00-00 00-00 00-00 00-00 00-00 00-65 6C-6C 6F-00 00-00 E8-B1 FF-AA AA-AA 00-00>3345 > [ FAILED ] ParseURLSuccessCases/ParseURLSuccess.makeSureFixGitURLDoesNotModify/5, where GetParam() = 288-byte object <31-00 00-00 00-00 00-00 10-BE E4-AA AA-AA 00-00 00-B1 FF-AA AA-AA 00-00 04-00 00-00 00-00 00-00 68-74 74-70 00-68 74-74 70-73 00-00 00-00 00-00 02-00 00-00 00-00 00-00 C0-3F 00-AB AA-AA 00-00 ... 00-00 00-00 00-00 00-00 B8-B1 FF-AA AA-AA 00-00 B8-B1 FF-AA AA-AA 00-00 00-00 00-00 00-00 00-00 F0-B1 FF-AA AA-AA 00-00 00-00 00-00 00-00 00-00 00-65 6C-6C 6F-00 00-00 E8-B1 FF-AA AA-AA 00-00>3346 > [ FAILED ] parseURLRelative/ParseURLRelativeTestSuite.resolve/resolvesRelativePathIpv6AddressWithZoneId, where GetParam() = 336-byte object <3F-00 00-00 00-00 00-00 D8-C9 E4-AA AA-AA 00-00 10-00 00-00 00-00 00-00 18-CA E4-AA AA-AA 00-00 E0-4D FF-AA AA-AA 00-00 04-00 00-00 00-00 00-00 68-74 74-70 00-00 00-00 01-00 00-00 00-00 00-00 ... D0-4E FF-AA AA-AA 00-00 00-00 00-00 00-00 00-00 00-4E FF-AA AA-AA 00-00 00-00 00-00 00-00 00-00 A0-5E 00-AB AA-AA 00-00 29-00 00-00 00-00 00-00 29-00 00-00 00-00 00-00 30-96 FE-AA AA-AA 00-00>3347 > [ FAILED ] parseURLRelative/ParseURLRelativeTestSuite.resolve/absOverrideWithZoneId, where GetParam() = 336-byte object <21-00 00-00 00-00 00-00 18-CC E4-AA AA-AA 00-00 3C-00 00-00 00-00 00-00 80-CC E4-AA AA-AA 00-00 E0-4D FF-AA AA-AA 00-00 05-00 00-00 00-00 00-00 68-74 74-70 73-00 00-00 01-00 00-00 00-00 00-00 ... D0-4E FF-AA AA-AA 00-00 00-00 00-00 00-00 00-00 00-72 61-67 00-AA 00-00 00-00 00-00 00-00 00-00 10-2A 00-AB AA-AA 00-00 15-00 00-00 00-00 00-00 15-00 00-00 00-00 00-00 69-64 65-00 AA-AA 00-00>3348 >3349 > 5 FAILED TESTS3350 > YOU HAVE 1 DISABLED TEST3351 >3352 For full logs, run:3353 nix log /nix/store/5mcpi4kiqmlbzxgsy06cmd4nvzdgwg6p-nix-util-tests-run-without-new-syscalls.drv3354error: Cannot build '/nix/store/6q3zb9wnm8bk94jxzyrdiy11p5lp9mar-nix-util-tests-run.drv'.3355 Reason: builder failed with exit code 1.3356 Output paths:3357 /nix/store/5db70ilwhx6idi37gbf7q10njvwcxzx5-nix-util-tests-run3358 Last 25 log lines:3359 > [ RUN ] Unix/UrlPathTest.urlToString/absolute_path3360 > [ OK ] Unix/UrlPathTest.urlToString/absolute_path (0 ms)3361 > [ RUN ] Unix/UrlPathTest.urlToString/root_path3362 > [ OK ] Unix/UrlPathTest.urlToString/root_path (0 ms)3363 > [ RUN ] Unix/UrlPathTest.stringToUrl/absolute_path3364 > [ OK ] Unix/UrlPathTest.stringToUrl/absolute_path (0 ms)3365 > [ RUN ] Unix/UrlPathTest.stringToUrl/root_path3366 > [ OK ] Unix/UrlPathTest.stringToUrl/root_path (0 ms)3367 > [----------] 8 tests from Unix/UrlPathTest (0 ms total)3368 >3369 > [----------] Global test environment tear-down3370 > [==========] 818 tests from 156 test suites ran. (3276 ms total)3371 > [ PASSED ] 812 tests.3372 > [ SKIPPED ] 1 test, listed below:3373 > [ SKIPPED ] CompressionDecompression/CompressionDecompressionTest.invalidDecompression/none3374 > [ FAILED ] 5 tests, listed below:3375 > [ FAILED ] ParseURLSuccessCases/ParseURLSuccess.parsesAsExpected/5, where GetParam() = 288-byte object <31-00 00-00 00-00 00-00 10-BE E4-AA AA-AA 00-00 00-B1 FF-AA AA-AA 00-00 04-00 00-00 00-00 00-00 68-74 74-70 00-68 74-74 70-73 00-00 00-00 00-00 02-00 00-00 00-00 00-00 10-FC FE-AA AA-AA 00-00 ... 00-00 00-00 00-00 00-00 B8-B1 FF-AA AA-AA 00-00 B8-B1 FF-AA AA-AA 00-00 00-00 00-00 00-00 00-00 F0-B1 FF-AA AA-AA 00-00 00-00 00-00 00-00 00-00 00-65 6C-6C 6F-00 00-00 E8-B1 FF-AA AA-AA 00-00>3376 > [ FAILED ] ParseURLSuccessCases/ParseURLSuccess.toStringRoundTrips/5, where GetParam() = 288-byte object <31-00 00-00 00-00 00-00 10-BE E4-AA AA-AA 00-00 00-B1 FF-AA AA-AA 00-00 04-00 00-00 00-00 00-00 68-74 74-70 00-68 74-74 70-73 00-00 00-00 00-00 02-00 00-00 00-00 00-00 60-1B 00-AB AA-AA 00-00 ... 00-00 00-00 00-00 00-00 B8-B1 FF-AA AA-AA 00-00 B8-B1 FF-AA AA-AA 00-00 00-00 00-00 00-00 00-00 F0-B1 FF-AA AA-AA 00-00 00-00 00-00 00-00 00-00 00-65 6C-6C 6F-00 00-00 E8-B1 FF-AA AA-AA 00-00>3377 > [ FAILED ] ParseURLSuccessCases/ParseURLSuccess.makeSureFixGitURLDoesNotModify/5, where GetParam() = 288-byte object <31-00 00-00 00-00 00-00 10-BE E4-AA AA-AA 00-00 00-B1 FF-AA AA-AA 00-00 04-00 00-00 00-00 00-00 68-74 74-70 00-68 74-74 70-73 00-00 00-00 00-00 02-00 00-00 00-00 00-00 C0-3F 00-AB AA-AA 00-00 ... 00-00 00-00 00-00 00-00 B8-B1 FF-AA AA-AA 00-00 B8-B1 FF-AA AA-AA 00-00 00-00 00-00 00-00 00-00 F0-B1 FF-AA AA-AA 00-00 00-00 00-00 00-00 00-00 00-65 6C-6C 6F-00 00-00 E8-B1 FF-AA AA-AA 00-00>3378 > [ FAILED ] parseURLRelative/ParseURLRelativeTestSuite.resolve/resolvesRelativePathIpv6AddressWithZoneId, where GetParam() = 336-byte object <3F-00 00-00 00-00 00-00 D8-C9 E4-AA AA-AA 00-00 10-00 00-00 00-00 00-00 18-CA E4-AA AA-AA 00-00 E0-4D FF-AA AA-AA 00-00 04-00 00-00 00-00 00-00 68-74 74-70 00-00 00-00 01-00 00-00 00-00 00-00 ... D0-4E FF-AA AA-AA 00-00 00-00 00-00 00-00 00-00 00-4E FF-AA AA-AA 00-00 00-00 00-00 00-00 00-00 A0-5E 00-AB AA-AA 00-00 29-00 00-00 00-00 00-00 29-00 00-00 00-00 00-00 30-96 FE-AA AA-AA 00-00>3379 > [ FAILED ] parseURLRelative/ParseURLRelativeTestSuite.resolve/absOverrideWithZoneId, where GetParam() = 336-byte object <21-00 00-00 00-00 00-00 18-CC E4-AA AA-AA 00-00 3C-00 00-00 00-00 00-00 80-CC E4-AA AA-AA 00-00 E0-4D FF-AA AA-AA 00-00 05-00 00-00 00-00 00-00 68-74 74-70 73-00 00-00 01-00 00-00 00-00 00-00 ... D0-4E FF-AA AA-AA 00-00 00-00 00-00 00-00 00-00 00-72 61-67 00-AA 00-00 00-00 00-00 00-00 00-00 10-2A 00-AB AA-AA 00-00 15-00 00-00 00-00 00-00 15-00 00-00 00-00 00-00 69-64 65-00 AA-AA 00-00>3380 >3381 > 5 FAILED TESTS3382 > YOU HAVE 1 DISABLED TEST3383 >3384 For full logs, run:3385 nix log /nix/store/6q3zb9wnm8bk94jxzyrdiy11p5lp9mar-nix-util-tests-run.drv3386Failed to find a machine for remote build!3387derivation: 28bfpp0spq44sjxyrb9lvk0wviq4w8n3-harmonia-3.2.0.drv3388required (system, features): (aarch64-linux, [])33891 available machines:3390(systems, maxjobs, supportedFeatures, mandatoryFeatures)3391([aarch64-darwin, x86_64-darwin], 8, [big-parallel, recursive-nix], [])3392Failed to find a machine for remote build!3393derivation: b9da3r70g1c44z3pjx90hf4csgbwb7p5-nix-expr-c-2.36.0pre.drv3394required (system, features): (aarch64-linux, [])33951 available machines:3396(systems, maxjobs, supportedFeatures, mandatoryFeatures)3397([aarch64-darwin, x86_64-darwin], 8, [big-parallel, recursive-nix], [])3398Failed to find a machine for remote build!3399derivation: f5hrvwd60mk96kldds6rkgch4rmnxpcw-nix-flake-2.36.0pre.drv3400required (system, features): (aarch64-linux, [])34011 available machines:3402(systems, maxjobs, supportedFeatures, mandatoryFeatures)3403([aarch64-darwin, x86_64-darwin], 8, [big-parallel, recursive-nix], [])3404Failed to find a machine for remote build!3405derivation: 4s9qm0rcij04b53zs25xqn394i2wd01m-nix-main-2.36.0pre.drv3406required (system, features): (aarch64-linux, [])34071 available machines:3408(systems, maxjobs, supportedFeatures, mandatoryFeatures)3409([aarch64-darwin, x86_64-darwin], 8, [big-parallel, recursive-nix], [])3410Failed to find a machine for remote build!3411derivation: fkgf79wmx2kbl4p6ng7ix3jplwa3nky8-nix-main-c-2.36.0pre.drv3412required (system, features): (aarch64-linux, [])34131 available machines:3414(systems, maxjobs, supportedFeatures, mandatoryFeatures)3415([aarch64-darwin, x86_64-darwin], 8, [big-parallel, recursive-nix], [])3416Failed to find a machine for remote build!3417derivation: z1yr8xvgz01066clvm7haz4dnbjd4y5m-nix-fetchers-c-2.36.0pre.drv3418required (system, features): (aarch64-linux, [])34191 available machines:3420(systems, maxjobs, supportedFeatures, mandatoryFeatures)3421([aarch64-darwin, x86_64-darwin], 8, [big-parallel, recursive-nix], [])3422Failed to find a machine for remote build!3423derivation: pc6agdihjn3n2dg3jv5ch102w8h2hpfd-nix-util-test-support-2.36.0pre.drv3424required (system, features): (aarch64-linux, [])34251 available machines:3426(systems, maxjobs, supportedFeatures, mandatoryFeatures)3427([aarch64-darwin, x86_64-darwin], 8, [big-parallel, recursive-nix], [])3428Failed to find a machine for remote build!3429derivation: 6b69l6iih0v29j60kzbkja2jmyz8kzxk-nix-cmd-2.36.0pre.drv3430required (system, features): (aarch64-linux, [])34311 available machines:3432(systems, maxjobs, supportedFeatures, mandatoryFeatures)3433([aarch64-darwin, x86_64-darwin], 8, [big-parallel, recursive-nix], [])3434Failed to find a machine for remote build!3435derivation: g9jkzzf3cyqg0jm0mwh0xkcbi8pyjqgx-nix-fetchers-tests-2.36.0pre.drv3436required (system, features): (aarch64-linux, [])34371 available machines:3438(systems, maxjobs, supportedFeatures, mandatoryFeatures)3439([aarch64-darwin, x86_64-darwin], 8, [big-parallel, recursive-nix], [])3440Failed to find a machine for remote build!3441derivation: crq9bc61sdcz9sj6rvg2r3fdgci1xzyb-nix-flake-c-2.36.0pre.drv3442required (system, features): (aarch64-linux, [])34431 available machines:3444(systems, maxjobs, supportedFeatures, mandatoryFeatures)3445([aarch64-darwin, x86_64-darwin], 8, [big-parallel, recursive-nix], [])3446Failed to find a machine for remote build!3447derivation: jyk37vq24szhhks3y6gwxdaircn6clxw-nix-expr-tests-2.36.0pre.drv3448required (system, features): (aarch64-linux, [])34491 available machines:3450(systems, maxjobs, supportedFeatures, mandatoryFeatures)3451([aarch64-darwin, x86_64-darwin], 8, [big-parallel, recursive-nix], [])3452Failed to find a machine for remote build!3453derivation: xrq386nqh3142c2f0sa9y5jcwnc349ws-nix-flake-tests-2.36.0pre.drv3454required (system, features): (aarch64-linux, [])34551 available machines:3456(systems, maxjobs, supportedFeatures, mandatoryFeatures)3457([aarch64-darwin, x86_64-darwin], 8, [big-parallel, recursive-nix], [])3458Failed to find a machine for remote build!3459derivation: 5aialp11ip2zk74ivf8b7gv6rpvzwsas-nix-2.36.0pre20260916_1de45ba.drv3460required (system, features): (aarch64-linux, [])34611 available machines:3462(systems, maxjobs, supportedFeatures, mandatoryFeatures)3463([aarch64-darwin, x86_64-darwin], 8, [big-parallel, recursive-nix], [])3464Failed to find a machine for remote build!3465derivation: afpayj8yyh50vw437anfwnj01lva23i8-nix-fetchers-tests-run.drv3466required (system, features): (aarch64-linux, [])34671 available machines:3468(systems, maxjobs, supportedFeatures, mandatoryFeatures)3469([aarch64-darwin, x86_64-darwin], 8, [big-parallel, recursive-nix], [])3470Failed to find a machine for remote build!3471derivation: q79aqf02pnqnq4y8pmy0ifab4hxiz2h4-nix-flake-tests-run.drv3472required (system, features): (aarch64-linux, [])34731 available machines:3474(systems, maxjobs, supportedFeatures, mandatoryFeatures)3475([aarch64-darwin, x86_64-darwin], 8, [big-parallel, recursive-nix], [])3476Failed to find a machine for remote build!3477derivation: fx3swbxbq1vd6kvs2rps48a9f6iixq4f-nix-store-tests-run.drv3478required (system, features): (aarch64-linux, [])34791 available machines:3480(systems, maxjobs, supportedFeatures, mandatoryFeatures)3481([aarch64-darwin, x86_64-darwin], 8, [big-parallel, recursive-nix], [])3482Failed to find a machine for remote build!3483derivation: fb0dlygc8bhj1hs0y9z4clqr097d1lfd-nix-expr-tests-run.drv3484required (system, features): (aarch64-linux, [])34851 available machines:3486(systems, maxjobs, supportedFeatures, mandatoryFeatures)3487([aarch64-darwin, x86_64-darwin], 8, [big-parallel, recursive-nix], [])3488error: Cannot build '/nix/store/fx3swbxbq1vd6kvs2rps48a9f6iixq4f-nix-store-tests-run.drv'.3489 Reason: builder failed with exit code 1.3490 Output paths:3491 /nix/store/82zir9q4m1jz6lzp3ldcsx2078azd8zw-nix-store-tests-run3492 Last 25 log lines:3493 > [ OK ] S3ToHttpsConversion/S3ToHttpsConversionTest.ConvertsCorrectly/dotted_bucket_with_auto_style_custom_endpoint (0 ms)3494 > [----------] 13 tests from S3ToHttpsConversion/S3ToHttpsConversionTest (0 ms total)3495 >3496 > [----------] 5 tests from S3ToHttpsConversionErrors/S3ToHttpsConversionErrorTest3497 > [ RUN ] S3ToHttpsConversionErrors/S3ToHttpsConversionErrorTest.ThrowsOnConversion/virtual_style_with_empty_host_authority3498 > [ OK ] S3ToHttpsConversionErrors/S3ToHttpsConversionErrorTest.ThrowsOnConversion/virtual_style_with_empty_host_authority (0 ms)3499 > [ RUN ] S3ToHttpsConversionErrors/S3ToHttpsConversionErrorTest.ThrowsOnConversion/dotted_bucket_with_explicit_virtual_style3500 > [ OK ] S3ToHttpsConversionErrors/S3ToHttpsConversionErrorTest.ThrowsOnConversion/dotted_bucket_with_explicit_virtual_style (0 ms)3501 > [ RUN ] S3ToHttpsConversionErrors/S3ToHttpsConversionErrorTest.ThrowsOnConversion/dotted_bucket_with_explicit_virtual_style_multi_dot3502 > [ OK ] S3ToHttpsConversionErrors/S3ToHttpsConversionErrorTest.ThrowsOnConversion/dotted_bucket_with_explicit_virtual_style_multi_dot (0 ms)3503 > [ RUN ] S3ToHttpsConversionErrors/S3ToHttpsConversionErrorTest.ThrowsOnConversion/dotted_bucket_with_explicit_virtual_style_custom_authority3504 > [ OK ] S3ToHttpsConversionErrors/S3ToHttpsConversionErrorTest.ThrowsOnConversion/dotted_bucket_with_explicit_virtual_style_custom_authority (0 ms)3505 > [ RUN ] S3ToHttpsConversionErrors/S3ToHttpsConversionErrorTest.ThrowsOnConversion/dotted_bucket_with_explicit_virtual_style_full_endpoint_url3506 > [ OK ] S3ToHttpsConversionErrors/S3ToHttpsConversionErrorTest.ThrowsOnConversion/dotted_bucket_with_explicit_virtual_style_full_endpoint_url (0 ms)3507 > [----------] 5 tests from S3ToHttpsConversionErrors/S3ToHttpsConversionErrorTest (0 ms total)3508 >3509 > [----------] Global test environment tear-down3510 > [==========] 798 tests from 90 test suites ran. (1730 ms total)3511 > [ PASSED ] 797 tests.3512 > [ FAILED ] 1 test, listed below:3513 > [ FAILED ] StoreReferenceTest.PathInfo_ssh_unbracketed_ipv6_5_from_uri3514 >3515 > 1 FAILED TEST3516 > YOU HAVE 1 DISABLED TEST3517 >3518 For full logs, run:3519 nix log /nix/store/fx3swbxbq1vd6kvs2rps48a9f6iixq4f-nix-store-tests-run.drv3520Failed to find a machine for remote build!3521derivation: 7hc9icbm8dwnq0saky68dz0b5w8zksyd-nix-functional-tests-2.36.0pre20260916_1de45ba.drv3522required (system, features): (aarch64-linux, [])35231 available machines:3524(systems, maxjobs, supportedFeatures, mandatoryFeatures)3525([aarch64-darwin, x86_64-darwin], 8, [big-parallel, recursive-nix], [])3526Failed to find a machine for remote build!3527derivation: kg5xz47s1c2amd9cs9arvk2kax906rhf-nix-manual-2.36.0pre20260916_1de45ba.drv3528required (system, features): (aarch64-linux, [])35291 available machines:3530(systems, maxjobs, supportedFeatures, mandatoryFeatures)3531([aarch64-darwin, x86_64-darwin], 8, [big-parallel, recursive-nix], [])3532error: Cannot build '/nix/store/qmlqxiikrb6vsri0cb8mcj237m4fk3fr-nix-2.36.0pre20260916_1de45ba.drv'.3533 Reason: 3 dependencies failed.3534 Output paths:3535 /nix/store/8d6n4m6fdmc614hc1aycd4d7ac1w7pk5-nix-2.36.0pre20260916_1de45ba-dev3536 /nix/store/b0ilbgmspv3x8ax5sw9fd65xv7mx1vmq-nix-2.36.0pre20260916_1de45ba3537 /nix/store/j674wcn8mhqwlhbd244ny8q3v5rpzdl2-nix-2.36.0pre20260916_1de45ba-man3538 /nix/store/kzdv25x03z5l1wikw0x8rrmsdk9j6i47-nix-2.36.0pre20260916_1de45ba-doc3539error: Cannot build '/nix/store/p4xg9n5v9q8cla23zq2ax07wawkdnyar-nix.conf.drv'.3540 Reason: 1 dependency failed.3541 Output paths:3542 /nix/store/76nnd4b28zzn03981xzhpbwa2zsz1sm2-nix.conf3543error: Cannot build '/nix/store/xz06k0rbbmkyv2g2qy3s9cvg43lkzh7w-nixos-option-26.11.drv'.3544 Reason: 1 dependency failed.3545 Output paths:3546 /nix/store/7ycvi2bv8dj9ik2fgkl2ck4zql3d4sn6-nixos-option-26.113547error: Cannot build '/nix/store/2r2l9v3c0g9c3mm6f6mbf1h62ymyh1l0-nixos-rebuild-ng-26.11.drv'.3548 Reason: 1 dependency failed.3549 Output paths:3550 /nix/store/scqd8g8gjhzd65rrd25j9ngp6yg3m88l-nixos-rebuild-ng-26.11-dist3551 /nix/store/v1lglc7364wssgjfmsn17rg2nmk1vg6c-nixos-rebuild-ng-26.113552error: Cannot build '/nix/store/vcfsfbbr1qwnh249n7avwv7vgin4lgc6-system-generators.drv'.3553 Reason: 1 dependency failed.3554 Output paths:3555 /nix/store/lj7d2jqw4gd569nw3i7nc01bwg9h2ca2-system-generators3556error: Cannot build '/nix/store/d581i8dhhg7phd9pf7gymhmw9f81krwy-system-shutdown.drv'.3557 Reason: 1 dependency failed.3558 Output paths:3559 /nix/store/q77k43v8ivmlif07irpdww6w2qf1lc62-system-shutdown3560error: Cannot build '/nix/store/z39w87ar8z55npczp5nd8nrarpiv1qpb-tmpfiles.d.drv'.3561 Reason: 1 dependency failed.3562 Output paths:3563 /nix/store/rwvxpw1ipi2zv0bnv12b06fzrkf89s92-tmpfiles.d3564error: Cannot build '/nix/store/k9hafjdywkhb3acbjajalsi7z9pjj84w-unit-harmonia-gc.service.drv'.3565 Reason: 1 dependency failed.3566 Output paths:3567 /nix/store/j3js1iw7x16hh5wghli9khy3i06gn7ii-unit-harmonia-gc.service3568error: Cannot build '/nix/store/mx9igk4kxyf20ncp6y1sswgjwagkswyw-unit-nix-optimise.service.drv'.3569 Reason: 1 dependency failed.3570 Output paths:3571 /nix/store/ypvhwn8ikx2c5k4fi4zmcxib4d7viakr-unit-nix-optimise.service3572error: Cannot build '/nix/store/65mvy3schxn3mc4nxiwmd9vjdf758dyf-unit-script-nix-gc-start.drv'.3573 Reason: 1 dependency failed.3574 Output paths:3575 /nix/store/w4ghlzjcvhixyfcs8na2j78bniccxshq-unit-script-nix-gc-start3576error: Cannot build '/nix/store/88yalfjhg7yiyjzd33rlwmkf0vr4lacw-unit-script-update-prefetch-start.drv'.3577 Reason: 1 dependency failed.3578 Output paths:3579 /nix/store/qcpbl42sin0q05wr2q2r5rz0m7fgqbl4-unit-script-update-prefetch-start3580error: Cannot build '/nix/store/7g4hnhvygsb9jlvxkx249ii8lwnlmnl3-user-generators.drv'.3581 Reason: 1 dependency failed.3582 Output paths:3583 /nix/store/fcr7iv26s6f290rzxns5nb2lqn3xvhjm-user-generators3584error: Cannot build '/nix/store/0x7vxzkf6kb6zfwq81c4ssazgyz571ss-X-Restart-Triggers-nix-daemon.drv'.3585 Reason: 1 dependency failed.3586 Output paths:3587 /nix/store/b67m4c76hhwq89c3x1k6h3n9w5rd0gq1-X-Restart-Triggers-nix-daemon3588error: Cannot build '/nix/store/731i613npk6a37zn77lm3wpyin80s9a2-X-Restart-Triggers-systemd-tmpfiles-resetup.drv'.3589 Reason: 1 dependency failed.3590 Output paths:3591 /nix/store/yjhpyf4hs5r00qpr6641hn8v5gxp4p8p-X-Restart-Triggers-systemd-tmpfiles-resetup3592error: Cannot build '/nix/store/0ygj624cw1dz25my4l0w1w6cxhfqwab4-system-path.drv'.3593 Reason: 3 dependencies failed.3594 Output paths:3595 /nix/store/f5nwjjz2013xv0vg1941fa0iamc3p53w-system-path3596error: Cannot build '/nix/store/2ah8szbzvqv3zdz1a1bg3hvpyqr5x3n7-unit-nix-gc.service.drv'.3597 Reason: 1 dependency failed.3598 Output paths:3599 /nix/store/qk19912va7gb426nzxdc8zcfa9nqaal3-unit-nix-gc.service3600error: Cannot build '/nix/store/2my3lfhshmz0jjpa2mm3j2qsyiqcb7pd-unit-update-prefetch.service.drv'.3601 Reason: 1 dependency failed.3602 Output paths:3603 /nix/store/qh5kmp3bmq5x1gz40qm0wprqgd9wipl8-unit-update-prefetch.service3604error: Cannot build '/nix/store/q4f0c3nicc6rmkgrd8yrc5aqqi2kq4hc-dbus-1.drv'.3605 Reason: 1 dependency failed.3606 Output paths:3607 /nix/store/rhnvy749c99vy1khvylzw9agjnbp8ix2-dbus-13608error: Cannot build '/nix/store/w7ivg8irvi05bw4sjd90akqq8rn4mxlz-unit-nix-daemon.service.drv'.3609 Reason: 2 dependencies failed.3610 Output paths:3611 /nix/store/hiizyrbv3la66awiwa5wvlf69wj05llx-unit-nix-daemon.service3612error: Cannot build '/nix/store/ijasln8n5ck28swhhqvqaak8sg68ziz6-unit-systemd-tmpfiles-resetup.service.drv'.3613 Reason: 1 dependency failed.3614 Output paths:3615 /nix/store/5iim6msbnnyq26240n0w3a60x0g9sx6c-unit-systemd-tmpfiles-resetup.service3616error: Cannot build '/nix/store/fyc5ykjmyx57j12sdzs6f5c2hldg0qpw-X-Restart-Triggers-dbus-broker.drv'.3617 Reason: 1 dependency failed.3618 Output paths:3619 /nix/store/7cd6ai82j865lhcph42r36mzb88vfyqg-X-Restart-Triggers-dbus-broker3620error: Cannot build '/nix/store/2gl7ib4c6dh095g0l6r3bm816a0p4dpq-unit-dbus-broker.service.drv'.3621 Reason: 1 dependency failed.3622 Output paths:3623 /nix/store/ga9mns35ij3rvcgbjrhq5zvxvly5c8c2-unit-dbus-broker.service3624error: Cannot build '/nix/store/i35xhw11f0abrc2pr4k7n0w9w48f9x01-unit-dbus-broker.service.drv'.3625 Reason: 1 dependency failed.3626 Output paths:3627 /nix/store/m5qvmy4vbdkgyygvl2jqv4l9cbf40z0s-unit-dbus-broker.service3628error: Cannot build '/nix/store/24prisin3fb83kcbqg8l7mwqvslb2jqq-system-units.drv'.3629 Reason: 8 dependencies failed.3630 Output paths:3631 /nix/store/5s6kikhxj2xq8wbhrq9dddzw3md9bhqc-system-units3632error: Cannot build '/nix/store/gixg0cj2bxzl2x7bc7ah2bg862abrsmx-user-units.drv'.3633 Reason: 2 dependencies failed.3634 Output paths:3635 /nix/store/sw7vmnbqygz0pss8af2l4gz8gniljj08-user-units3636error: Cannot build '/nix/store/6i1w7jqy4c29p6kh7yzmg33ab35akmgv-etc.drv'.3637 Reason: 9 dependencies failed.3638 Output paths:3639 /nix/store/1390p18gcld5mrbcb9drvklw04cxkv0g-etc3640error: Cannot build '/nix/store/m7zj64vs78hicf8n39sl6h2illrhcbcl-activate.drv'.3641 Reason: 1 dependency failed.3642 Output paths:3643 /nix/store/31r5gjy84znvpw41rxqpjh8f6fpycs1y-activate3644error: Cannot build '/nix/store/pr9mvr9m40b88pij8k9ig5g2bbbp77nn-nixos-system-blob64-26.11.20260917.397d52b.drv'.3645 Reason: 3 dependencies failed.3646 Output paths:3647 /nix/store/96g5zkih6z4djpd00yc6svwbrk22s9ms-nixos-system-blob64-26.11.20260917.397d52b