setup
checks.aarch64-linux.nixos-blob64
· build #607
· raw
1these 40 derivations will be built:2 /nix/store/5mcpi4kiqmlbzxgsy06cmd4nvzdgwg6p-nix-util-tests-run-without-new-syscalls.drv3 /nix/store/6q3zb9wnm8bk94jxzyrdiy11p5lp9mar-nix-util-tests-run.drv4 /nix/store/fx3swbxbq1vd6kvs2rps48a9f6iixq4f-nix-store-tests-run.drv5 /nix/store/qmlqxiikrb6vsri0cb8mcj237m4fk3fr-nix-2.36.0pre20260916_1de45ba.drv6 /nix/store/65mvy3schxn3mc4nxiwmd9vjdf758dyf-unit-script-nix-gc-start.drv7 /nix/store/2ah8szbzvqv3zdz1a1bg3hvpyqr5x3n7-unit-nix-gc.service.drv8 /nix/store/88yalfjhg7yiyjzd33rlwmkf0vr4lacw-unit-script-update-prefetch-start.drv9 /nix/store/2my3lfhshmz0jjpa2mm3j2qsyiqcb7pd-unit-update-prefetch.service.drv10 /nix/store/ckpfkclih450kdii8ywalpwglisqky3n-config.json.drv11 /nix/store/kwa2bzmvmh94yd4ld8nwzic6ii420shi-unit-script-radicle-node-setup-start.drv12 /nix/store/8qg2qbdkz5ln51amjsqqjrq9ywbq4yzs-unit-radicle-node-setup.service.drv13 /nix/store/z39w87ar8z55npczp5nd8nrarpiv1qpb-tmpfiles.d.drv14 /nix/store/731i613npk6a37zn77lm3wpyin80s9a2-X-Restart-Triggers-systemd-tmpfiles-resetup.drv15 /nix/store/ijasln8n5ck28swhhqvqaak8sg68ziz6-unit-systemd-tmpfiles-resetup.service.drv16 /nix/store/k9hafjdywkhb3acbjajalsi7z9pjj84w-unit-harmonia-gc.service.drv17 /nix/store/mfrr6yyic6dmy0bpb78hnr1xbvsi78r5-unit-radicle-auto-seed.service.drv18 /nix/store/mx9igk4kxyf20ncp6y1sswgjwagkswyw-unit-nix-optimise.service.drv19 /nix/store/89yfa5lgdshfbdh8wxfnpf2myi6i0jdh-flake-inputs.prom.drv20 /nix/store/4w6d51a60zqfl3ayvm8y8vgv38k0h110-config.toml.drv21 /nix/store/rblzl74wnlkzl0lax7h4z7x6ipghnjn0-unit-telegraf.service.drv22 /nix/store/s6bjlg8dp8r1p36ivxch8j11ri0b3h8m-unit-radicle-node.service.drv23 /nix/store/2r2l9v3c0g9c3mm6f6mbf1h62ymyh1l0-nixos-rebuild-ng-26.11.drv24 /nix/store/xz06k0rbbmkyv2g2qy3s9cvg43lkzh7w-nixos-option-26.11.drv25 /nix/store/cd57i5hawmglgisizxswixsmbn7rsmf7-system-path.drv26 /nix/store/k8lv0vsilinny0zm2f8b9xk6ir6j96z9-dbus-1.drv27 /nix/store/63jl2965r009a8jm52lrmxdcbj4y7p0q-X-Restart-Triggers-dbus-broker.drv28 /nix/store/vv45lfhpkf6c2q5wfswccn0makw3yx02-unit-dbus-broker.service.drv29 /nix/store/p4xg9n5v9q8cla23zq2ax07wawkdnyar-nix.conf.drv30 /nix/store/0x7vxzkf6kb6zfwq81c4ssazgyz571ss-X-Restart-Triggers-nix-daemon.drv31 /nix/store/w7ivg8irvi05bw4sjd90akqq8rn4mxlz-unit-nix-daemon.service.drv32 /nix/store/0i32kxg94khml6ygs8aw2mxfzmak5m23-system-units.drv33 /nix/store/f2wy6r670bf25w42rg1nwq2d8zh2jvva-unit-dbus-broker.service.drv34 /nix/store/6i88q8ik489fbmi8wk3maz493gsm31kh-user-units.drv35 /nix/store/7g4hnhvygsb9jlvxkx249ii8lwnlmnl3-user-generators.drv36 /nix/store/d581i8dhhg7phd9pf7gymhmw9f81krwy-system-shutdown.drv37 /nix/store/v3lx93f8pxigpiwx9686ja4z4mj7lmsw-etc-nix-registry.json.drv38 /nix/store/vcfsfbbr1qwnh249n7avwv7vgin4lgc6-system-generators.drv39 /nix/store/pnqgxajvj2ffg6nfcnzxcb84gzjmvfbm-etc.drv40 /nix/store/s27n2zplaxzqwh6dfxqkzxsgfsy7v3pf-activate.drv41 /nix/store/3i1dl2hi46wya411yfzbndb555zkfc5s-nixos-system-blob64-26.11.20260917.397d52b.drv42Failed to find a machine for remote build!43derivation: fx3swbxbq1vd6kvs2rps48a9f6iixq4f-nix-store-tests-run.drv44required (system, features): (aarch64-linux, [])451 available machines:46(systems, maxjobs, supportedFeatures, mandatoryFeatures)47([aarch64-darwin, x86_64-darwin], 8, [big-parallel, recursive-nix], [])48Failed to find a machine for remote build!49derivation: 5mcpi4kiqmlbzxgsy06cmd4nvzdgwg6p-nix-util-tests-run-without-new-syscalls.drv50required (system, features): (aarch64-linux, [])511 available machines:52(systems, maxjobs, supportedFeatures, mandatoryFeatures)53([aarch64-darwin, x86_64-darwin], 8, [big-parallel, recursive-nix], [])54Failed to find a machine for remote build!55derivation: 6q3zb9wnm8bk94jxzyrdiy11p5lp9mar-nix-util-tests-run.drv56required (system, features): (aarch64-linux, [])571 available machines:58(systems, maxjobs, supportedFeatures, mandatoryFeatures)59([aarch64-darwin, x86_64-darwin], 8, [big-parallel, recursive-nix], [])60error: Cannot build '/nix/store/fx3swbxbq1vd6kvs2rps48a9f6iixq4f-nix-store-tests-run.drv'.61 Reason: builder failed with exit code 1.62 Output paths:63 /nix/store/82zir9q4m1jz6lzp3ldcsx2078azd8zw-nix-store-tests-run64 Last 25 log lines:65 > [ OK ] S3ToHttpsConversion/S3ToHttpsConversionTest.ConvertsCorrectly/dotted_bucket_with_auto_style_custom_endpoint (0 ms)66 > [----------] 13 tests from S3ToHttpsConversion/S3ToHttpsConversionTest (0 ms total)67 >68 > [----------] 5 tests from S3ToHttpsConversionErrors/S3ToHttpsConversionErrorTest69 > [ RUN ] S3ToHttpsConversionErrors/S3ToHttpsConversionErrorTest.ThrowsOnConversion/virtual_style_with_empty_host_authority70 > [ OK ] S3ToHttpsConversionErrors/S3ToHttpsConversionErrorTest.ThrowsOnConversion/virtual_style_with_empty_host_authority (0 ms)71 > [ RUN ] S3ToHttpsConversionErrors/S3ToHttpsConversionErrorTest.ThrowsOnConversion/dotted_bucket_with_explicit_virtual_style72 > [ OK ] S3ToHttpsConversionErrors/S3ToHttpsConversionErrorTest.ThrowsOnConversion/dotted_bucket_with_explicit_virtual_style (0 ms)73 > [ RUN ] S3ToHttpsConversionErrors/S3ToHttpsConversionErrorTest.ThrowsOnConversion/dotted_bucket_with_explicit_virtual_style_multi_dot74 > [ OK ] S3ToHttpsConversionErrors/S3ToHttpsConversionErrorTest.ThrowsOnConversion/dotted_bucket_with_explicit_virtual_style_multi_dot (0 ms)75 > [ RUN ] S3ToHttpsConversionErrors/S3ToHttpsConversionErrorTest.ThrowsOnConversion/dotted_bucket_with_explicit_virtual_style_custom_authority76 > [ OK ] S3ToHttpsConversionErrors/S3ToHttpsConversionErrorTest.ThrowsOnConversion/dotted_bucket_with_explicit_virtual_style_custom_authority (0 ms)77 > [ RUN ] S3ToHttpsConversionErrors/S3ToHttpsConversionErrorTest.ThrowsOnConversion/dotted_bucket_with_explicit_virtual_style_full_endpoint_url78 > [ OK ] S3ToHttpsConversionErrors/S3ToHttpsConversionErrorTest.ThrowsOnConversion/dotted_bucket_with_explicit_virtual_style_full_endpoint_url (0 ms)79 > [----------] 5 tests from S3ToHttpsConversionErrors/S3ToHttpsConversionErrorTest (0 ms total)80 >81 > [----------] Global test environment tear-down82 > [==========] 798 tests from 90 test suites ran. (1716 ms total)83 > [ PASSED ] 797 tests.84 > [ FAILED ] 1 test, listed below:85 > [ FAILED ] StoreReferenceTest.PathInfo_ssh_unbracketed_ipv6_5_from_uri86 >87 > 1 FAILED TEST88 > YOU HAVE 1 DISABLED TEST89 >90 For full logs, run:91 nix log /nix/store/fx3swbxbq1vd6kvs2rps48a9f6iixq4f-nix-store-tests-run.drv92error: Cannot build '/nix/store/5mcpi4kiqmlbzxgsy06cmd4nvzdgwg6p-nix-util-tests-run-without-new-syscalls.drv'.93 Reason: builder failed with exit code 1.94 Output paths:95 /nix/store/pxkx355bpxvr2ydf1jbww4816r4xh6w6-nix-util-tests-run-without-new-syscalls96 Last 25 log lines:97 > [ RUN ] Unix/UrlPathTest.urlToString/absolute_path98 > [ OK ] Unix/UrlPathTest.urlToString/absolute_path (0 ms)99 > [ RUN ] Unix/UrlPathTest.urlToString/root_path100 > [ OK ] Unix/UrlPathTest.urlToString/root_path (0 ms)101 > [ RUN ] Unix/UrlPathTest.stringToUrl/absolute_path102 > [ OK ] Unix/UrlPathTest.stringToUrl/absolute_path (0 ms)103 > [ RUN ] Unix/UrlPathTest.stringToUrl/root_path104 > [ OK ] Unix/UrlPathTest.stringToUrl/root_path (0 ms)105 > [----------] 8 tests from Unix/UrlPathTest (0 ms total)106 >107 > [----------] Global test environment tear-down108 > [==========] 818 tests from 156 test suites ran. (2946 ms total)109 > [ PASSED ] 812 tests.110 > [ SKIPPED ] 1 test, listed below:111 > [ SKIPPED ] CompressionDecompression/CompressionDecompressionTest.invalidDecompression/none112 > [ FAILED ] 5 tests, listed below:113 > [ FAILED ] ParseURLSuccessCases/ParseURLSuccess.parsesAsExpected/5, where GetParam() = 288-byte object <31-00 00-00 00-00 00-00 10-BE E4-AA AA-AA 00-00 00-B1 FF-AA AA-AA 00-00 04-00 00-00 00-00 00-00 68-74 74-70 00-68 74-74 70-73 00-00 00-00 00-00 02-00 00-00 00-00 00-00 10-FC FE-AA AA-AA 00-00 ... 00-00 00-00 00-00 00-00 B8-B1 FF-AA AA-AA 00-00 B8-B1 FF-AA AA-AA 00-00 00-00 00-00 00-00 00-00 F0-B1 FF-AA AA-AA 00-00 00-00 00-00 00-00 00-00 00-65 6C-6C 6F-00 00-00 E8-B1 FF-AA AA-AA 00-00>114 > [ FAILED ] ParseURLSuccessCases/ParseURLSuccess.toStringRoundTrips/5, where GetParam() = 288-byte object <31-00 00-00 00-00 00-00 10-BE E4-AA AA-AA 00-00 00-B1 FF-AA AA-AA 00-00 04-00 00-00 00-00 00-00 68-74 74-70 00-68 74-74 70-73 00-00 00-00 00-00 02-00 00-00 00-00 00-00 60-1B 00-AB AA-AA 00-00 ... 00-00 00-00 00-00 00-00 B8-B1 FF-AA AA-AA 00-00 B8-B1 FF-AA AA-AA 00-00 00-00 00-00 00-00 00-00 F0-B1 FF-AA AA-AA 00-00 00-00 00-00 00-00 00-00 00-65 6C-6C 6F-00 00-00 E8-B1 FF-AA AA-AA 00-00>115 > [ FAILED ] ParseURLSuccessCases/ParseURLSuccess.makeSureFixGitURLDoesNotModify/5, where GetParam() = 288-byte object <31-00 00-00 00-00 00-00 10-BE E4-AA AA-AA 00-00 00-B1 FF-AA AA-AA 00-00 04-00 00-00 00-00 00-00 68-74 74-70 00-68 74-74 70-73 00-00 00-00 00-00 02-00 00-00 00-00 00-00 C0-3F 00-AB AA-AA 00-00 ... 00-00 00-00 00-00 00-00 B8-B1 FF-AA AA-AA 00-00 B8-B1 FF-AA AA-AA 00-00 00-00 00-00 00-00 00-00 F0-B1 FF-AA AA-AA 00-00 00-00 00-00 00-00 00-00 00-65 6C-6C 6F-00 00-00 E8-B1 FF-AA AA-AA 00-00>116 > [ FAILED ] parseURLRelative/ParseURLRelativeTestSuite.resolve/resolvesRelativePathIpv6AddressWithZoneId, where GetParam() = 336-byte object <3F-00 00-00 00-00 00-00 D8-C9 E4-AA AA-AA 00-00 10-00 00-00 00-00 00-00 18-CA E4-AA AA-AA 00-00 E0-4D FF-AA AA-AA 00-00 04-00 00-00 00-00 00-00 68-74 74-70 00-00 00-00 01-00 00-00 00-00 00-00 ... D0-4E FF-AA AA-AA 00-00 00-00 00-00 00-00 00-00 00-4E FF-AA AA-AA 00-00 00-00 00-00 00-00 00-00 A0-5E 00-AB AA-AA 00-00 29-00 00-00 00-00 00-00 29-00 00-00 00-00 00-00 30-96 FE-AA AA-AA 00-00>117 > [ FAILED ] parseURLRelative/ParseURLRelativeTestSuite.resolve/absOverrideWithZoneId, where GetParam() = 336-byte object <21-00 00-00 00-00 00-00 18-CC E4-AA AA-AA 00-00 3C-00 00-00 00-00 00-00 80-CC E4-AA AA-AA 00-00 E0-4D FF-AA AA-AA 00-00 05-00 00-00 00-00 00-00 68-74 74-70 73-00 00-00 01-00 00-00 00-00 00-00 ... D0-4E FF-AA AA-AA 00-00 00-00 00-00 00-00 00-00 00-72 61-67 00-AA 00-00 00-00 00-00 00-00 00-00 10-2A 00-AB AA-AA 00-00 15-00 00-00 00-00 00-00 15-00 00-00 00-00 00-00 69-64 65-00 AA-AA 00-00>118 >119 > 5 FAILED TESTS120 > YOU HAVE 1 DISABLED TEST121 >122 For full logs, run:123 nix log /nix/store/5mcpi4kiqmlbzxgsy06cmd4nvzdgwg6p-nix-util-tests-run-without-new-syscalls.drv124error: Cannot build '/nix/store/6q3zb9wnm8bk94jxzyrdiy11p5lp9mar-nix-util-tests-run.drv'.125 Reason: builder failed with exit code 1.126 Output paths:127 /nix/store/5db70ilwhx6idi37gbf7q10njvwcxzx5-nix-util-tests-run128 Last 25 log lines:129 > [ RUN ] Unix/UrlPathTest.urlToString/absolute_path130 > [ OK ] Unix/UrlPathTest.urlToString/absolute_path (0 ms)131 > [ RUN ] Unix/UrlPathTest.urlToString/root_path132 > [ OK ] Unix/UrlPathTest.urlToString/root_path (0 ms)133 > [ RUN ] Unix/UrlPathTest.stringToUrl/absolute_path134 > [ OK ] Unix/UrlPathTest.stringToUrl/absolute_path (0 ms)135 > [ RUN ] Unix/UrlPathTest.stringToUrl/root_path136 > [ OK ] Unix/UrlPathTest.stringToUrl/root_path (0 ms)137 > [----------] 8 tests from Unix/UrlPathTest (0 ms total)138 >139 > [----------] Global test environment tear-down140 > [==========] 818 tests from 156 test suites ran. (3037 ms total)141 > [ PASSED ] 812 tests.142 > [ SKIPPED ] 1 test, listed below:143 > [ SKIPPED ] CompressionDecompression/CompressionDecompressionTest.invalidDecompression/none144 > [ FAILED ] 5 tests, listed below:145 > [ FAILED ] ParseURLSuccessCases/ParseURLSuccess.parsesAsExpected/5, where GetParam() = 288-byte object <31-00 00-00 00-00 00-00 10-BE E4-AA AA-AA 00-00 00-B1 FF-AA AA-AA 00-00 04-00 00-00 00-00 00-00 68-74 74-70 00-68 74-74 70-73 00-00 00-00 00-00 02-00 00-00 00-00 00-00 10-FC FE-AA AA-AA 00-00 ... 00-00 00-00 00-00 00-00 B8-B1 FF-AA AA-AA 00-00 B8-B1 FF-AA AA-AA 00-00 00-00 00-00 00-00 00-00 F0-B1 FF-AA AA-AA 00-00 00-00 00-00 00-00 00-00 00-65 6C-6C 6F-00 00-00 E8-B1 FF-AA AA-AA 00-00>146 > [ FAILED ] ParseURLSuccessCases/ParseURLSuccess.toStringRoundTrips/5, where GetParam() = 288-byte object <31-00 00-00 00-00 00-00 10-BE E4-AA AA-AA 00-00 00-B1 FF-AA AA-AA 00-00 04-00 00-00 00-00 00-00 68-74 74-70 00-68 74-74 70-73 00-00 00-00 00-00 02-00 00-00 00-00 00-00 60-1B 00-AB AA-AA 00-00 ... 00-00 00-00 00-00 00-00 B8-B1 FF-AA AA-AA 00-00 B8-B1 FF-AA AA-AA 00-00 00-00 00-00 00-00 00-00 F0-B1 FF-AA AA-AA 00-00 00-00 00-00 00-00 00-00 00-65 6C-6C 6F-00 00-00 E8-B1 FF-AA AA-AA 00-00>147 > [ FAILED ] ParseURLSuccessCases/ParseURLSuccess.makeSureFixGitURLDoesNotModify/5, where GetParam() = 288-byte object <31-00 00-00 00-00 00-00 10-BE E4-AA AA-AA 00-00 00-B1 FF-AA AA-AA 00-00 04-00 00-00 00-00 00-00 68-74 74-70 00-68 74-74 70-73 00-00 00-00 00-00 02-00 00-00 00-00 00-00 C0-3F 00-AB AA-AA 00-00 ... 00-00 00-00 00-00 00-00 B8-B1 FF-AA AA-AA 00-00 B8-B1 FF-AA AA-AA 00-00 00-00 00-00 00-00 00-00 F0-B1 FF-AA AA-AA 00-00 00-00 00-00 00-00 00-00 00-65 6C-6C 6F-00 00-00 E8-B1 FF-AA AA-AA 00-00>148 > [ FAILED ] parseURLRelative/ParseURLRelativeTestSuite.resolve/resolvesRelativePathIpv6AddressWithZoneId, where GetParam() = 336-byte object <3F-00 00-00 00-00 00-00 D8-C9 E4-AA AA-AA 00-00 10-00 00-00 00-00 00-00 18-CA E4-AA AA-AA 00-00 E0-4D FF-AA AA-AA 00-00 04-00 00-00 00-00 00-00 68-74 74-70 00-00 00-00 01-00 00-00 00-00 00-00 ... D0-4E FF-AA AA-AA 00-00 00-00 00-00 00-00 00-00 00-4E FF-AA AA-AA 00-00 00-00 00-00 00-00 00-00 A0-5E 00-AB AA-AA 00-00 29-00 00-00 00-00 00-00 29-00 00-00 00-00 00-00 30-96 FE-AA AA-AA 00-00>149 > [ FAILED ] parseURLRelative/ParseURLRelativeTestSuite.resolve/absOverrideWithZoneId, where GetParam() = 336-byte object <21-00 00-00 00-00 00-00 18-CC E4-AA AA-AA 00-00 3C-00 00-00 00-00 00-00 80-CC E4-AA AA-AA 00-00 E0-4D FF-AA AA-AA 00-00 05-00 00-00 00-00 00-00 68-74 74-70 73-00 00-00 01-00 00-00 00-00 00-00 ... D0-4E FF-AA AA-AA 00-00 00-00 00-00 00-00 00-00 00-72 61-67 00-AA 00-00 00-00 00-00 00-00 00-00 10-2A 00-AB AA-AA 00-00 15-00 00-00 00-00 00-00 15-00 00-00 00-00 00-00 69-64 65-00 AA-AA 00-00>150 >151 > 5 FAILED TESTS152 > YOU HAVE 1 DISABLED TEST153 >154 For full logs, run:155 nix log /nix/store/6q3zb9wnm8bk94jxzyrdiy11p5lp9mar-nix-util-tests-run.drv156error: Cannot build '/nix/store/qmlqxiikrb6vsri0cb8mcj237m4fk3fr-nix-2.36.0pre20260916_1de45ba.drv'.157 Reason: 3 dependencies failed.158 Output paths:159 /nix/store/8d6n4m6fdmc614hc1aycd4d7ac1w7pk5-nix-2.36.0pre20260916_1de45ba-dev160 /nix/store/b0ilbgmspv3x8ax5sw9fd65xv7mx1vmq-nix-2.36.0pre20260916_1de45ba161 /nix/store/j674wcn8mhqwlhbd244ny8q3v5rpzdl2-nix-2.36.0pre20260916_1de45ba-man162 /nix/store/kzdv25x03z5l1wikw0x8rrmsdk9j6i47-nix-2.36.0pre20260916_1de45ba-doc163error: Cannot build '/nix/store/p4xg9n5v9q8cla23zq2ax07wawkdnyar-nix.conf.drv'.164 Reason: 1 dependency failed.165 Output paths:166 /nix/store/76nnd4b28zzn03981xzhpbwa2zsz1sm2-nix.conf167error: Cannot build '/nix/store/xz06k0rbbmkyv2g2qy3s9cvg43lkzh7w-nixos-option-26.11.drv'.168 Reason: 1 dependency failed.169 Output paths:170 /nix/store/7ycvi2bv8dj9ik2fgkl2ck4zql3d4sn6-nixos-option-26.11171error: Cannot build '/nix/store/2r2l9v3c0g9c3mm6f6mbf1h62ymyh1l0-nixos-rebuild-ng-26.11.drv'.172 Reason: 1 dependency failed.173 Output paths:174 /nix/store/scqd8g8gjhzd65rrd25j9ngp6yg3m88l-nixos-rebuild-ng-26.11-dist175 /nix/store/v1lglc7364wssgjfmsn17rg2nmk1vg6c-nixos-rebuild-ng-26.11176error: Cannot build '/nix/store/vcfsfbbr1qwnh249n7avwv7vgin4lgc6-system-generators.drv'.177 Reason: 1 dependency failed.178 Output paths:179 /nix/store/lj7d2jqw4gd569nw3i7nc01bwg9h2ca2-system-generators180error: Cannot build '/nix/store/d581i8dhhg7phd9pf7gymhmw9f81krwy-system-shutdown.drv'.181 Reason: 1 dependency failed.182 Output paths:183 /nix/store/q77k43v8ivmlif07irpdww6w2qf1lc62-system-shutdown184error: Cannot build '/nix/store/z39w87ar8z55npczp5nd8nrarpiv1qpb-tmpfiles.d.drv'.185 Reason: 1 dependency failed.186 Output paths:187 /nix/store/rwvxpw1ipi2zv0bnv12b06fzrkf89s92-tmpfiles.d188error: Cannot build '/nix/store/k9hafjdywkhb3acbjajalsi7z9pjj84w-unit-harmonia-gc.service.drv'.189 Reason: 1 dependency failed.190 Output paths:191 /nix/store/j3js1iw7x16hh5wghli9khy3i06gn7ii-unit-harmonia-gc.service192error: Cannot build '/nix/store/mx9igk4kxyf20ncp6y1sswgjwagkswyw-unit-nix-optimise.service.drv'.193 Reason: 1 dependency failed.194 Output paths:195 /nix/store/ypvhwn8ikx2c5k4fi4zmcxib4d7viakr-unit-nix-optimise.service196error: Cannot build '/nix/store/65mvy3schxn3mc4nxiwmd9vjdf758dyf-unit-script-nix-gc-start.drv'.197 Reason: 1 dependency failed.198 Output paths:199 /nix/store/w4ghlzjcvhixyfcs8na2j78bniccxshq-unit-script-nix-gc-start200error: Cannot build '/nix/store/88yalfjhg7yiyjzd33rlwmkf0vr4lacw-unit-script-update-prefetch-start.drv'.201 Reason: 1 dependency failed.202 Output paths:203 /nix/store/qcpbl42sin0q05wr2q2r5rz0m7fgqbl4-unit-script-update-prefetch-start204error: Cannot build '/nix/store/7g4hnhvygsb9jlvxkx249ii8lwnlmnl3-user-generators.drv'.205 Reason: 1 dependency failed.206 Output paths:207 /nix/store/fcr7iv26s6f290rzxns5nb2lqn3xvhjm-user-generators208error: Cannot build '/nix/store/0x7vxzkf6kb6zfwq81c4ssazgyz571ss-X-Restart-Triggers-nix-daemon.drv'.209 Reason: 1 dependency failed.210 Output paths:211 /nix/store/b67m4c76hhwq89c3x1k6h3n9w5rd0gq1-X-Restart-Triggers-nix-daemon212error: Cannot build '/nix/store/731i613npk6a37zn77lm3wpyin80s9a2-X-Restart-Triggers-systemd-tmpfiles-resetup.drv'.213 Reason: 1 dependency failed.214 Output paths:215 /nix/store/yjhpyf4hs5r00qpr6641hn8v5gxp4p8p-X-Restart-Triggers-systemd-tmpfiles-resetup216error: Cannot build '/nix/store/cd57i5hawmglgisizxswixsmbn7rsmf7-system-path.drv'.217 Reason: 3 dependencies failed.218 Output paths:219 /nix/store/9262i6skf0ai6czv1vrsqra3841rjx60-system-path220error: Cannot build '/nix/store/2ah8szbzvqv3zdz1a1bg3hvpyqr5x3n7-unit-nix-gc.service.drv'.221 Reason: 1 dependency failed.222 Output paths:223 /nix/store/qk19912va7gb426nzxdc8zcfa9nqaal3-unit-nix-gc.service224error: Cannot build '/nix/store/2my3lfhshmz0jjpa2mm3j2qsyiqcb7pd-unit-update-prefetch.service.drv'.225 Reason: 1 dependency failed.226 Output paths:227 /nix/store/qh5kmp3bmq5x1gz40qm0wprqgd9wipl8-unit-update-prefetch.service228error: Cannot build '/nix/store/k8lv0vsilinny0zm2f8b9xk6ir6j96z9-dbus-1.drv'.229 Reason: 1 dependency failed.230 Output paths:231 /nix/store/wnzcnaa0iybnm5ndnv4dq9yzrh0lwa7g-dbus-1232error: Cannot build '/nix/store/w7ivg8irvi05bw4sjd90akqq8rn4mxlz-unit-nix-daemon.service.drv'.233 Reason: 2 dependencies failed.234 Output paths:235 /nix/store/hiizyrbv3la66awiwa5wvlf69wj05llx-unit-nix-daemon.service236error: Cannot build '/nix/store/ijasln8n5ck28swhhqvqaak8sg68ziz6-unit-systemd-tmpfiles-resetup.service.drv'.237 Reason: 1 dependency failed.238 Output paths:239 /nix/store/5iim6msbnnyq26240n0w3a60x0g9sx6c-unit-systemd-tmpfiles-resetup.service240error: Cannot build '/nix/store/63jl2965r009a8jm52lrmxdcbj4y7p0q-X-Restart-Triggers-dbus-broker.drv'.241 Reason: 1 dependency failed.242 Output paths:243 /nix/store/rb4k928zvaq5kxyfynxmqj6fdb405clj-X-Restart-Triggers-dbus-broker244error: Cannot build '/nix/store/f2wy6r670bf25w42rg1nwq2d8zh2jvva-unit-dbus-broker.service.drv'.245 Reason: 1 dependency failed.246 Output paths:247 /nix/store/51y54p5sx936da592wirlsx2jaf63mrm-unit-dbus-broker.service248error: Cannot build '/nix/store/vv45lfhpkf6c2q5wfswccn0makw3yx02-unit-dbus-broker.service.drv'.249 Reason: 1 dependency failed.250 Output paths:251 /nix/store/lw79rmf6fps1njdar1zvh7qwb18jx7c1-unit-dbus-broker.service252error: Cannot build '/nix/store/0i32kxg94khml6ygs8aw2mxfzmak5m23-system-units.drv'.253 Reason: 8 dependencies failed.254 Output paths:255 /nix/store/h86mb5wq166zwi4vaaavn0fasn90kl6h-system-units256error: Cannot build '/nix/store/6i88q8ik489fbmi8wk3maz493gsm31kh-user-units.drv'.257 Reason: 2 dependencies failed.258 Output paths:259 /nix/store/0hcwkqqp1hmymk5vsmnzl19cl3zw38s3-user-units260error: Cannot build '/nix/store/pnqgxajvj2ffg6nfcnzxcb84gzjmvfbm-etc.drv'.261 Reason: 9 dependencies failed.262 Output paths:263 /nix/store/m4jmsbmsa5hi1z1b4g04gpryr25a51zs-etc264error: Cannot build '/nix/store/s27n2zplaxzqwh6dfxqkzxsgfsy7v3pf-activate.drv'.265 Reason: 1 dependency failed.266 Output paths:267 /nix/store/cwswrrj2z4yzwj5v2j4ac6iplksmywi1-activate268error: Cannot build '/nix/store/3i1dl2hi46wya411yfzbndb555zkfc5s-nixos-system-blob64-26.11.20260917.397d52b.drv'.269 Reason: 3 dependencies failed.270 Output paths:271 /nix/store/ywd8mfamgsgycx3y0awps09ygi1qnp1k-nixos-system-blob64-26.11.20260917.397d52b