setup
checks.x86_64-linux.nixos-bernie
· build #607
· raw
1these 40 derivations will be built:2 /nix/store/jna1xqxfq1v5wpck4z3qn8bnj9wmd9ch-nix-util-tests-run-without-new-syscalls.drv3 /nix/store/pywn97agf1aqg32llx7x0qi7gdd9yvhq-nix-store-tests-run.drv4 /nix/store/wdlzb0mq8kr7ixw4nkwkam6ijbkzdhb7-nix-util-tests-run.drv5 /nix/store/dpbmzyi65g0hwvj6g8669f62cc96s4lr-nix-2.36.0pre20260916_1de45ba.drv6 /nix/store/029x4rx1ph75gardrbvf281rc4miw50p-unit-script-update-prefetch-start.drv7 /nix/store/w0883kc1z6dljmrn6ylnbmqhma69py3y-unit-script-nix-gc-start.drv8 /nix/store/0c5k3547p45n0nmwzybmkqmbni0vvc7m-unit-nix-gc.service.drv9 /nix/store/1z87q0nj95w3jci11x2hm9s1nsxj7ggi-system-shutdown.drv10 /nix/store/226lkmv8nz6yrqicb4qs2zapyx5m18pc-systemd-boot.drv11 /nix/store/3fkrmlg888561wnl10bb60g9zr30w9yl-nixos-rebuild-ng-26.11.drv12 /nix/store/kc36sra7230l1gsjnnfh07g3d4hbawm6-nixos-option-26.11.drv13 /nix/store/9pqxgmxcr8y93dhrxd7g0xxc4i8bfyz8-system-path.drv14 /nix/store/d6a02dqi5d0ls0cz9s52lbwjwiidvc8y-dbus-1.drv15 /nix/store/dzrjnl9z2wpn2wdq8wxxgjslyl6942gs-X-Restart-Triggers-dbus-broker.drv16 /nix/store/24lf3l57fb4q129mx4nyprz6ilci4wmx-unit-dbus-broker.service.drv17 /nix/store/264q86rc8pgsddipjj9ar5jkzjghgm6n-unit-harmonia-gc.service.drv18 /nix/store/2w0vrz5yy7jd6jbhfvj88wjcg1mqmd4y-unit-nix-optimise.service.drv19 /nix/store/6qd86hcnhgwcgwgdplmqlx43sbj5hl4q-nix.conf.drv20 /nix/store/gaa7q4g5hl1za9q17w89qvc3ysncrjgc-system-generators.drv21 /nix/store/m7c3i5mkfjm0968k9xhsrjdjfyc2f8hf-unit-dbus-broker.service.drv22 /nix/store/gp2ra238fh2mw9ryjg1zw8ls54c7g73k-user-units.drv23 /nix/store/i6l7s59dg4wydrm2j8dj4akvj0iqskyv-user-generators.drv24 /nix/store/vjyifc82z3s76w58n2fsfjaysky2sgc9-tmpfiles.d.drv25 /nix/store/v8lwirl6zgp3rcnhifqbgkapd9n7k7dm-X-Restart-Triggers-nix-daemon.drv26 /nix/store/ckmh93h3pwlm9l3i6mdpk4k86jn9m1iq-unit-nix-daemon.service.drv27 /nix/store/ihrna8a1zw316gi5h5kdgchxsmfacx8k-unit-accounts-daemon.service.drv28 /nix/store/l9gzn3d4xgsx48bpfswh461bs8d2zbfy-X-Restart-Triggers-polkit.drv29 /nix/store/jw5drrxm4q54av46f23cd3dsf6d8an6p-unit-polkit.service.drv30 /nix/store/jyjg6w23s3mz5rkxzg5r4sv661prs69y-X-Restart-Triggers-systemd-tmpfiles-resetup.drv31 /nix/store/va5qyv9xy99qag98zcx0kik122nbhxzj-unit-systemd-tmpfiles-resetup.service.drv32 /nix/store/x4dv2v1l2iy6wp2zk5chwybm62vz55dl-unit-update-prefetch.service.drv33 /nix/store/snx0whdks9s3x4j6c50v74fpffkzb6hn-flake-inputs.prom.drv34 /nix/store/8fiq7k0kw6bfkak91lng3198blyn0n6r-config.toml.drv35 /nix/store/zlacffip0zdb7hdqrv8laz8fgi6rnr3k-unit-telegraf.service.drv36 /nix/store/vlspy2xf3xpq4679was23v9w5s334r11-system-units.drv37 /nix/store/zfkfayvrlq5x7wv9av4q0dhjfgk2k2rr-etc-nix-registry.json.drv38 /nix/store/4nwwp0k2s2x6h1xn2j6if8qsc9nk8xnv-etc.drv39 /nix/store/pmgc2kjks8i7sdd2phhl771cs1fqqx5n-activate.drv40 /nix/store/r2b7a186i7jyqhszp4vxk4qvp1hnh176-install-systemd-boot.sh.drv41 /nix/store/iglbrskdplnfb36laa8s0yz3xr68688a-nixos-system-bernie-26.11.20260917.397d52b.drv42error: Cannot build '/nix/store/pywn97agf1aqg32llx7x0qi7gdd9yvhq-nix-store-tests-run.drv'.43 Reason: builder failed with exit code 1.44 Output paths:45 /nix/store/24plkfymp8qndabbhwpgwflhp0wc7qvl-nix-store-tests-run46 Last 25 log lines:47 > [ OK ] S3ToHttpsConversion/S3ToHttpsConversionTest.ConvertsCorrectly/dotted_bucket_with_auto_style_custom_endpoint (0 ms)48 > [----------] 13 tests from S3ToHttpsConversion/S3ToHttpsConversionTest (0 ms total)49 >50 > [----------] 5 tests from S3ToHttpsConversionErrors/S3ToHttpsConversionErrorTest51 > [ RUN ] S3ToHttpsConversionErrors/S3ToHttpsConversionErrorTest.ThrowsOnConversion/virtual_style_with_empty_host_authority52 > [ OK ] S3ToHttpsConversionErrors/S3ToHttpsConversionErrorTest.ThrowsOnConversion/virtual_style_with_empty_host_authority (0 ms)53 > [ RUN ] S3ToHttpsConversionErrors/S3ToHttpsConversionErrorTest.ThrowsOnConversion/dotted_bucket_with_explicit_virtual_style54 > [ OK ] S3ToHttpsConversionErrors/S3ToHttpsConversionErrorTest.ThrowsOnConversion/dotted_bucket_with_explicit_virtual_style (0 ms)55 > [ RUN ] S3ToHttpsConversionErrors/S3ToHttpsConversionErrorTest.ThrowsOnConversion/dotted_bucket_with_explicit_virtual_style_multi_dot56 > [ OK ] S3ToHttpsConversionErrors/S3ToHttpsConversionErrorTest.ThrowsOnConversion/dotted_bucket_with_explicit_virtual_style_multi_dot (0 ms)57 > [ RUN ] S3ToHttpsConversionErrors/S3ToHttpsConversionErrorTest.ThrowsOnConversion/dotted_bucket_with_explicit_virtual_style_custom_authority58 > [ OK ] S3ToHttpsConversionErrors/S3ToHttpsConversionErrorTest.ThrowsOnConversion/dotted_bucket_with_explicit_virtual_style_custom_authority (0 ms)59 > [ RUN ] S3ToHttpsConversionErrors/S3ToHttpsConversionErrorTest.ThrowsOnConversion/dotted_bucket_with_explicit_virtual_style_full_endpoint_url60 > [ OK ] S3ToHttpsConversionErrors/S3ToHttpsConversionErrorTest.ThrowsOnConversion/dotted_bucket_with_explicit_virtual_style_full_endpoint_url (0 ms)61 > [----------] 5 tests from S3ToHttpsConversionErrors/S3ToHttpsConversionErrorTest (0 ms total)62 >63 > [----------] Global test environment tear-down64 > [==========] 798 tests from 90 test suites ran. (1386 ms total)65 > [ PASSED ] 797 tests.66 > [ FAILED ] 1 test, listed below:67 > [ FAILED ] StoreReferenceTest.PathInfo_ssh_unbracketed_ipv6_5_from_uri68 >69 > 1 FAILED TEST70 > YOU HAVE 1 DISABLED TEST71 >72 For full logs, run:73 nix log /nix/store/pywn97agf1aqg32llx7x0qi7gdd9yvhq-nix-store-tests-run.drv74error: Cannot build '/nix/store/jna1xqxfq1v5wpck4z3qn8bnj9wmd9ch-nix-util-tests-run-without-new-syscalls.drv'.75 Reason: builder failed with exit code 1.76 Output paths:77 /nix/store/jlahqnixx9m0q1c9q858imlga6ri4fhg-nix-util-tests-run-without-new-syscalls78 Last 25 log lines:79 > [ RUN ] Unix/UrlPathTest.urlToString/absolute_path80 > [ OK ] Unix/UrlPathTest.urlToString/absolute_path (0 ms)81 > [ RUN ] Unix/UrlPathTest.urlToString/root_path82 > [ OK ] Unix/UrlPathTest.urlToString/root_path (0 ms)83 > [ RUN ] Unix/UrlPathTest.stringToUrl/absolute_path84 > [ OK ] Unix/UrlPathTest.stringToUrl/absolute_path (0 ms)85 > [ RUN ] Unix/UrlPathTest.stringToUrl/root_path86 > [ OK ] Unix/UrlPathTest.stringToUrl/root_path (0 ms)87 > [----------] 8 tests from Unix/UrlPathTest (0 ms total)88 >89 > [----------] Global test environment tear-down90 > [==========] 818 tests from 156 test suites ran. (2931 ms total)91 > [ PASSED ] 812 tests.92 > [ SKIPPED ] 1 test, listed below:93 > [ SKIPPED ] CompressionDecompression/CompressionDecompressionTest.invalidDecompression/none94 > [ FAILED ] 5 tests, listed below:95 > [ FAILED ] ParseURLSuccessCases/ParseURLSuccess.parsesAsExpected/5, where GetParam() = 288-byte object <31-00 00-00 00-00 00-00 A8-86 95-55 55-55 00-00 B0-C7 B0-55 55-55 00-00 04-00 00-00 00-00 00-00 68-74 74-70 00-68 74-74 70-73 00-00 00-00 00-00 02-00 00-00 00-00 00-00 00-56 B0-55 55-55 00-00 ... 00-00 00-00 00-00 00-00 68-C8 B0-55 55-55 00-00 68-C8 B0-55 55-55 00-00 00-00 00-00 00-00 00-00 A0-C8 B0-55 55-55 00-00 00-00 00-00 00-00 00-00 00-65 6C-6C 6F-00 00-00 98-C8 B0-55 55-55 00-00>96 > [ FAILED ] ParseURLSuccessCases/ParseURLSuccess.toStringRoundTrips/5, where GetParam() = 288-byte object <31-00 00-00 00-00 00-00 A8-86 95-55 55-55 00-00 B0-C7 B0-55 55-55 00-00 04-00 00-00 00-00 00-00 68-74 74-70 00-68 74-74 70-73 00-00 00-00 00-00 02-00 00-00 00-00 00-00 F0-2F B1-55 55-55 00-00 ... 00-00 00-00 00-00 00-00 68-C8 B0-55 55-55 00-00 68-C8 B0-55 55-55 00-00 00-00 00-00 00-00 00-00 A0-C8 B0-55 55-55 00-00 00-00 00-00 00-00 00-00 00-65 6C-6C 6F-00 00-00 98-C8 B0-55 55-55 00-00>97 > [ FAILED ] ParseURLSuccessCases/ParseURLSuccess.makeSureFixGitURLDoesNotModify/5, where GetParam() = 288-byte object <31-00 00-00 00-00 00-00 A8-86 95-55 55-55 00-00 B0-C7 B0-55 55-55 00-00 04-00 00-00 00-00 00-00 68-74 74-70 00-68 74-74 70-73 00-00 00-00 00-00 02-00 00-00 00-00 00-00 40-55 B1-55 55-55 00-00 ... 00-00 00-00 00-00 00-00 68-C8 B0-55 55-55 00-00 68-C8 B0-55 55-55 00-00 00-00 00-00 00-00 00-00 A0-C8 B0-55 55-55 00-00 00-00 00-00 00-00 00-00 00-65 6C-6C 6F-00 00-00 98-C8 B0-55 55-55 00-00>98 > [ FAILED ] parseURLRelative/ParseURLRelativeTestSuite.resolve/resolvesRelativePathIpv6AddressWithZoneId, where GetParam() = 336-byte object <3F-00 00-00 00-00 00-00 18-90 95-55 55-55 00-00 10-00 00-00 00-00 00-00 68-34 94-55 55-55 00-00 B0-F2 AF-55 55-55 00-00 04-00 00-00 00-00 00-00 68-74 74-70 00-00 00-00 00-00 00-00 00-00 00-00 ... A0-F3 AF-55 55-55 00-00 00-00 00-00 00-00 00-00 00-F3 AF-55 55-55 00-00 00-00 00-00 00-00 00-00 90-74 B1-55 55-55 00-00 29-00 00-00 00-00 00-00 29-00 00-00 00-00 00-00 F0-F3 AF-55 55-55 00-00>99 > [ FAILED ] parseURLRelative/ParseURLRelativeTestSuite.resolve/absOverrideWithZoneId, where GetParam() = 336-byte object <21-00 00-00 00-00 00-00 60-8E 95-55 55-55 00-00 3C-00 00-00 00-00 00-00 88-8E 95-55 55-55 00-00 B0-F2 AF-55 55-55 00-00 05-00 00-00 00-00 00-00 68-74 74-70 73-00 00-00 00-00 00-00 00-00 00-00 ... A0-F3 AF-55 55-55 00-00 00-00 00-00 00-00 00-00 00-72 61-67 00-55 00-00 00-00 00-00 00-00 00-00 C0-3B B1-55 55-55 00-00 15-00 00-00 00-00 00-00 15-00 00-00 00-00 00-00 69-64 65-00 55-55 00-00>100 >101 > 5 FAILED TESTS102 > YOU HAVE 1 DISABLED TEST103 >104 For full logs, run:105 nix log /nix/store/jna1xqxfq1v5wpck4z3qn8bnj9wmd9ch-nix-util-tests-run-without-new-syscalls.drv106error: Cannot build '/nix/store/wdlzb0mq8kr7ixw4nkwkam6ijbkzdhb7-nix-util-tests-run.drv'.107 Reason: builder failed with exit code 1.108 Output paths:109 /nix/store/wbg4wirj55rfsaifv3nwy7mwkqa2xy5h-nix-util-tests-run110 Last 25 log lines:111 > [ RUN ] Unix/UrlPathTest.urlToString/absolute_path112 > [ OK ] Unix/UrlPathTest.urlToString/absolute_path (0 ms)113 > [ RUN ] Unix/UrlPathTest.urlToString/root_path114 > [ OK ] Unix/UrlPathTest.urlToString/root_path (0 ms)115 > [ RUN ] Unix/UrlPathTest.stringToUrl/absolute_path116 > [ OK ] Unix/UrlPathTest.stringToUrl/absolute_path (0 ms)117 > [ RUN ] Unix/UrlPathTest.stringToUrl/root_path118 > [ OK ] Unix/UrlPathTest.stringToUrl/root_path (0 ms)119 > [----------] 8 tests from Unix/UrlPathTest (0 ms total)120 >121 > [----------] Global test environment tear-down122 > [==========] 818 tests from 156 test suites ran. (2961 ms total)123 > [ PASSED ] 812 tests.124 > [ SKIPPED ] 1 test, listed below:125 > [ SKIPPED ] CompressionDecompression/CompressionDecompressionTest.invalidDecompression/none126 > [ FAILED ] 5 tests, listed below:127 > [ FAILED ] ParseURLSuccessCases/ParseURLSuccess.parsesAsExpected/5, where GetParam() = 288-byte object <31-00 00-00 00-00 00-00 A8-86 95-55 55-55 00-00 B0-C7 B0-55 55-55 00-00 04-00 00-00 00-00 00-00 68-74 74-70 00-68 74-74 70-73 00-00 00-00 00-00 02-00 00-00 00-00 00-00 00-56 B0-55 55-55 00-00 ... 00-00 00-00 00-00 00-00 68-C8 B0-55 55-55 00-00 68-C8 B0-55 55-55 00-00 00-00 00-00 00-00 00-00 A0-C8 B0-55 55-55 00-00 00-00 00-00 00-00 00-00 00-65 6C-6C 6F-00 00-00 98-C8 B0-55 55-55 00-00>128 > [ FAILED ] ParseURLSuccessCases/ParseURLSuccess.toStringRoundTrips/5, where GetParam() = 288-byte object <31-00 00-00 00-00 00-00 A8-86 95-55 55-55 00-00 B0-C7 B0-55 55-55 00-00 04-00 00-00 00-00 00-00 68-74 74-70 00-68 74-74 70-73 00-00 00-00 00-00 02-00 00-00 00-00 00-00 F0-2F B1-55 55-55 00-00 ... 00-00 00-00 00-00 00-00 68-C8 B0-55 55-55 00-00 68-C8 B0-55 55-55 00-00 00-00 00-00 00-00 00-00 A0-C8 B0-55 55-55 00-00 00-00 00-00 00-00 00-00 00-65 6C-6C 6F-00 00-00 98-C8 B0-55 55-55 00-00>129 > [ FAILED ] ParseURLSuccessCases/ParseURLSuccess.makeSureFixGitURLDoesNotModify/5, where GetParam() = 288-byte object <31-00 00-00 00-00 00-00 A8-86 95-55 55-55 00-00 B0-C7 B0-55 55-55 00-00 04-00 00-00 00-00 00-00 68-74 74-70 00-68 74-74 70-73 00-00 00-00 00-00 02-00 00-00 00-00 00-00 40-55 B1-55 55-55 00-00 ... 00-00 00-00 00-00 00-00 68-C8 B0-55 55-55 00-00 68-C8 B0-55 55-55 00-00 00-00 00-00 00-00 00-00 A0-C8 B0-55 55-55 00-00 00-00 00-00 00-00 00-00 00-65 6C-6C 6F-00 00-00 98-C8 B0-55 55-55 00-00>130 > [ FAILED ] parseURLRelative/ParseURLRelativeTestSuite.resolve/resolvesRelativePathIpv6AddressWithZoneId, where GetParam() = 336-byte object <3F-00 00-00 00-00 00-00 18-90 95-55 55-55 00-00 10-00 00-00 00-00 00-00 68-34 94-55 55-55 00-00 B0-F2 AF-55 55-55 00-00 04-00 00-00 00-00 00-00 68-74 74-70 00-00 00-00 00-00 00-00 00-00 00-00 ... A0-F3 AF-55 55-55 00-00 00-00 00-00 00-00 00-00 00-F3 AF-55 55-55 00-00 00-00 00-00 00-00 00-00 90-74 B1-55 55-55 00-00 29-00 00-00 00-00 00-00 29-00 00-00 00-00 00-00 F0-F3 AF-55 55-55 00-00>131 > [ FAILED ] parseURLRelative/ParseURLRelativeTestSuite.resolve/absOverrideWithZoneId, where GetParam() = 336-byte object <21-00 00-00 00-00 00-00 60-8E 95-55 55-55 00-00 3C-00 00-00 00-00 00-00 88-8E 95-55 55-55 00-00 B0-F2 AF-55 55-55 00-00 05-00 00-00 00-00 00-00 68-74 74-70 73-00 00-00 00-00 00-00 00-00 00-00 ... A0-F3 AF-55 55-55 00-00 00-00 00-00 00-00 00-00 00-72 61-67 00-55 00-00 00-00 00-00 00-00 00-00 C0-3B B1-55 55-55 00-00 15-00 00-00 00-00 00-00 15-00 00-00 00-00 00-00 69-64 65-00 55-55 00-00>132 >133 > 5 FAILED TESTS134 > YOU HAVE 1 DISABLED TEST135 >136 For full logs, run:137 nix log /nix/store/wdlzb0mq8kr7ixw4nkwkam6ijbkzdhb7-nix-util-tests-run.drv138error: Cannot build '/nix/store/dpbmzyi65g0hwvj6g8669f62cc96s4lr-nix-2.36.0pre20260916_1de45ba.drv'.139 Reason: 3 dependencies failed.140 Output paths:141 /nix/store/6lx769va5cfq3wixwssm1a6wmqrwvvs5-nix-2.36.0pre20260916_1de45ba-doc142 /nix/store/bzjx147cx6i840zi3ydzd4sw6yxs9srm-nix-2.36.0pre20260916_1de45ba-man143 /nix/store/nf5f2pshfbhrqk2a6svvcbhl6flblbx3-nix-2.36.0pre20260916_1de45ba-dev144 /nix/store/wylj6yb4sbigrb1bmgjrvzd762vqbyzp-nix-2.36.0pre20260916_1de45ba145error: Cannot build '/nix/store/6qd86hcnhgwcgwgdplmqlx43sbj5hl4q-nix.conf.drv'.146 Reason: 1 dependency failed.147 Output paths:148 /nix/store/rfj7zdxi4xyg7i94ikry7p1rlpavj3ji-nix.conf149error: Cannot build '/nix/store/kc36sra7230l1gsjnnfh07g3d4hbawm6-nixos-option-26.11.drv'.150 Reason: 1 dependency failed.151 Output paths:152 /nix/store/99y57vvqvrl03pbpmkpml0qn2v5yxa8s-nixos-option-26.11153error: Cannot build '/nix/store/3fkrmlg888561wnl10bb60g9zr30w9yl-nixos-rebuild-ng-26.11.drv'.154 Reason: 1 dependency failed.155 Output paths:156 /nix/store/3bcq2ccqhjppyyq5cv4ndgz4bn3rywbv-nixos-rebuild-ng-26.11157 /nix/store/fwy4c8rqg45h9z6p7bpc89b7b1161m42-nixos-rebuild-ng-26.11-dist158error: Cannot build '/nix/store/gaa7q4g5hl1za9q17w89qvc3ysncrjgc-system-generators.drv'.159 Reason: 1 dependency failed.160 Output paths:161 /nix/store/rbmwmykwcp6283vsyvc91yp2v2qv46mz-system-generators162error: Cannot build '/nix/store/1z87q0nj95w3jci11x2hm9s1nsxj7ggi-system-shutdown.drv'.163 Reason: 1 dependency failed.164 Output paths:165 /nix/store/qa2v1svs4njv2rmaam30ngl6qs5dph5f-system-shutdown166error: Cannot build '/nix/store/226lkmv8nz6yrqicb4qs2zapyx5m18pc-systemd-boot.drv'.167 Reason: 1 dependency failed.168 Output paths:169 /nix/store/6bbx88pk1c8llf7qh1brf4rshgpm7z22-systemd-boot170error: Cannot build '/nix/store/vjyifc82z3s76w58n2fsfjaysky2sgc9-tmpfiles.d.drv'.171 Reason: 1 dependency failed.172 Output paths:173 /nix/store/cy72i4gcwrq1z9g8pcym78y66fl2c2zl-tmpfiles.d174error: Cannot build '/nix/store/264q86rc8pgsddipjj9ar5jkzjghgm6n-unit-harmonia-gc.service.drv'.175 Reason: 1 dependency failed.176 Output paths:177 /nix/store/2y51fk1icxwwglv58190bdidf2zafnlq-unit-harmonia-gc.service178error: Cannot build '/nix/store/2w0vrz5yy7jd6jbhfvj88wjcg1mqmd4y-unit-nix-optimise.service.drv'.179 Reason: 1 dependency failed.180 Output paths:181 /nix/store/6h91xkqcdjhsw2gyaaqd62gyz3fymj4j-unit-nix-optimise.service182error: Cannot build '/nix/store/w0883kc1z6dljmrn6ylnbmqhma69py3y-unit-script-nix-gc-start.drv'.183 Reason: 1 dependency failed.184 Output paths:185 /nix/store/2awjd2bxj637zaxffcakz65pmy1abdl3-unit-script-nix-gc-start186error: Cannot build '/nix/store/029x4rx1ph75gardrbvf281rc4miw50p-unit-script-update-prefetch-start.drv'.187 Reason: 1 dependency failed.188 Output paths:189 /nix/store/3gl8lw73s03ynd0n300allwf6fz4zp59-unit-script-update-prefetch-start190error: Cannot build '/nix/store/i6l7s59dg4wydrm2j8dj4akvj0iqskyv-user-generators.drv'.191 Reason: 1 dependency failed.192 Output paths:193 /nix/store/kndjyb1p91f6byzznbfqi6jlv739zq30-user-generators194error: Cannot build '/nix/store/v8lwirl6zgp3rcnhifqbgkapd9n7k7dm-X-Restart-Triggers-nix-daemon.drv'.195 Reason: 1 dependency failed.196 Output paths:197 /nix/store/c38w30bz644g9rdm04bm13ngv2wz6v70-X-Restart-Triggers-nix-daemon198error: Cannot build '/nix/store/jyjg6w23s3mz5rkxzg5r4sv661prs69y-X-Restart-Triggers-systemd-tmpfiles-resetup.drv'.199 Reason: 1 dependency failed.200 Output paths:201 /nix/store/s1q81riid55mimc1ma53mfbhaca5iy4c-X-Restart-Triggers-systemd-tmpfiles-resetup202error: Cannot build '/nix/store/r2b7a186i7jyqhszp4vxk4qvp1hnh176-install-systemd-boot.sh.drv'.203 Reason: 1 dependency failed.204 Output paths:205 /nix/store/zbfm313sfwn5l9ajin6w02bxyy4qgibj-install-systemd-boot.sh206error: Cannot build '/nix/store/9pqxgmxcr8y93dhrxd7g0xxc4i8bfyz8-system-path.drv'.207 Reason: 3 dependencies failed.208 Output paths:209 /nix/store/zbm5palhhwjwfrb9dwmiiflac49b8ggy-system-path210error: Cannot build '/nix/store/0c5k3547p45n0nmwzybmkqmbni0vvc7m-unit-nix-gc.service.drv'.211 Reason: 1 dependency failed.212 Output paths:213 /nix/store/mx6aakgld87kyf60afjdrpw1mjm39i27-unit-nix-gc.service214error: Cannot build '/nix/store/x4dv2v1l2iy6wp2zk5chwybm62vz55dl-unit-update-prefetch.service.drv'.215 Reason: 1 dependency failed.216 Output paths:217 /nix/store/wi6zabha1j1a4gr3hmk1ym39shgbxh9m-unit-update-prefetch.service218error: Cannot build '/nix/store/l9gzn3d4xgsx48bpfswh461bs8d2zbfy-X-Restart-Triggers-polkit.drv'.219 Reason: 1 dependency failed.220 Output paths:221 /nix/store/k7yjg91vii8wap2x4vgapzfy06dcsk4f-X-Restart-Triggers-polkit222error: Cannot build '/nix/store/d6a02dqi5d0ls0cz9s52lbwjwiidvc8y-dbus-1.drv'.223 Reason: 1 dependency failed.224 Output paths:225 /nix/store/ny324vzfkzn8jv5y0ycay3p0bc3w8nxf-dbus-1226error: Cannot build '/nix/store/ihrna8a1zw316gi5h5kdgchxsmfacx8k-unit-accounts-daemon.service.drv'.227 Reason: 1 dependency failed.228 Output paths:229 /nix/store/201ibhhcl9qndx2c2j6vhj8lh38457lz-unit-accounts-daemon.service230error: Cannot build '/nix/store/ckmh93h3pwlm9l3i6mdpk4k86jn9m1iq-unit-nix-daemon.service.drv'.231 Reason: 2 dependencies failed.232 Output paths:233 /nix/store/3j03a18zv9r2vcb3grmd6066xi528ywg-unit-nix-daemon.service234error: Cannot build '/nix/store/va5qyv9xy99qag98zcx0kik122nbhxzj-unit-systemd-tmpfiles-resetup.service.drv'.235 Reason: 1 dependency failed.236 Output paths:237 /nix/store/3bnjd9spg1rmk0cys7dms2abbnf0nqxj-unit-systemd-tmpfiles-resetup.service238error: Cannot build '/nix/store/dzrjnl9z2wpn2wdq8wxxgjslyl6942gs-X-Restart-Triggers-dbus-broker.drv'.239 Reason: 1 dependency failed.240 Output paths:241 /nix/store/8zsq2hmg5yzr8347z5m0mxy9d7pf7icm-X-Restart-Triggers-dbus-broker242error: Cannot build '/nix/store/jw5drrxm4q54av46f23cd3dsf6d8an6p-unit-polkit.service.drv'.243 Reason: 1 dependency failed.244 Output paths:245 /nix/store/33f20jbmslys4a96j6b13hsmma9kszy2-unit-polkit.service246error: Cannot build '/nix/store/24lf3l57fb4q129mx4nyprz6ilci4wmx-unit-dbus-broker.service.drv'.247 Reason: 1 dependency failed.248 Output paths:249 /nix/store/ydbgbg43xk6d5m6fpc31zjsdi4yn1a5a-unit-dbus-broker.service250error: Cannot build '/nix/store/m7c3i5mkfjm0968k9xhsrjdjfyc2f8hf-unit-dbus-broker.service.drv'.251 Reason: 1 dependency failed.252 Output paths:253 /nix/store/y7ai2m5jdhzfqkmb9vrd5yck7b8zv3p9-unit-dbus-broker.service254error: Cannot build '/nix/store/vlspy2xf3xpq4679was23v9w5s334r11-system-units.drv'.255 Reason: 10 dependencies failed.256 Output paths:257 /nix/store/kp0771spxvfmwfi0lk6d0lp5rz9nl0c2-system-units258error: Cannot build '/nix/store/gp2ra238fh2mw9ryjg1zw8ls54c7g73k-user-units.drv'.259 Reason: 2 dependencies failed.260 Output paths:261 /nix/store/s099cvx7q1ab5bzf967kgmy1xmgpwb4q-user-units262error: Cannot build '/nix/store/4nwwp0k2s2x6h1xn2j6if8qsc9nk8xnv-etc.drv'.263 Reason: 9 dependencies failed.264 Output paths:265 /nix/store/51lzclzhzm7myniszmllvln9ip6ybfi0-etc266error: Cannot build '/nix/store/pmgc2kjks8i7sdd2phhl771cs1fqqx5n-activate.drv'.267 Reason: 1 dependency failed.268 Output paths:269 /nix/store/p7858gr39jk0jj23vmafwiwvf9sfg23h-activate270error: Cannot build '/nix/store/iglbrskdplnfb36laa8s0yz3xr68688a-nixos-system-bernie-26.11.20260917.397d52b.drv'.271 Reason: 4 dependencies failed.272 Output paths:273 /nix/store/ka6rg5gv6dy2c4rb0izvkwd8aqkgf08p-nixos-system-bernie-26.11.20260917.397d52b