setup
checks.x86_64-linux.nixos-eve
· build #607
· raw
1these 56 derivations will be built:2 /nix/store/jna1xqxfq1v5wpck4z3qn8bnj9wmd9ch-nix-util-tests-run-without-new-syscalls.drv3 /nix/store/pywn97agf1aqg32llx7x0qi7gdd9yvhq-nix-store-tests-run.drv4 /nix/store/wdlzb0mq8kr7ixw4nkwkam6ijbkzdhb7-nix-util-tests-run.drv5 /nix/store/dpbmzyi65g0hwvj6g8669f62cc96s4lr-nix-2.36.0pre20260916_1de45ba.drv6 /nix/store/w0883kc1z6dljmrn6ylnbmqhma69py3y-unit-script-nix-gc-start.drv7 /nix/store/0c5k3547p45n0nmwzybmkqmbni0vvc7m-unit-nix-gc.service.drv8 /nix/store/0ly3zsllack9pcl3hv5bjjv7f4c6ml3v-hermes-frontend-2026.9.14.drv9 /nix/store/264q86rc8pgsddipjj9ar5jkzjghgm6n-unit-harmonia-gc.service.drv10 /nix/store/d5pcjyq9xncf1zl4y0agk3qcbaqv7rja-python3.14-nemo-relay-0.8.4.drv11 /nix/store/kd51bf6vqjnzr4y50bxks2km3jx7in8y-python3.14-slack-bolt-1.30.0.drv12 /nix/store/nz6klv4g3w7d4yk8k2pzq98s0x5s7qd1-python3-3.14.7-env.drv13 /nix/store/hljrvp3wn2vfc41izw9nyjri3x9p20qj-hermes-agent-2026.9.14.drv14 /nix/store/sv2ph606ylhxddhhg2mjnw24cvg6hh7x-system-path.drv15 /nix/store/jn6www335sgwk2a5q9afrzirggz424jl-dbus-1.drv16 /nix/store/4riyadns52l041hz88h6f8xc7l6ls518-X-Restart-Triggers-dbus-broker.drv17 /nix/store/2n8gaqxfkqzvl6vysxdgw45jyvhghqiy-unit-dbus-broker.service.drv18 /nix/store/2w0vrz5yy7jd6jbhfvj88wjcg1mqmd4y-unit-nix-optimise.service.drv19 /nix/store/3fkrmlg888561wnl10bb60g9zr30w9yl-nixos-rebuild-ng-26.11.drv20 /nix/store/f14qmgwgckrj9ng6i627wyc3m7gsav7r-nix.conf.drv21 /nix/store/i0kvp1cjaz0vz0grplac2zbv61958b04-X-Restart-Triggers-nix-daemon.drv22 /nix/store/5zc6g5mc395bx9c5vjvl6phkjny5rzcs-unit-nix-daemon.service.drv23 /nix/store/a17kllvnhhc2z2v4g1z4c864q51zv4gf-system-generators.drv24 /nix/store/kc36sra7230l1gsjnnfh07g3d4hbawm6-nixos-option-26.11.drv25 /nix/store/z2kyrvvxlw7b7578jrxhwj40s9yg7ah8-system-path.drv26 /nix/store/cnkn7iq1dpg0f0sbp1xi4swqv470pxdq-dbus-1.drv27 /nix/store/d69n8492yxjdxlgvil1r0hpks5pllgvm-user-generators.drv28 /nix/store/fr4jrkkyk7zkzqbbgcwrrc6i560qfyif-tmpfiles.d.drv29 /nix/store/jrmqy9lqwa0qbwizp17chnn1vp3gh690-system-shutdown.drv30 /nix/store/gg19vhyk93ppbpr7333kzr9aim93gpkg-X-Restart-Triggers-dbus-broker.drv31 /nix/store/gdb8q8s4s7q2x84h0x1niybbvkirmgsv-unit-dbus-broker.service.drv32 /nix/store/dhhww3hrwim5nn8s5q2v3byg7jgavicd-config.toml.drv33 /nix/store/hw0mv012j7rp5zcwjm8n4n32xgdsd801-unit-telegraf.service.drv34 /nix/store/izkcfdj2zlwgr6v6vf1gdxjmrdpw3gdk-unit-container-.service.drv35 /nix/store/sjjr2vkzsnypw2zd8gw6rc8ws11iw6m0-X-Restart-Triggers-systemd-tmpfiles-resetup.drv36 /nix/store/kjcn6ak6r41znc3a4n7mb9cjs35s45h6-unit-systemd-tmpfiles-resetup.service.drv37 /nix/store/kvgwrskpjlys3hs1j1xglm5sy4p9klhx-unit-script-update-prefetch-start.drv38 /nix/store/m2a2rjm0k2s72x8c2hb55ymp1lak5slp-unit-update-prefetch.service.drv39 /nix/store/byf7gq33isdjrcs7a48rp9jn4n5qxcib-hermes-gateway.drv40 /nix/store/xdnaiqksgwyahhr2zxgm9nngy798qax5-unit-hermes.service.drv41 /nix/store/qg90db22qdwswzk9bs7r9x93cnxmvd34-system-units.drv42 /nix/store/gha0f9hap87zlbir59xr2dbg82a801b9-unit-dbus-broker.service.drv43 /nix/store/xnb21186dib3ncdsqzby6fhjgdh1iflw-user-units.drv44 /nix/store/wjb9d0zkgnlji1plm563rzhdwd9nkiw6-etc.drv45 /nix/store/7vxp83s401xj2si505j1x4aav71xvxy7-activate.drv46 /nix/store/fsnafdm5ys4ayq063ivcr280h1ihibaw-nixos-system-hermes-26.11pre-git.drv47 /nix/store/pkf0aikzzrzzgpndjvxkay1fd7080lnz-etc-nixos-containers-hermes.conf.drv48 /nix/store/ls8r69jw14minq8hq5wngjrqzk0v7ifm-X-Restart-Triggers-container-hermes.drv49 /nix/store/vrqqr7dr2s72q63js0m4iwzm6v6zhcds-unit-container-hermes.service.drv50 /nix/store/mnv78a9ykbqfpphk8rzwxjbn2bl30si4-system-units.drv51 /nix/store/lr78krqxsylz8ym07q9mz4rl21n4mvc5-unit-dbus-broker.service.drv52 /nix/store/vkaq6z5csq6ccqfc5az9mlrdxn1k0mzi-user-units.drv53 /nix/store/y2y4337y18a9n6367843nkxvzfd16g1m-etc.drv54 /nix/store/6gxmsqsh5q4i91d8s4l688ml7gdm94jd-activate.drv55 /nix/store/nw3fy8m0nn5glzndcq67gkdhc07gbdgv-systemd-boot.drv56 /nix/store/l4cb01a6apx5s8j5siyjdgz2vc01vlhh-install-systemd-boot.sh.drv57 /nix/store/l0aa3y1yw1md7bvm9rzbbhc4b24mdi0h-nixos-system-eve-26.11.20260917.397d52b.drv58error: Cannot build '/nix/store/pywn97agf1aqg32llx7x0qi7gdd9yvhq-nix-store-tests-run.drv'.59 Reason: builder failed with exit code 1.60 Output paths:61 /nix/store/24plkfymp8qndabbhwpgwflhp0wc7qvl-nix-store-tests-run62 Last 25 log lines:63 > [ OK ] S3ToHttpsConversion/S3ToHttpsConversionTest.ConvertsCorrectly/dotted_bucket_with_auto_style_custom_endpoint (0 ms)64 > [----------] 13 tests from S3ToHttpsConversion/S3ToHttpsConversionTest (0 ms total)65 >66 > [----------] 5 tests from S3ToHttpsConversionErrors/S3ToHttpsConversionErrorTest67 > [ RUN ] S3ToHttpsConversionErrors/S3ToHttpsConversionErrorTest.ThrowsOnConversion/virtual_style_with_empty_host_authority68 > [ OK ] S3ToHttpsConversionErrors/S3ToHttpsConversionErrorTest.ThrowsOnConversion/virtual_style_with_empty_host_authority (0 ms)69 > [ RUN ] S3ToHttpsConversionErrors/S3ToHttpsConversionErrorTest.ThrowsOnConversion/dotted_bucket_with_explicit_virtual_style70 > [ OK ] S3ToHttpsConversionErrors/S3ToHttpsConversionErrorTest.ThrowsOnConversion/dotted_bucket_with_explicit_virtual_style (0 ms)71 > [ RUN ] S3ToHttpsConversionErrors/S3ToHttpsConversionErrorTest.ThrowsOnConversion/dotted_bucket_with_explicit_virtual_style_multi_dot72 > [ OK ] S3ToHttpsConversionErrors/S3ToHttpsConversionErrorTest.ThrowsOnConversion/dotted_bucket_with_explicit_virtual_style_multi_dot (0 ms)73 > [ RUN ] S3ToHttpsConversionErrors/S3ToHttpsConversionErrorTest.ThrowsOnConversion/dotted_bucket_with_explicit_virtual_style_custom_authority74 > [ OK ] S3ToHttpsConversionErrors/S3ToHttpsConversionErrorTest.ThrowsOnConversion/dotted_bucket_with_explicit_virtual_style_custom_authority (0 ms)75 > [ RUN ] S3ToHttpsConversionErrors/S3ToHttpsConversionErrorTest.ThrowsOnConversion/dotted_bucket_with_explicit_virtual_style_full_endpoint_url76 > [ OK ] S3ToHttpsConversionErrors/S3ToHttpsConversionErrorTest.ThrowsOnConversion/dotted_bucket_with_explicit_virtual_style_full_endpoint_url (0 ms)77 > [----------] 5 tests from S3ToHttpsConversionErrors/S3ToHttpsConversionErrorTest (0 ms total)78 >79 > [----------] Global test environment tear-down80 > [==========] 798 tests from 90 test suites ran. (1528 ms total)81 > [ PASSED ] 797 tests.82 > [ FAILED ] 1 test, listed below:83 > [ FAILED ] StoreReferenceTest.PathInfo_ssh_unbracketed_ipv6_5_from_uri84 >85 > 1 FAILED TEST86 > YOU HAVE 1 DISABLED TEST87 >88 For full logs, run:89 nix log /nix/store/pywn97agf1aqg32llx7x0qi7gdd9yvhq-nix-store-tests-run.drv90error: Cannot build '/nix/store/wdlzb0mq8kr7ixw4nkwkam6ijbkzdhb7-nix-util-tests-run.drv'.91 Reason: builder failed with exit code 1.92 Output paths:93 /nix/store/wbg4wirj55rfsaifv3nwy7mwkqa2xy5h-nix-util-tests-run94 Last 25 log lines:95 > [ RUN ] Unix/UrlPathTest.urlToString/absolute_path96 > [ OK ] Unix/UrlPathTest.urlToString/absolute_path (0 ms)97 > [ RUN ] Unix/UrlPathTest.urlToString/root_path98 > [ OK ] Unix/UrlPathTest.urlToString/root_path (0 ms)99 > [ RUN ] Unix/UrlPathTest.stringToUrl/absolute_path100 > [ OK ] Unix/UrlPathTest.stringToUrl/absolute_path (0 ms)101 > [ RUN ] Unix/UrlPathTest.stringToUrl/root_path102 > [ OK ] Unix/UrlPathTest.stringToUrl/root_path (0 ms)103 > [----------] 8 tests from Unix/UrlPathTest (0 ms total)104 >105 > [----------] Global test environment tear-down106 > [==========] 818 tests from 156 test suites ran. (3034 ms total)107 > [ PASSED ] 812 tests.108 > [ SKIPPED ] 1 test, listed below:109 > [ SKIPPED ] CompressionDecompression/CompressionDecompressionTest.invalidDecompression/none110 > [ FAILED ] 5 tests, listed below:111 > [ FAILED ] ParseURLSuccessCases/ParseURLSuccess.parsesAsExpected/5, where GetParam() = 288-byte object <31-00 00-00 00-00 00-00 A8-86 95-55 55-55 00-00 B0-C7 B0-55 55-55 00-00 04-00 00-00 00-00 00-00 68-74 74-70 00-68 74-74 70-73 00-00 00-00 00-00 02-00 00-00 00-00 00-00 00-56 B0-55 55-55 00-00 ... 00-00 00-00 00-00 00-00 68-C8 B0-55 55-55 00-00 68-C8 B0-55 55-55 00-00 00-00 00-00 00-00 00-00 A0-C8 B0-55 55-55 00-00 00-00 00-00 00-00 00-00 00-65 6C-6C 6F-00 00-00 98-C8 B0-55 55-55 00-00>112 > [ FAILED ] ParseURLSuccessCases/ParseURLSuccess.toStringRoundTrips/5, where GetParam() = 288-byte object <31-00 00-00 00-00 00-00 A8-86 95-55 55-55 00-00 B0-C7 B0-55 55-55 00-00 04-00 00-00 00-00 00-00 68-74 74-70 00-68 74-74 70-73 00-00 00-00 00-00 02-00 00-00 00-00 00-00 F0-2F B1-55 55-55 00-00 ... 00-00 00-00 00-00 00-00 68-C8 B0-55 55-55 00-00 68-C8 B0-55 55-55 00-00 00-00 00-00 00-00 00-00 A0-C8 B0-55 55-55 00-00 00-00 00-00 00-00 00-00 00-65 6C-6C 6F-00 00-00 98-C8 B0-55 55-55 00-00>113 > [ FAILED ] ParseURLSuccessCases/ParseURLSuccess.makeSureFixGitURLDoesNotModify/5, where GetParam() = 288-byte object <31-00 00-00 00-00 00-00 A8-86 95-55 55-55 00-00 B0-C7 B0-55 55-55 00-00 04-00 00-00 00-00 00-00 68-74 74-70 00-68 74-74 70-73 00-00 00-00 00-00 02-00 00-00 00-00 00-00 40-55 B1-55 55-55 00-00 ... 00-00 00-00 00-00 00-00 68-C8 B0-55 55-55 00-00 68-C8 B0-55 55-55 00-00 00-00 00-00 00-00 00-00 A0-C8 B0-55 55-55 00-00 00-00 00-00 00-00 00-00 00-65 6C-6C 6F-00 00-00 98-C8 B0-55 55-55 00-00>114 > [ FAILED ] parseURLRelative/ParseURLRelativeTestSuite.resolve/resolvesRelativePathIpv6AddressWithZoneId, where GetParam() = 336-byte object <3F-00 00-00 00-00 00-00 18-90 95-55 55-55 00-00 10-00 00-00 00-00 00-00 68-34 94-55 55-55 00-00 B0-F2 AF-55 55-55 00-00 04-00 00-00 00-00 00-00 68-74 74-70 00-00 00-00 00-00 00-00 00-00 00-00 ... A0-F3 AF-55 55-55 00-00 00-00 00-00 00-00 00-00 00-F3 AF-55 55-55 00-00 00-00 00-00 00-00 00-00 90-74 B1-55 55-55 00-00 29-00 00-00 00-00 00-00 29-00 00-00 00-00 00-00 F0-F3 AF-55 55-55 00-00>115 > [ FAILED ] parseURLRelative/ParseURLRelativeTestSuite.resolve/absOverrideWithZoneId, where GetParam() = 336-byte object <21-00 00-00 00-00 00-00 60-8E 95-55 55-55 00-00 3C-00 00-00 00-00 00-00 88-8E 95-55 55-55 00-00 B0-F2 AF-55 55-55 00-00 05-00 00-00 00-00 00-00 68-74 74-70 73-00 00-00 00-00 00-00 00-00 00-00 ... A0-F3 AF-55 55-55 00-00 00-00 00-00 00-00 00-00 00-72 61-67 00-55 00-00 00-00 00-00 00-00 00-00 C0-3B B1-55 55-55 00-00 15-00 00-00 00-00 00-00 15-00 00-00 00-00 00-00 69-64 65-00 55-55 00-00>116 >117 > 5 FAILED TESTS118 > YOU HAVE 1 DISABLED TEST119 >120 For full logs, run:121 nix log /nix/store/wdlzb0mq8kr7ixw4nkwkam6ijbkzdhb7-nix-util-tests-run.drv122error: Cannot build '/nix/store/jna1xqxfq1v5wpck4z3qn8bnj9wmd9ch-nix-util-tests-run-without-new-syscalls.drv'.123 Reason: builder failed with exit code 1.124 Output paths:125 /nix/store/jlahqnixx9m0q1c9q858imlga6ri4fhg-nix-util-tests-run-without-new-syscalls126 Last 25 log lines:127 > [ RUN ] Unix/UrlPathTest.urlToString/absolute_path128 > [ OK ] Unix/UrlPathTest.urlToString/absolute_path (0 ms)129 > [ RUN ] Unix/UrlPathTest.urlToString/root_path130 > [ OK ] Unix/UrlPathTest.urlToString/root_path (0 ms)131 > [ RUN ] Unix/UrlPathTest.stringToUrl/absolute_path132 > [ OK ] Unix/UrlPathTest.stringToUrl/absolute_path (0 ms)133 > [ RUN ] Unix/UrlPathTest.stringToUrl/root_path134 > [ OK ] Unix/UrlPathTest.stringToUrl/root_path (0 ms)135 > [----------] 8 tests from Unix/UrlPathTest (0 ms total)136 >137 > [----------] Global test environment tear-down138 > [==========] 818 tests from 156 test suites ran. (3007 ms total)139 > [ PASSED ] 812 tests.140 > [ SKIPPED ] 1 test, listed below:141 > [ SKIPPED ] CompressionDecompression/CompressionDecompressionTest.invalidDecompression/none142 > [ FAILED ] 5 tests, listed below:143 > [ FAILED ] ParseURLSuccessCases/ParseURLSuccess.parsesAsExpected/5, where GetParam() = 288-byte object <31-00 00-00 00-00 00-00 A8-86 95-55 55-55 00-00 B0-C7 B0-55 55-55 00-00 04-00 00-00 00-00 00-00 68-74 74-70 00-68 74-74 70-73 00-00 00-00 00-00 02-00 00-00 00-00 00-00 00-56 B0-55 55-55 00-00 ... 00-00 00-00 00-00 00-00 68-C8 B0-55 55-55 00-00 68-C8 B0-55 55-55 00-00 00-00 00-00 00-00 00-00 A0-C8 B0-55 55-55 00-00 00-00 00-00 00-00 00-00 00-65 6C-6C 6F-00 00-00 98-C8 B0-55 55-55 00-00>144 > [ FAILED ] ParseURLSuccessCases/ParseURLSuccess.toStringRoundTrips/5, where GetParam() = 288-byte object <31-00 00-00 00-00 00-00 A8-86 95-55 55-55 00-00 B0-C7 B0-55 55-55 00-00 04-00 00-00 00-00 00-00 68-74 74-70 00-68 74-74 70-73 00-00 00-00 00-00 02-00 00-00 00-00 00-00 F0-2F B1-55 55-55 00-00 ... 00-00 00-00 00-00 00-00 68-C8 B0-55 55-55 00-00 68-C8 B0-55 55-55 00-00 00-00 00-00 00-00 00-00 A0-C8 B0-55 55-55 00-00 00-00 00-00 00-00 00-00 00-65 6C-6C 6F-00 00-00 98-C8 B0-55 55-55 00-00>145 > [ FAILED ] ParseURLSuccessCases/ParseURLSuccess.makeSureFixGitURLDoesNotModify/5, where GetParam() = 288-byte object <31-00 00-00 00-00 00-00 A8-86 95-55 55-55 00-00 B0-C7 B0-55 55-55 00-00 04-00 00-00 00-00 00-00 68-74 74-70 00-68 74-74 70-73 00-00 00-00 00-00 02-00 00-00 00-00 00-00 40-55 B1-55 55-55 00-00 ... 00-00 00-00 00-00 00-00 68-C8 B0-55 55-55 00-00 68-C8 B0-55 55-55 00-00 00-00 00-00 00-00 00-00 A0-C8 B0-55 55-55 00-00 00-00 00-00 00-00 00-00 00-65 6C-6C 6F-00 00-00 98-C8 B0-55 55-55 00-00>146 > [ FAILED ] parseURLRelative/ParseURLRelativeTestSuite.resolve/resolvesRelativePathIpv6AddressWithZoneId, where GetParam() = 336-byte object <3F-00 00-00 00-00 00-00 18-90 95-55 55-55 00-00 10-00 00-00 00-00 00-00 68-34 94-55 55-55 00-00 B0-F2 AF-55 55-55 00-00 04-00 00-00 00-00 00-00 68-74 74-70 00-00 00-00 00-00 00-00 00-00 00-00 ... A0-F3 AF-55 55-55 00-00 00-00 00-00 00-00 00-00 00-F3 AF-55 55-55 00-00 00-00 00-00 00-00 00-00 90-74 B1-55 55-55 00-00 29-00 00-00 00-00 00-00 29-00 00-00 00-00 00-00 F0-F3 AF-55 55-55 00-00>147 > [ FAILED ] parseURLRelative/ParseURLRelativeTestSuite.resolve/absOverrideWithZoneId, where GetParam() = 336-byte object <21-00 00-00 00-00 00-00 60-8E 95-55 55-55 00-00 3C-00 00-00 00-00 00-00 88-8E 95-55 55-55 00-00 B0-F2 AF-55 55-55 00-00 05-00 00-00 00-00 00-00 68-74 74-70 73-00 00-00 00-00 00-00 00-00 00-00 ... A0-F3 AF-55 55-55 00-00 00-00 00-00 00-00 00-00 00-72 61-67 00-55 00-00 00-00 00-00 00-00 00-00 C0-3B B1-55 55-55 00-00 15-00 00-00 00-00 00-00 15-00 00-00 00-00 00-00 69-64 65-00 55-55 00-00>148 >149 > 5 FAILED TESTS150 > YOU HAVE 1 DISABLED TEST151 >152 For full logs, run:153 nix log /nix/store/jna1xqxfq1v5wpck4z3qn8bnj9wmd9ch-nix-util-tests-run-without-new-syscalls.drv154error: Cannot build '/nix/store/dpbmzyi65g0hwvj6g8669f62cc96s4lr-nix-2.36.0pre20260916_1de45ba.drv'.155 Reason: 3 dependencies failed.156 Output paths:157 /nix/store/6lx769va5cfq3wixwssm1a6wmqrwvvs5-nix-2.36.0pre20260916_1de45ba-doc158 /nix/store/bzjx147cx6i840zi3ydzd4sw6yxs9srm-nix-2.36.0pre20260916_1de45ba-man159 /nix/store/nf5f2pshfbhrqk2a6svvcbhl6flblbx3-nix-2.36.0pre20260916_1de45ba-dev160 /nix/store/wylj6yb4sbigrb1bmgjrvzd762vqbyzp-nix-2.36.0pre20260916_1de45ba161error: Cannot build '/nix/store/f14qmgwgckrj9ng6i627wyc3m7gsav7r-nix.conf.drv'.162 Reason: 1 dependency failed.163 Output paths:164 /nix/store/kaxggrlrvnwbhpa6f1nkr4jxw3s3sap5-nix.conf165error: Cannot build '/nix/store/kc36sra7230l1gsjnnfh07g3d4hbawm6-nixos-option-26.11.drv'.166 Reason: 1 dependency failed.167 Output paths:168 /nix/store/99y57vvqvrl03pbpmkpml0qn2v5yxa8s-nixos-option-26.11169error: Cannot build '/nix/store/3fkrmlg888561wnl10bb60g9zr30w9yl-nixos-rebuild-ng-26.11.drv'.170 Reason: 1 dependency failed.171 Output paths:172 /nix/store/3bcq2ccqhjppyyq5cv4ndgz4bn3rywbv-nixos-rebuild-ng-26.11173 /nix/store/fwy4c8rqg45h9z6p7bpc89b7b1161m42-nixos-rebuild-ng-26.11-dist174error: Cannot build '/nix/store/a17kllvnhhc2z2v4g1z4c864q51zv4gf-system-generators.drv'.175 Reason: 1 dependency failed.176 Output paths:177 /nix/store/q9sw3fi31gvvwvyiv9gik134iic5q6fv-system-generators178error: Cannot build '/nix/store/jrmqy9lqwa0qbwizp17chnn1vp3gh690-system-shutdown.drv'.179 Reason: 1 dependency failed.180 Output paths:181 /nix/store/0x0bafkk2l5x9lgrgc3nx08aw5210nrp-system-shutdown182error: Cannot build '/nix/store/nw3fy8m0nn5glzndcq67gkdhc07gbdgv-systemd-boot.drv'.183 Reason: 1 dependency failed.184 Output paths:185 /nix/store/x1dkx96r0syxfpq95785pppxzaya50cl-systemd-boot186error: Cannot build '/nix/store/fr4jrkkyk7zkzqbbgcwrrc6i560qfyif-tmpfiles.d.drv'.187 Reason: 1 dependency failed.188 Output paths:189 /nix/store/rczx65srphap3s30gpzwyl5q0ainmsw2-tmpfiles.d190error: Cannot build '/nix/store/izkcfdj2zlwgr6v6vf1gdxjmrdpw3gdk-unit-container-.service.drv'.191 Reason: 1 dependency failed.192 Output paths:193 /nix/store/r5qrfshi2m4rv1vdmf6d130mad534fiv-unit-container-.service194error: Cannot build '/nix/store/264q86rc8pgsddipjj9ar5jkzjghgm6n-unit-harmonia-gc.service.drv'.195 Reason: 1 dependency failed.196 Output paths:197 /nix/store/2y51fk1icxwwglv58190bdidf2zafnlq-unit-harmonia-gc.service198error: Cannot build '/nix/store/2w0vrz5yy7jd6jbhfvj88wjcg1mqmd4y-unit-nix-optimise.service.drv'.199 Reason: 1 dependency failed.200 Output paths:201 /nix/store/6h91xkqcdjhsw2gyaaqd62gyz3fymj4j-unit-nix-optimise.service202error: Cannot build '/nix/store/w0883kc1z6dljmrn6ylnbmqhma69py3y-unit-script-nix-gc-start.drv'.203 Reason: 1 dependency failed.204 Output paths:205 /nix/store/2awjd2bxj637zaxffcakz65pmy1abdl3-unit-script-nix-gc-start206error: Cannot build '/nix/store/kvgwrskpjlys3hs1j1xglm5sy4p9klhx-unit-script-update-prefetch-start.drv'.207 Reason: 1 dependency failed.208 Output paths:209 /nix/store/cm4ryg8hhi9lh6znsjjkzzm9qgn5b7hy-unit-script-update-prefetch-start210error: Cannot build '/nix/store/d69n8492yxjdxlgvil1r0hpks5pllgvm-user-generators.drv'.211 Reason: 1 dependency failed.212 Output paths:213 /nix/store/rv88yah66030qxmfan7whclmbq877s5q-user-generators214error: Cannot build '/nix/store/i0kvp1cjaz0vz0grplac2zbv61958b04-X-Restart-Triggers-nix-daemon.drv'.215 Reason: 1 dependency failed.216 Output paths:217 /nix/store/1x5764620bh0hlmxmbbi204k4gxvwava-X-Restart-Triggers-nix-daemon218error: Cannot build '/nix/store/sjjr2vkzsnypw2zd8gw6rc8ws11iw6m0-X-Restart-Triggers-systemd-tmpfiles-resetup.drv'.219 Reason: 1 dependency failed.220 Output paths:221 /nix/store/7aj99gy7ky5adlx6754bix7v976h9hl2-X-Restart-Triggers-systemd-tmpfiles-resetup222error: Cannot build '/nix/store/l4cb01a6apx5s8j5siyjdgz2vc01vlhh-install-systemd-boot.sh.drv'.223 Reason: 1 dependency failed.224 Output paths:225 /nix/store/svc4gpdyrjz70l0pn7di0cr3mxja55dk-install-systemd-boot.sh226error: Cannot build '/nix/store/z2kyrvvxlw7b7578jrxhwj40s9yg7ah8-system-path.drv'.227 Reason: 3 dependencies failed.228 Output paths:229 /nix/store/n8y733hk95srcqchgazrrfczsim8z10l-system-path230error: Cannot build '/nix/store/0c5k3547p45n0nmwzybmkqmbni0vvc7m-unit-nix-gc.service.drv'.231 Reason: 1 dependency failed.232 Output paths:233 /nix/store/mx6aakgld87kyf60afjdrpw1mjm39i27-unit-nix-gc.service234error: Cannot build '/nix/store/m2a2rjm0k2s72x8c2hb55ymp1lak5slp-unit-update-prefetch.service.drv'.235 Reason: 1 dependency failed.236 Output paths:237 /nix/store/rgszz3hj5kb66y1sr4jppfiaqflxb9p9-unit-update-prefetch.service238error: Cannot build '/nix/store/cnkn7iq1dpg0f0sbp1xi4swqv470pxdq-dbus-1.drv'.239 Reason: 1 dependency failed.240 Output paths:241 /nix/store/21v9b5vhp3q0gqln6d930bg1j0d180xr-dbus-1242error: Cannot build '/nix/store/5zc6g5mc395bx9c5vjvl6phkjny5rzcs-unit-nix-daemon.service.drv'.243 Reason: 2 dependencies failed.244 Output paths:245 /nix/store/gwkcd7qlnyv92ms5l3g1ijvs3p9xb709-unit-nix-daemon.service246error: Cannot build '/nix/store/kjcn6ak6r41znc3a4n7mb9cjs35s45h6-unit-systemd-tmpfiles-resetup.service.drv'.247 Reason: 1 dependency failed.248 Output paths:249 /nix/store/hfchbibyw170v90d583lb11sw8rwfhsp-unit-systemd-tmpfiles-resetup.service250error: Cannot build '/nix/store/gg19vhyk93ppbpr7333kzr9aim93gpkg-X-Restart-Triggers-dbus-broker.drv'.251 Reason: 1 dependency failed.252 Output paths:253 /nix/store/h08knk6iqn5aibdfycqmgs9i6976ndbh-X-Restart-Triggers-dbus-broker254error: Cannot build '/nix/store/gdb8q8s4s7q2x84h0x1niybbvkirmgsv-unit-dbus-broker.service.drv'.255 Reason: 1 dependency failed.256 Output paths:257 /nix/store/mnniz0dwbg14sjzadbrpwwrg0j4g6c6x-unit-dbus-broker.service258error: Cannot build '/nix/store/lr78krqxsylz8ym07q9mz4rl21n4mvc5-unit-dbus-broker.service.drv'.259 Reason: 1 dependency failed.260 Output paths:261 /nix/store/ahlldm04xgja1ljyr0dmdjd7qa38mksf-unit-dbus-broker.service262error: Cannot build '/nix/store/vkaq6z5csq6ccqfc5az9mlrdxn1k0mzi-user-units.drv'.263 Reason: 2 dependencies failed.264 Output paths:265 /nix/store/89g10igzsg0h6wdr7ibvmh5wdjfg5r18-user-units266error: Cannot build '/nix/store/vrqqr7dr2s72q63js0m4iwzm6v6zhcds-unit-container-hermes.service.drv'.267 Reason: 1 dependency failed.268 Output paths:269 /nix/store/23yvjxg9svf5f5k8d28mg9r5rn6kga66-unit-container-hermes.service270error: Cannot build '/nix/store/mnv78a9ykbqfpphk8rzwxjbn2bl30si4-system-units.drv'.271 Reason: 10 dependencies failed.272 Output paths:273 /nix/store/n9pw5vj6yjqjb9ahkxkmi20c0njzvwy5-system-units274error: Cannot build '/nix/store/y2y4337y18a9n6367843nkxvzfd16g1m-etc.drv'.275 Reason: 9 dependencies failed.276 Output paths:277 /nix/store/i2al4wgca2a07mz2lxgvgj11zmhn40il-etc278error: Cannot build '/nix/store/6gxmsqsh5q4i91d8s4l688ml7gdm94jd-activate.drv'.279 Reason: 1 dependency failed.280 Output paths:281 /nix/store/4i4366njh5xiqvijdmrs7qs3dxlj1ajs-activate282error: Cannot build '/nix/store/l0aa3y1yw1md7bvm9rzbbhc4b24mdi0h-nixos-system-eve-26.11.20260917.397d52b.drv'.283 Reason: 4 dependencies failed.284 Output paths:285 /nix/store/5hslk3d96szypp7sw6adzy7s0w20ch63-nixos-system-eve-26.11.20260917.397d52b