failed attributes
| status |
attribute |
duration |
| failed |
checks.x86_64-linux.nixos-bernie
- The option `nix.nixPath' defined in `/nix/store/69fzxwiaj1kasal1vxfihqid621xladj-source/nixosModules/nix-daemon.nix' and `/nix/store/69fzxwiaj1kasal1vxfihqid621xladj-source/nixosModules/nix-path.nix' has been renamed to `nix.settings.nix-path'.
|
7m 57s |
nix-store-2.36.0pre:
[1/2] Compiling C++ object libnixstore.so.2.36.0.p/meson-generated_nixstore-unity0.cpp.o
FAILED: [code=1] libnixstore.so.2.36.0.p/meson-gen …
nix-store-2.36.0pre:
[1/2] Compiling C++ object libnixstore.so.2.36.0.p/meson-generated_nixstore-unity0.cpp.o
FAILED: [code=1] libnixstore.so.2.36.0.p/meson-generated_nixstore-unity0.cpp.o
g++ -Ilibnixstore.so.2.36.0.p -I. -I.. -Iinclude -I../include -I../linux/build -Ilinux/include -I../linux/include -I../unix/build -Iunix/include -I../unix/include -I/nix/store/la1rzzb3q1wjdz50dyvh62fix41ayifa-nix-util-2.36.0pre-dev/include -I/nix/store/2ybid2fqf6nfqrwcgizv9qvvckyp6axh-libarchive-3.8.9-dev/include -I/nix/store/0dz9bi5rv50d46w8xykwdxrj4ssy6pnp-nlohmann_json-3.12.0/include -I/nix/store/aph5dkajglxjn9642bp0h3x7cwzijr52-curl-8.22.0-dev/include -I/nix/store/q2yrf8yhmj405nv9qbbraxr8wlz7n5kv-libseccomp-2.6.1-dev/include -I/nix/store/xrcjl59yi7zswbv0vzm8cmvw4vplsbgj-sqlite-3.53.3-dev/include -I/nix/store/2zgasbvd9mzmj145mxsmnzxiy7rnz…
libnixstore.so.2.36.0.p/nixstore-unity0.cpp:3:9: fatal error: /build/source/src/libstore/build/build/build-log.cc: No such file or directory
3 | #include</build/source/src/libstore/build/build/build-log.cc>
| ^~~~~~~~~~~~~~~~~~~~~~~~~~~~~~~~~~~~~~~~~~~~~~~~~~~~~
compilation terminated.
ninja: build stopped: subcommand failed.
|
| failed |
checks.x86_64-linux.nixos-dorits-laptop
- The option `nix.nixPath' defined in `/nix/store/69fzxwiaj1kasal1vxfihqid621xladj-source/nixosModules/nix-daemon.nix' and `/nix/store/69fzxwiaj1kasal1vxfihqid621xladj-source/nixosModules/nix-path.nix' has been renamed to `nix.settings.nix-path'.
|
1m 40s |
nix-store-2.36.0pre:
[1/2] Compiling C++ object libnixstore.so.2.36.0.p/meson-generated_nixstore-unity0.cpp.o
FAILED: [code=1] libnixstore.so.2.36.0.p/meson-gen …
nix-store-2.36.0pre:
[1/2] Compiling C++ object libnixstore.so.2.36.0.p/meson-generated_nixstore-unity0.cpp.o
FAILED: [code=1] libnixstore.so.2.36.0.p/meson-generated_nixstore-unity0.cpp.o
g++ -Ilibnixstore.so.2.36.0.p -I. -I.. -Iinclude -I../include -I../linux/build -Ilinux/include -I../linux/include -I../unix/build -Iunix/include -I../unix/include -I/nix/store/la1rzzb3q1wjdz50dyvh62fix41ayifa-nix-util-2.36.0pre-dev/include -I/nix/store/2ybid2fqf6nfqrwcgizv9qvvckyp6axh-libarchive-3.8.9-dev/include -I/nix/store/0dz9bi5rv50d46w8xykwdxrj4ssy6pnp-nlohmann_json-3.12.0/include -I/nix/store/aph5dkajglxjn9642bp0h3x7cwzijr52-curl-8.22.0-dev/include -I/nix/store/q2yrf8yhmj405nv9qbbraxr8wlz7n5kv-libseccomp-2.6.1-dev/include -I/nix/store/xrcjl59yi7zswbv0vzm8cmvw4vplsbgj-sqlite-3.53.3-dev/include -I/nix/store/2zgasbvd9mzmj145mxsmnzxiy7rnz…
libnixstore.so.2.36.0.p/nixstore-unity0.cpp:3:9: fatal error: /build/source/src/libstore/build/build/build-log.cc: No such file or directory
3 | #include</build/source/src/libstore/build/build/build-log.cc>
| ^~~~~~~~~~~~~~~~~~~~~~~~~~~~~~~~~~~~~~~~~~~~~~~~~~~~~
compilation terminated.
ninja: build stopped: subcommand failed.
|
| failed |
checks.x86_64-linux.nixos-jacquardmachine
- The option `nix.nixPath' defined in `/nix/store/69fzxwiaj1kasal1vxfihqid621xladj-source/nixosModules/nix-daemon.nix' and `/nix/store/69fzxwiaj1kasal1vxfihqid621xladj-source/nixosModules/nix-path.nix' has been renamed to `nix.settings.nix-path'.
|
6m 50s |
nix-store-2.36.0pre:
[1/2] Compiling C++ object libnixstore.so.2.36.0.p/meson-generated_nixstore-unity0.cpp.o
FAILED: [code=1] libnixstore.so.2.36.0.p/meson-gen …
nix-store-2.36.0pre:
[1/2] Compiling C++ object libnixstore.so.2.36.0.p/meson-generated_nixstore-unity0.cpp.o
FAILED: [code=1] libnixstore.so.2.36.0.p/meson-generated_nixstore-unity0.cpp.o
g++ -Ilibnixstore.so.2.36.0.p -I. -I.. -Iinclude -I../include -I../linux/build -Ilinux/include -I../linux/include -I../unix/build -Iunix/include -I../unix/include -I/nix/store/la1rzzb3q1wjdz50dyvh62fix41ayifa-nix-util-2.36.0pre-dev/include -I/nix/store/2ybid2fqf6nfqrwcgizv9qvvckyp6axh-libarchive-3.8.9-dev/include -I/nix/store/0dz9bi5rv50d46w8xykwdxrj4ssy6pnp-nlohmann_json-3.12.0/include -I/nix/store/aph5dkajglxjn9642bp0h3x7cwzijr52-curl-8.22.0-dev/include -I/nix/store/q2yrf8yhmj405nv9qbbraxr8wlz7n5kv-libseccomp-2.6.1-dev/include -I/nix/store/xrcjl59yi7zswbv0vzm8cmvw4vplsbgj-sqlite-3.53.3-dev/include -I/nix/store/2zgasbvd9mzmj145mxsmnzxiy7rnz…
libnixstore.so.2.36.0.p/nixstore-unity0.cpp:3:9: fatal error: /build/source/src/libstore/build/build/build-log.cc: No such file or directory
3 | #include</build/source/src/libstore/build/build/build-log.cc>
| ^~~~~~~~~~~~~~~~~~~~~~~~~~~~~~~~~~~~~~~~~~~~~~~~~~~~~
compilation terminated.
ninja: build stopped: subcommand failed.
|
| failed |
checks.x86_64-linux.nixos-matchbox
- The option `nix.nixPath' defined in `/nix/store/69fzxwiaj1kasal1vxfihqid621xladj-source/nixosModules/nix-daemon.nix' and `/nix/store/69fzxwiaj1kasal1vxfihqid621xladj-source/nixosModules/nix-path.nix' has been renamed to `nix.settings.nix-path'.
|
7m 5s |
nix-store-2.36.0pre:
[1/2] Compiling C++ object libnixstore.so.2.36.0.p/meson-generated_nixstore-unity0.cpp.o
FAILED: [code=1] libnixstore.so.2.36.0.p/meson-gen …
nix-store-2.36.0pre:
[1/2] Compiling C++ object libnixstore.so.2.36.0.p/meson-generated_nixstore-unity0.cpp.o
FAILED: [code=1] libnixstore.so.2.36.0.p/meson-generated_nixstore-unity0.cpp.o
g++ -Ilibnixstore.so.2.36.0.p -I. -I.. -Iinclude -I../include -I../linux/build -Ilinux/include -I../linux/include -I../unix/build -Iunix/include -I../unix/include -I/nix/store/la1rzzb3q1wjdz50dyvh62fix41ayifa-nix-util-2.36.0pre-dev/include -I/nix/store/2ybid2fqf6nfqrwcgizv9qvvckyp6axh-libarchive-3.8.9-dev/include -I/nix/store/0dz9bi5rv50d46w8xykwdxrj4ssy6pnp-nlohmann_json-3.12.0/include -I/nix/store/aph5dkajglxjn9642bp0h3x7cwzijr52-curl-8.22.0-dev/include -I/nix/store/q2yrf8yhmj405nv9qbbraxr8wlz7n5kv-libseccomp-2.6.1-dev/include -I/nix/store/xrcjl59yi7zswbv0vzm8cmvw4vplsbgj-sqlite-3.53.3-dev/include -I/nix/store/2zgasbvd9mzmj145mxsmnzxiy7rnz…
libnixstore.so.2.36.0.p/nixstore-unity0.cpp:3:9: fatal error: /build/source/src/libstore/build/build/build-log.cc: No such file or directory
3 | #include</build/source/src/libstore/build/build/build-log.cc>
| ^~~~~~~~~~~~~~~~~~~~~~~~~~~~~~~~~~~~~~~~~~~~~~~~~~~~~
compilation terminated.
ninja: build stopped: subcommand failed.
|
| failed |
checks.x86_64-linux.nixos-turingmachine
- The option `nix.nixPath' defined in `/nix/store/69fzxwiaj1kasal1vxfihqid621xladj-source/nixosModules/nix-daemon.nix' and `/nix/store/69fzxwiaj1kasal1vxfihqid621xladj-source/nixosModules/nix-path.nix' has been renamed to `nix.settings.nix-path'.
|
3m 51s |
breakpad-2024.02.16:
g++ -std=gnu++11 -std=gnu++17 -Wmissing-braces -Wnon-virtual-dtor -Woverloaded-virtual -Wreorder -Wsign-compare -Wunused-local-typedefs -W …
breakpad-2024.02.16:
g++ -std=gnu++11 -std=gnu++17 -Wmissing-braces -Wnon-virtual-dtor -Woverloaded-virtual -Wreorder -Wsign-compare -Wunused-local-typedefs -Wunused-variable -Wvla -Werror -fPIC -g -O2 -o src/processor/microdump_stackwalk src/processor/microdump_stackwalk.o src/common/path_helper.o src/processor/basic_code_modules.o src/processor/basic_source_line_resolver.o src/processor/call_stack.o src/processor/convert_old_arm64_context.o src/processor/cfi_frame_info.o src/processor/disassembler_x86.o src/processor/dump_context.o src/processor/dump_object.o src/processor/logging.o src/processor/microdump.o src/processor/microdump_processor.o src/processor…
g++ -std=gnu++11 -std=gnu++17 -Wmissing-braces -Wnon-virtual-dtor -Woverloaded-virtual -Wreorder -Wsign-compare -Wunused-local-typedefs -Wunused-variable -Wvla -Werror -fPIC -g -O2 -o src/tools/linux/md2core/minidump-2-core src/common/linux/memory_mapped_file.o src/common/path_helper.o src/tools/linux/md2core/minidump-2-core.o
/nix/store/y5sgl0vvrpbcwgjwpjs60r1hg0gi7i0n-binutils-2.46/bin/ld.bfd: src/processor/source_line_resolver_base.o: in function `google_breakpad::FastSourceLineResolver::Module::Module(std::__cxx11::basic_string<char, std::char_traits<char>, std::allocator<char> > const&)':
/build/breakpad/./src/processor/fast_source_line_resolver_types.h:163:(.text+0x2bc0): undefined reference to `vtable for google_breakpad::FastSourceLineResolver::Module'
/nix/store/y5sgl0vvrpbcwgjwpjs60r1hg0gi7i0n-binutils-2.46/bin/ld.bfd: /build/breakpad/./src/processor/fast_source_line_resolver_types.h:163:(.text._ZNK15google_breakpad17FastModuleFactory12CreateModuleERKNSt7__cxx1112basic_stringIcSt11char_traitsIcESaIcEEE[_ZNK15google_breakpad17FastModuleFactory12CreateModuleERKNSt7__cxx1112basic_stringIcSt11char_traitsIcESaIcEEE]+0x23): undefined reference to `vtable for google_breakpad::FastSourceLineResolver::Module'
collect2: error: ld returned 1 exit status
make: *** [Makefile:4817: src/processor/microdump_stackwalk] Error 1
make: *** Waiting for unfinished jobs....
nix-store-2.36.0pre:
[1/2] Compiling C++ object libnixstore.so.2.36.0.p/meson-generated_nixstore-unity0.cpp.o
FAILED: [code=1] libnixstore.so.2.36.0.p/meson-generated_nixstore-unity0.cpp.o
g++ -Ilibnixstore.so.2.36.0.p -I. -I.. -Iinclude -I../include -I../linux/build -Ilinux/include -I../linux/include -I../unix/build -Iunix/include -I../unix/include -I/nix/store/la1rzzb3q1wjdz50dyvh62fix41ayifa-nix-util-2.36.0pre-dev/include -I/nix/store/2ybid2fqf6nfqrwcgizv9qvvckyp6axh-libarchive-3.8.9-dev/include -I/nix/store/0dz9bi5rv50d46w8xykwdxrj4ssy6pnp-nlohmann_json-3.12.0/include -I/nix/store/aph5dkajglxjn9642bp0h3x7cwzijr52-curl-8.22.0-dev/include -I/nix/store/q2yrf8yhmj405nv9qbbraxr8wlz7n5kv-libseccomp-2.6.1-dev/include -I/nix/store/xrcjl59yi7zswbv0vzm8cmvw4vplsbgj-sqlite-3.53.3-dev/include -I/nix/store/2zgasbvd9mzmj145mxsmnzxiy7rnz…
libnixstore.so.2.36.0.p/nixstore-unity0.cpp:3:9: fatal error: /build/source/src/libstore/build/build/build-log.cc: No such file or directory
3 | #include</build/source/src/libstore/build/build/build-log.cc>
| ^~~~~~~~~~~~~~~~~~~~~~~~~~~~~~~~~~~~~~~~~~~~~~~~~~~~~
compilation terminated.
ninja: build stopped: subcommand failed.
|
| failed |
checks.aarch64-darwin.darwin-evo
|
13m 40s |
nix-store-2.36.0pre:
[1/2] Compiling C++ object libnixstore.2.36.0.dylib.p/meson-generated_nixstore-unity0.cpp.o
FAILED: [code=1] libnixstore.2.36.0.dylib.p/mes …
nix-store-2.36.0pre:
[1/2] Compiling C++ object libnixstore.2.36.0.dylib.p/meson-generated_nixstore-unity0.cpp.o
FAILED: [code=1] libnixstore.2.36.0.dylib.p/meson-generated_nixstore-unity0.cpp.o
clang++ -Ilibnixstore.2.36.0.dylib.p -I. -I.. -Iinclude -I../include -I../darwin/build -I../unix/build -Iunix/include -I../unix/include -I/nix/store/7asvmiiws8zz3c8krxpypgrx59a45da6-nix-util-2.36.0pre-dev/include -I/nix/store/kp61vxk6fc6mygavw8jbcp46rv0vhykr-libarchive-3.8.9-dev/include -I/nix/store/isybn536j7an8p4nrj0pl5ykwda6nxqq-nlohmann_json-3.12.0/include -I/nix/store/qdhck8lm021frd70ixahv7r9gsl2vwl9-curl-8.22.0-dev/include -I/nix/store/r9cljv2bvqi3ci3n6m0z0wi3ldpvlyzq-sqlite-3.53.3-dev/include -I/nix/store/3lahs2g34zsq4r6cn4yp25rxzy1h7zgq-aws-crt-cpp-0.34.3-dev/include -I/nix/store/6jh8nc6lcl14vgxdjk3icr2r1yfzdql1-aws-c-mqtt-0.13.3/inc…
libnixstore.2.36.0.dylib.p/nixstore-unity0.cpp:3:9: fatal error: '/private/var/tb/5/scratch/2c2d3f5f112924c4/build/source/src/libstore/build/build/build-log.cc' file not found
3 | #include</private/var/tb/5/scratch/2c2d3f5f112924c4/build/source/src/libstore/build/build/build-log.cc>
| ^~~~~~~~~~~~~~~~~~~~~~~~~~~~~~~~~~~~~~~~~~~~~~~~~~~~~~~~~~~~~~~~~~~~~~~~~~~~~~~~~~~~~~~~~~~~~~~
1 error generated.
ninja: build stopped: subcommand failed.
|
| failed |
checks.aarch64-darwin.home-manager-common
|
10m 44s |
nix-store-2.36.0pre:
[1/2] Compiling C++ object libnixstore.2.36.0.dylib.p/meson-generated_nixstore-unity0.cpp.o
FAILED: [code=1] libnixstore.2.36.0.dylib.p/mes …
nix-store-2.36.0pre:
[1/2] Compiling C++ object libnixstore.2.36.0.dylib.p/meson-generated_nixstore-unity0.cpp.o
FAILED: [code=1] libnixstore.2.36.0.dylib.p/meson-generated_nixstore-unity0.cpp.o
clang++ -Ilibnixstore.2.36.0.dylib.p -I. -I.. -Iinclude -I../include -I../darwin/build -I../unix/build -Iunix/include -I../unix/include -I/nix/store/7asvmiiws8zz3c8krxpypgrx59a45da6-nix-util-2.36.0pre-dev/include -I/nix/store/kp61vxk6fc6mygavw8jbcp46rv0vhykr-libarchive-3.8.9-dev/include -I/nix/store/isybn536j7an8p4nrj0pl5ykwda6nxqq-nlohmann_json-3.12.0/include -I/nix/store/qdhck8lm021frd70ixahv7r9gsl2vwl9-curl-8.22.0-dev/include -I/nix/store/r9cljv2bvqi3ci3n6m0z0wi3ldpvlyzq-sqlite-3.53.3-dev/include -I/nix/store/3lahs2g34zsq4r6cn4yp25rxzy1h7zgq-aws-crt-cpp-0.34.3-dev/include -I/nix/store/6jh8nc6lcl14vgxdjk3icr2r1yfzdql1-aws-c-mqtt-0.13.3/inc…
libnixstore.2.36.0.dylib.p/nixstore-unity0.cpp:3:9: fatal error: '/private/var/tb/5/scratch/4b2591c77664467e/build/source/src/libstore/build/build/build-log.cc' file not found
3 | #include</private/var/tb/5/scratch/4b2591c77664467e/build/source/src/libstore/build/build/build-log.cc>
| ^~~~~~~~~~~~~~~~~~~~~~~~~~~~~~~~~~~~~~~~~~~~~~~~~~~~~~~~~~~~~~~~~~~~~~~~~~~~~~~~~~~~~~~~~~~~~~~
1 error generated.
ninja: build stopped: subcommand failed.
|
| failed eval |
checks.aarch64-darwin.home-manager-macos
|
— |
error:
… while calling the 'derivationStrict' builtin
at «nix-internal»/derivation-internal.nix:37:12:
36|
37| strict = …
error:
… while calling the 'derivationStrict' builtin
at «nix-internal»/derivation-internal.nix:37:12:
36|
37| strict = derivationStrict drvAttrs;
| ^
38|
… while evaluating derivation 'home-manager-generation'
whose name attribute is located at «git+https://github.com/Mic92/nixpkgs?ref=main&rev=7c0a10b72c9f69917b6020f8f4d1d6ef1980b7ec&shallow=1»/pkgs/stdenv/generic/make-derivation.nix:651:11
… while evaluating attribute 'buildCommand' of derivation 'home-manager-generation'
at «git+https://github.com/Mic92/nixpkgs?ref=main&rev=7c0a10b72c9f69917b6020f8f4d1d6ef1980b7ec&shallow=1»/pkgs/build-support/trivial-builders/default.nix:88:9:
87| inherit name;
88| buildCommand = lib.toFunction buildCommand finalAttrs;
| ^
89| passAsFile = defaultPassAsFile ++ (userAttrs.passAsFile or [ ]);
… while evaluating the option `home.activation.checkFilesChanged.data':
… while evaluating definitions from `/nix/store/hapmafc7idql333c350rhda0azc45ma4-source/modules/files.nix':
… while evaluating the option `home.file."Library/Fonts/.home-manager-fonts-version".onChange':
… while evaluating definitions from `/nix/store/hapmafc7idql333c350rhda0azc45ma4-source/modules/targets/darwin/fonts.nix':
(stack trace truncated; use '--show-trace' to show the full, detailed trace)
error: Refusing to evaluate package 'radicle-node-1.10.3' in /nix/store/c73xscvypq4slnj3k075sy076gfnyb8q-source/pkgs/by-name/ra/radicle-node/package.nix:165 because it is marked as insecure
Known issues:
- Private repositories are insecure: traffic between nodes is not encrypted and not authenticated.
You can install it anyway by allowing this package, using the
following methods:
a) To temporarily allow all insecure packages, you can use an environment
variable for a single invocation of the nix tools:
$ export NIXPKGS_ALLOW_INSECURE=1
Note: When using `nix shell`, `nix build`, `nix develop`, etc with a flake,
then pass `--impure` in order to allow use of environment variables.
b) for `nixos-rebuild` you can add ‘radicle-node-1.10.3’ to
`nixpkgs.config.permittedInsecurePackages` in the configuration.nix,
like so:
{
nixpkgs.config.permittedInsecurePackages = [
"radicle-node-1.10.3"
];
}
c) For `nix-env`, `nix-build`, `nix-shell` or any other Nix command you can add
‘radicle-node-1.10.3’ to `permittedInsecurePackages` in
~/.config/nixpkgs/config.nix, like so:
{
permittedInsecurePackages = [
"radicle-node-1.10.3"
];
}
|
| failed |
checks.aarch64-darwin.home-manager-utm-vm
|
6m 53s |
nix-store-2.36.0pre:
[1/2] Compiling C++ object libnixstore.2.36.0.dylib.p/meson-generated_nixstore-unity0.cpp.o
FAILED: [code=1] libnixstore.2.36.0.dylib.p/mes …
nix-store-2.36.0pre:
[1/2] Compiling C++ object libnixstore.2.36.0.dylib.p/meson-generated_nixstore-unity0.cpp.o
FAILED: [code=1] libnixstore.2.36.0.dylib.p/meson-generated_nixstore-unity0.cpp.o
clang++ -Ilibnixstore.2.36.0.dylib.p -I. -I.. -Iinclude -I../include -I../darwin/build -I../unix/build -Iunix/include -I../unix/include -I/nix/store/7asvmiiws8zz3c8krxpypgrx59a45da6-nix-util-2.36.0pre-dev/include -I/nix/store/kp61vxk6fc6mygavw8jbcp46rv0vhykr-libarchive-3.8.9-dev/include -I/nix/store/isybn536j7an8p4nrj0pl5ykwda6nxqq-nlohmann_json-3.12.0/include -I/nix/store/qdhck8lm021frd70ixahv7r9gsl2vwl9-curl-8.22.0-dev/include -I/nix/store/r9cljv2bvqi3ci3n6m0z0wi3ldpvlyzq-sqlite-3.53.3-dev/include -I/nix/store/3lahs2g34zsq4r6cn4yp25rxzy1h7zgq-aws-crt-cpp-0.34.3-dev/include -I/nix/store/6jh8nc6lcl14vgxdjk3icr2r1yfzdql1-aws-c-mqtt-0.13.3/inc…
libnixstore.2.36.0.dylib.p/nixstore-unity0.cpp:3:9: fatal error: '/private/var/tb/5/scratch/d2bd64553291f806/build/source/src/libstore/build/build/build-log.cc' file not found
3 | #include</private/var/tb/5/scratch/d2bd64553291f806/build/source/src/libstore/build/build/build-log.cc>
| ^~~~~~~~~~~~~~~~~~~~~~~~~~~~~~~~~~~~~~~~~~~~~~~~~~~~~~~~~~~~~~~~~~~~~~~~~~~~~~~~~~~~~~~~~~~~~~~
1 error generated.
ninja: build stopped: subcommand failed.
|
| dependency failed |
checks.aarch64-linux.home-manager-common
|
— |
| dependency failed |
checks.aarch64-linux.home-manager-utm-vm
|
— |
| failed eval |
checks.aarch64-linux.nixos-blob64
|
— |
error:
… while evaluating a branch condition
at «string»:25:5:
24| v:
25| if !builtins.isAttrs v || isDrv v then
…
error:
… while evaluating a branch condition
at «string»:25:5:
24| v:
25| if !builtins.isAttrs v || isDrv v then
| ^
26| v
… in the left operand of the OR (||) operator
at «string»:25:28:
24| v:
25| if !builtins.isAttrs v || isDrv v then
| ^
26| v
… while evaluating the option `system.build.toplevel':
… while evaluating definitions from `/nix/store/c73xscvypq4slnj3k075sy076gfnyb8q-source/nixos/modules/system/activation/top-level.nix':
… while evaluating the option `systemd.services.radicle-node.serviceConfig':
… while evaluating definitions from `/nix/store/c73xscvypq4slnj3k075sy076gfnyb8q-source/nixos/modules/services/misc/radicle.nix':
(stack trace truncated; use '--show-trace' to show the full, detailed trace)
error: Refusing to evaluate package 'radicle-node-1.10.3' in /nix/store/c73xscvypq4slnj3k075sy076gfnyb8q-source/pkgs/by-name/ra/radicle-node/package.nix:165 because it is marked as insecure
Known issues:
- Private repositories are insecure: traffic between nodes is not encrypted and not authenticated.
You can install it anyway by allowing this package, using the
following methods:
a) To temporarily allow all insecure packages, you can use an environment
variable for a single invocation of the nix tools:
$ export NIXPKGS_ALLOW_INSECURE=1
Note: When using `nix shell`, `nix build`, `nix develop`, etc with a flake,
then pass `--impure` in order to allow use of environment variables.
b) for `nixos-rebuild` you can add ‘radicle-node-1.10.3’ to
`nixpkgs.config.permittedInsecurePackages` in the configuration.nix,
like so:
{
nixpkgs.config.permittedInsecurePackages = [
"radicle-node-1.10.3"
];
}
c) For `nix-env`, `nix-build`, `nix-shell` or any other Nix command you can add
‘radicle-node-1.10.3’ to `permittedInsecurePackages` in
~/.config/nixpkgs/config.nix, like so:
{
permittedInsecurePackages = [
"radicle-node-1.10.3"
];
}
|
| failed |
checks.aarch64-linux.package-nvim-open
|
35s |
neovim-remote-2.5.1:
show_message(address)
if options.nostart:
> sys.exit(1)
E SystemExit: 1
nvr/nvr.py: …
neovim-remote-2.5.1:
show_message(address)
if options.nostart:
> sys.exit(1)
E SystemExit: 1
nvr/nvr.py:441: SystemExit
=========================== short test summary info ============================
FAILED tests/test_nvr.py::test_escape_filenames_properly - SystemExit: 1
========================= 1 failed, 3 passed in 4.19s ==========================
|
| failed |
checks.x86_64-linux.home-manager-bernie
|
7m 19s |
nix-store-2.36.0pre:
[1/2] Compiling C++ object libnixstore.so.2.36.0.p/meson-generated_nixstore-unity0.cpp.o
FAILED: [code=1] libnixstore.so.2.36.0.p/meson-gen …
nix-store-2.36.0pre:
[1/2] Compiling C++ object libnixstore.so.2.36.0.p/meson-generated_nixstore-unity0.cpp.o
FAILED: [code=1] libnixstore.so.2.36.0.p/meson-generated_nixstore-unity0.cpp.o
g++ -Ilibnixstore.so.2.36.0.p -I. -I.. -Iinclude -I../include -I../linux/build -Ilinux/include -I../linux/include -I../unix/build -Iunix/include -I../unix/include -I/nix/store/la1rzzb3q1wjdz50dyvh62fix41ayifa-nix-util-2.36.0pre-dev/include -I/nix/store/2ybid2fqf6nfqrwcgizv9qvvckyp6axh-libarchive-3.8.9-dev/include -I/nix/store/0dz9bi5rv50d46w8xykwdxrj4ssy6pnp-nlohmann_json-3.12.0/include -I/nix/store/aph5dkajglxjn9642bp0h3x7cwzijr52-curl-8.22.0-dev/include -I/nix/store/q2yrf8yhmj405nv9qbbraxr8wlz7n5kv-libseccomp-2.6.1-dev/include -I/nix/store/xrcjl59yi7zswbv0vzm8cmvw4vplsbgj-sqlite-3.53.3-dev/include -I/nix/store/2zgasbvd9mzmj145mxsmnzxiy7rnz…
libnixstore.so.2.36.0.p/nixstore-unity0.cpp:3:9: fatal error: /build/source/src/libstore/build/build/build-log.cc: No such file or directory
3 | #include</build/source/src/libstore/build/build/build-log.cc>
| ^~~~~~~~~~~~~~~~~~~~~~~~~~~~~~~~~~~~~~~~~~~~~~~~~~~~~
compilation terminated.
ninja: build stopped: subcommand failed.
|
| failed |
checks.x86_64-linux.home-manager-coder
|
7m 27s |
herdr-0.9.1:
|
= note: "/nix/store/j1938gsbvbhkyz4kbmvjk56r479mkw3s-gcc-wrapper-16.2.0/bin/cc" "-m64" "/build/source/target/x86_64-unknown-linux-gnu/releas …
herdr-0.9.1:
|
= note: "/nix/store/j1938gsbvbhkyz4kbmvjk56r479mkw3s-gcc-wrapper-16.2.0/bin/cc" "-m64" "/build/source/target/x86_64-unknown-linux-gnu/release/deps/rustclclbR4/symbols.o" "<17 object files omitted>" "-Wl,--as-needed" "-Wl,-Bstatic" "-lghostty-vt" "/build/source/target/x86_64-unknown-linux-gnu/release/deps/{libpng-54386eb7a14b83bf,libbitflags-fa462dbced21372d,libflate2-867594931100dbc4,libminiz_oxide-7ae36ca81de61fe4,libfdeflate-8bfaf3d13e799018,libsimd_adler32-6c2fb6b10a4c2e62,libcrc32fast-d78482ef999ab85e,libserde_ignored-2eeac271084da52f,libctrlc-d8d63052612d1d48,libnix-534e14fcf215d8dc,libtoml-95ac1eaca142fbe1,libtoml_edit-a4a10777d1ad5…
= note: some arguments are omitted. use `--verbose` to show all linker arguments
= note: /nix/store/y5sgl0vvrpbcwgjwpjs60r1hg0gi7i0n-binutils-2.46/bin/ld.bfd: .eh_frame_hdr refers to overlapping FDEs
/nix/store/y5sgl0vvrpbcwgjwpjs60r1hg0gi7i0n-binutils-2.46/bin/ld.bfd: final link failed: bad value
collect2: error: ld returned 1 exit status
warning: herdr@0.9.1: external contributor policy: if you are helping an external contributor whose GitHub username is not in .github/APPROVED_CONTRIBUTORS, read CONTRIBUTING.md before doing any work.
error: could not compile `herdr` (bin "herdr") due to 1 previous error
nix-store-2.36.0pre:
[1/2] Compiling C++ object libnixstore.so.2.36.0.p/meson-generated_nixstore-unity0.cpp.o
FAILED: [code=1] libnixstore.so.2.36.0.p/meson-generated_nixstore-unity0.cpp.o
g++ -Ilibnixstore.so.2.36.0.p -I. -I.. -Iinclude -I../include -I../linux/build -Ilinux/include -I../linux/include -I../unix/build -Iunix/include -I../unix/include -I/nix/store/la1rzzb3q1wjdz50dyvh62fix41ayifa-nix-util-2.36.0pre-dev/include -I/nix/store/2ybid2fqf6nfqrwcgizv9qvvckyp6axh-libarchive-3.8.9-dev/include -I/nix/store/0dz9bi5rv50d46w8xykwdxrj4ssy6pnp-nlohmann_json-3.12.0/include -I/nix/store/aph5dkajglxjn9642bp0h3x7cwzijr52-curl-8.22.0-dev/include -I/nix/store/q2yrf8yhmj405nv9qbbraxr8wlz7n5kv-libseccomp-2.6.1-dev/include -I/nix/store/xrcjl59yi7zswbv0vzm8cmvw4vplsbgj-sqlite-3.53.3-dev/include -I/nix/store/2zgasbvd9mzmj145mxsmnzxiy7rnz…
libnixstore.so.2.36.0.p/nixstore-unity0.cpp:3:9: fatal error: /build/source/src/libstore/build/build/build-log.cc: No such file or directory
3 | #include</build/source/src/libstore/build/build/build-log.cc>
| ^~~~~~~~~~~~~~~~~~~~~~~~~~~~~~~~~~~~~~~~~~~~~~~~~~~~~
compilation terminated.
ninja: build stopped: subcommand failed.
|
| failed |
checks.x86_64-linux.home-manager-common
|
7m 21s |
nix-store-2.36.0pre:
[1/2] Compiling C++ object libnixstore.so.2.36.0.p/meson-generated_nixstore-unity0.cpp.o
FAILED: [code=1] libnixstore.so.2.36.0.p/meson-gen …
nix-store-2.36.0pre:
[1/2] Compiling C++ object libnixstore.so.2.36.0.p/meson-generated_nixstore-unity0.cpp.o
FAILED: [code=1] libnixstore.so.2.36.0.p/meson-generated_nixstore-unity0.cpp.o
g++ -Ilibnixstore.so.2.36.0.p -I. -I.. -Iinclude -I../include -I../linux/build -Ilinux/include -I../linux/include -I../unix/build -Iunix/include -I../unix/include -I/nix/store/la1rzzb3q1wjdz50dyvh62fix41ayifa-nix-util-2.36.0pre-dev/include -I/nix/store/2ybid2fqf6nfqrwcgizv9qvvckyp6axh-libarchive-3.8.9-dev/include -I/nix/store/0dz9bi5rv50d46w8xykwdxrj4ssy6pnp-nlohmann_json-3.12.0/include -I/nix/store/aph5dkajglxjn9642bp0h3x7cwzijr52-curl-8.22.0-dev/include -I/nix/store/q2yrf8yhmj405nv9qbbraxr8wlz7n5kv-libseccomp-2.6.1-dev/include -I/nix/store/xrcjl59yi7zswbv0vzm8cmvw4vplsbgj-sqlite-3.53.3-dev/include -I/nix/store/2zgasbvd9mzmj145mxsmnzxiy7rnz…
libnixstore.so.2.36.0.p/nixstore-unity0.cpp:3:9: fatal error: /build/source/src/libstore/build/build/build-log.cc: No such file or directory
3 | #include</build/source/src/libstore/build/build/build-log.cc>
| ^~~~~~~~~~~~~~~~~~~~~~~~~~~~~~~~~~~~~~~~~~~~~~~~~~~~~
compilation terminated.
ninja: build stopped: subcommand failed.
|
| failed eval |
checks.x86_64-linux.home-manager-desktop
|
— |
error:
… while calling the 'derivationStrict' builtin
at «nix-internal»/derivation-internal.nix:37:12:
36|
37| strict = …
error:
… while calling the 'derivationStrict' builtin
at «nix-internal»/derivation-internal.nix:37:12:
36|
37| strict = derivationStrict drvAttrs;
| ^
38|
… while evaluating derivation 'home-manager-generation'
whose name attribute is located at «git+https://github.com/Mic92/nixpkgs?ref=main&rev=7c0a10b72c9f69917b6020f8f4d1d6ef1980b7ec&shallow=1»/pkgs/stdenv/generic/make-derivation.nix:651:11
… while evaluating attribute 'buildCommand' of derivation 'home-manager-generation'
at «git+https://github.com/Mic92/nixpkgs?ref=main&rev=7c0a10b72c9f69917b6020f8f4d1d6ef1980b7ec&shallow=1»/pkgs/build-support/trivial-builders/default.nix:88:9:
87| inherit name;
88| buildCommand = lib.toFunction buildCommand finalAttrs;
| ^
89| passAsFile = defaultPassAsFile ++ (userAttrs.passAsFile or [ ]);
… while evaluating the option `home.activation.installPackages.data':
… while evaluating definitions from `/nix/store/hapmafc7idql333c350rhda0azc45ma4-source/modules/home-environment.nix':
(stack trace truncated; use '--show-trace' to show the full, detailed trace)
error: Refusing to evaluate package 'radicle-node-1.10.3' in /nix/store/c73xscvypq4slnj3k075sy076gfnyb8q-source/pkgs/by-name/ra/radicle-node/package.nix:165 because it is marked as insecure
Known issues:
- Private repositories are insecure: traffic between nodes is not encrypted and not authenticated.
You can install it anyway by allowing this package, using the
following methods:
a) To temporarily allow all insecure packages, you can use an environment
variable for a single invocation of the nix tools:
$ export NIXPKGS_ALLOW_INSECURE=1
Note: When using `nix shell`, `nix build`, `nix develop`, etc with a flake,
then pass `--impure` in order to allow use of environment variables.
b) for `nixos-rebuild` you can add ‘radicle-node-1.10.3’ to
`nixpkgs.config.permittedInsecurePackages` in the configuration.nix,
like so:
{
nixpkgs.config.permittedInsecurePackages = [
"radicle-node-1.10.3"
];
}
c) For `nix-env`, `nix-build`, `nix-shell` or any other Nix command you can add
‘radicle-node-1.10.3’ to `permittedInsecurePackages` in
~/.config/nixpkgs/config.nix, like so:
{
permittedInsecurePackages = [
"radicle-node-1.10.3"
];
}
|
| failed |
checks.x86_64-linux.home-manager-eve
|
12m 44s |
nix-store-2.36.0pre:
[1/2] Compiling C++ object libnixstore.so.2.36.0.p/meson-generated_nixstore-unity0.cpp.o
FAILED: [code=1] libnixstore.so.2.36.0.p/meson-gen …
nix-store-2.36.0pre:
[1/2] Compiling C++ object libnixstore.so.2.36.0.p/meson-generated_nixstore-unity0.cpp.o
FAILED: [code=1] libnixstore.so.2.36.0.p/meson-generated_nixstore-unity0.cpp.o
g++ -Ilibnixstore.so.2.36.0.p -I. -I.. -Iinclude -I../include -I../linux/build -Ilinux/include -I../linux/include -I../unix/build -Iunix/include -I../unix/include -I/nix/store/la1rzzb3q1wjdz50dyvh62fix41ayifa-nix-util-2.36.0pre-dev/include -I/nix/store/2ybid2fqf6nfqrwcgizv9qvvckyp6axh-libarchive-3.8.9-dev/include -I/nix/store/0dz9bi5rv50d46w8xykwdxrj4ssy6pnp-nlohmann_json-3.12.0/include -I/nix/store/aph5dkajglxjn9642bp0h3x7cwzijr52-curl-8.22.0-dev/include -I/nix/store/q2yrf8yhmj405nv9qbbraxr8wlz7n5kv-libseccomp-2.6.1-dev/include -I/nix/store/xrcjl59yi7zswbv0vzm8cmvw4vplsbgj-sqlite-3.53.3-dev/include -I/nix/store/2zgasbvd9mzmj145mxsmnzxiy7rnz…
libnixstore.so.2.36.0.p/nixstore-unity0.cpp:3:9: fatal error: /build/source/src/libstore/build/build/build-log.cc: No such file or directory
3 | #include</build/source/src/libstore/build/build/build-log.cc>
| ^~~~~~~~~~~~~~~~~~~~~~~~~~~~~~~~~~~~~~~~~~~~~~~~~~~~~
compilation terminated.
ninja: build stopped: subcommand failed.
herdr-0.9.1:
|
= note: "/nix/store/j1938gsbvbhkyz4kbmvjk56r479mkw3s-gcc-wrapper-16.2.0/bin/cc" "-m64" "/build/source/target/x86_64-unknown-linux-gnu/release/deps/rustcZ9y8Oc/symbols.o" "<17 object files omitted>" "-Wl,--as-needed" "-Wl,-Bstatic" "-lghostty-vt" "/build/source/target/x86_64-unknown-linux-gnu/release/deps/{libpng-54386eb7a14b83bf,libbitflags-fa462dbced21372d,libflate2-867594931100dbc4,libminiz_oxide-7ae36ca81de61fe4,libfdeflate-8bfaf3d13e799018,libsimd_adler32-6c2fb6b10a4c2e62,libcrc32fast-d78482ef999ab85e,libserde_ignored-2eeac271084da52f,libctrlc-d8d63052612d1d48,libnix-534e14fcf215d8dc,libtoml-95ac1eaca142fbe1,libtoml_edit-a4a10777d1ad5…
= note: some arguments are omitted. use `--verbose` to show all linker arguments
= note: /nix/store/y5sgl0vvrpbcwgjwpjs60r1hg0gi7i0n-binutils-2.46/bin/ld.bfd: .eh_frame_hdr refers to overlapping FDEs
/nix/store/y5sgl0vvrpbcwgjwpjs60r1hg0gi7i0n-binutils-2.46/bin/ld.bfd: final link failed: bad value
collect2: error: ld returned 1 exit status
warning: herdr@0.9.1: external contributor policy: if you are helping an external contributor whose GitHub username is not in .github/APPROVED_CONTRIBUTORS, read CONTRIBUTING.md before doing any work.
error: could not compile `herdr` (bin "herdr") due to 1 previous error
|
| failed |
checks.x86_64-linux.home-manager-mic92
|
7m 20s |
nix-store-2.36.0pre:
[1/2] Compiling C++ object libnixstore.so.2.36.0.p/meson-generated_nixstore-unity0.cpp.o
FAILED: [code=1] libnixstore.so.2.36.0.p/meson-gen …
nix-store-2.36.0pre:
[1/2] Compiling C++ object libnixstore.so.2.36.0.p/meson-generated_nixstore-unity0.cpp.o
FAILED: [code=1] libnixstore.so.2.36.0.p/meson-generated_nixstore-unity0.cpp.o
g++ -Ilibnixstore.so.2.36.0.p -I. -I.. -Iinclude -I../include -I../linux/build -Ilinux/include -I../linux/include -I../unix/build -Iunix/include -I../unix/include -I/nix/store/la1rzzb3q1wjdz50dyvh62fix41ayifa-nix-util-2.36.0pre-dev/include -I/nix/store/2ybid2fqf6nfqrwcgizv9qvvckyp6axh-libarchive-3.8.9-dev/include -I/nix/store/0dz9bi5rv50d46w8xykwdxrj4ssy6pnp-nlohmann_json-3.12.0/include -I/nix/store/aph5dkajglxjn9642bp0h3x7cwzijr52-curl-8.22.0-dev/include -I/nix/store/q2yrf8yhmj405nv9qbbraxr8wlz7n5kv-libseccomp-2.6.1-dev/include -I/nix/store/xrcjl59yi7zswbv0vzm8cmvw4vplsbgj-sqlite-3.53.3-dev/include -I/nix/store/2zgasbvd9mzmj145mxsmnzxiy7rnz…
libnixstore.so.2.36.0.p/nixstore-unity0.cpp:3:9: fatal error: /build/source/src/libstore/build/build/build-log.cc: No such file or directory
3 | #include</build/source/src/libstore/build/build/build-log.cc>
| ^~~~~~~~~~~~~~~~~~~~~~~~~~~~~~~~~~~~~~~~~~~~~~~~~~~~~
compilation terminated.
ninja: build stopped: subcommand failed.
|
| failed |
checks.x86_64-linux.home-manager-utm-vm
|
9m 56s |
nix-store-2.36.0pre:
[1/2] Compiling C++ object libnixstore.so.2.36.0.p/meson-generated_nixstore-unity0.cpp.o
FAILED: [code=1] libnixstore.so.2.36.0.p/meson-gen …
nix-store-2.36.0pre:
[1/2] Compiling C++ object libnixstore.so.2.36.0.p/meson-generated_nixstore-unity0.cpp.o
FAILED: [code=1] libnixstore.so.2.36.0.p/meson-generated_nixstore-unity0.cpp.o
g++ -Ilibnixstore.so.2.36.0.p -I. -I.. -Iinclude -I../include -I../linux/build -Ilinux/include -I../linux/include -I../unix/build -Iunix/include -I../unix/include -I/nix/store/la1rzzb3q1wjdz50dyvh62fix41ayifa-nix-util-2.36.0pre-dev/include -I/nix/store/2ybid2fqf6nfqrwcgizv9qvvckyp6axh-libarchive-3.8.9-dev/include -I/nix/store/0dz9bi5rv50d46w8xykwdxrj4ssy6pnp-nlohmann_json-3.12.0/include -I/nix/store/aph5dkajglxjn9642bp0h3x7cwzijr52-curl-8.22.0-dev/include -I/nix/store/q2yrf8yhmj405nv9qbbraxr8wlz7n5kv-libseccomp-2.6.1-dev/include -I/nix/store/xrcjl59yi7zswbv0vzm8cmvw4vplsbgj-sqlite-3.53.3-dev/include -I/nix/store/2zgasbvd9mzmj145mxsmnzxiy7rnz…
libnixstore.so.2.36.0.p/nixstore-unity0.cpp:3:9: fatal error: /build/source/src/libstore/build/build/build-log.cc: No such file or directory
3 | #include</build/source/src/libstore/build/build/build-log.cc>
| ^~~~~~~~~~~~~~~~~~~~~~~~~~~~~~~~~~~~~~~~~~~~~~~~~~~~~
compilation terminated.
ninja: build stopped: subcommand failed.
herdr-0.9.1:
|
= note: "/nix/store/j1938gsbvbhkyz4kbmvjk56r479mkw3s-gcc-wrapper-16.2.0/bin/cc" "-m64" "/build/source/target/x86_64-unknown-linux-gnu/release/deps/rustc843eOM/symbols.o" "<17 object files omitted>" "-Wl,--as-needed" "-Wl,-Bstatic" "-lghostty-vt" "/build/source/target/x86_64-unknown-linux-gnu/release/deps/{libpng-54386eb7a14b83bf,libbitflags-fa462dbced21372d,libflate2-867594931100dbc4,libminiz_oxide-7ae36ca81de61fe4,libfdeflate-8bfaf3d13e799018,libsimd_adler32-6c2fb6b10a4c2e62,libcrc32fast-d78482ef999ab85e,libserde_ignored-2eeac271084da52f,libctrlc-d8d63052612d1d48,libnix-534e14fcf215d8dc,libtoml-95ac1eaca142fbe1,libtoml_edit-a4a10777d1ad5…
= note: some arguments are omitted. use `--verbose` to show all linker arguments
= note: /nix/store/y5sgl0vvrpbcwgjwpjs60r1hg0gi7i0n-binutils-2.46/bin/ld.bfd: .eh_frame_hdr refers to overlapping FDEs
/nix/store/y5sgl0vvrpbcwgjwpjs60r1hg0gi7i0n-binutils-2.46/bin/ld.bfd: final link failed: bad value
collect2: error: ld returned 1 exit status
warning: herdr@0.9.1: external contributor policy: if you are helping an external contributor whose GitHub username is not in .github/APPROVED_CONTRIBUTORS, read CONTRIBUTING.md before doing any work.
error: could not compile `herdr` (bin "herdr") due to 1 previous error
|
| failed eval |
checks.x86_64-linux.nixos-eva
|
— |
error:
… while evaluating a branch condition
at «string»:25:5:
24| v:
25| if !builtins.isAttrs v || isDrv v then
…
error:
… while evaluating a branch condition
at «string»:25:5:
24| v:
25| if !builtins.isAttrs v || isDrv v then
| ^
26| v
… in the left operand of the OR (||) operator
at «string»:25:28:
24| v:
25| if !builtins.isAttrs v || isDrv v then
| ^
26| v
… while evaluating the option `system.build.toplevel':
… while evaluating definitions from `/nix/store/c73xscvypq4slnj3k075sy076gfnyb8q-source/nixos/modules/system/activation/top-level.nix':
… while evaluating the option `systemd.services.radicle-node.serviceConfig':
… while evaluating definitions from `/nix/store/c73xscvypq4slnj3k075sy076gfnyb8q-source/nixos/modules/services/misc/radicle.nix':
(stack trace truncated; use '--show-trace' to show the full, detailed trace)
error: Refusing to evaluate package 'radicle-node-1.10.3' in /nix/store/c73xscvypq4slnj3k075sy076gfnyb8q-source/pkgs/by-name/ra/radicle-node/package.nix:165 because it is marked as insecure
Known issues:
- Private repositories are insecure: traffic between nodes is not encrypted and not authenticated.
You can install it anyway by allowing this package, using the
following methods:
a) To temporarily allow all insecure packages, you can use an environment
variable for a single invocation of the nix tools:
$ export NIXPKGS_ALLOW_INSECURE=1
Note: When using `nix shell`, `nix build`, `nix develop`, etc with a flake,
then pass `--impure` in order to allow use of environment variables.
b) for `nixos-rebuild` you can add ‘radicle-node-1.10.3’ to
`nixpkgs.config.permittedInsecurePackages` in the configuration.nix,
like so:
{
nixpkgs.config.permittedInsecurePackages = [
"radicle-node-1.10.3"
];
}
c) For `nix-env`, `nix-build`, `nix-shell` or any other Nix command you can add
‘radicle-node-1.10.3’ to `permittedInsecurePackages` in
~/.config/nixpkgs/config.nix, like so:
{
permittedInsecurePackages = [
"radicle-node-1.10.3"
];
}
|
| failed eval |
checks.x86_64-linux.nixos-eve
|
— |
error:
… while evaluating a branch condition
at «string»:25:5:
24| v:
25| if !builtins.isAttrs v || isDrv v then
…
error:
… while evaluating a branch condition
at «string»:25:5:
24| v:
25| if !builtins.isAttrs v || isDrv v then
| ^
26| v
… in the left operand of the OR (||) operator
at «string»:25:28:
24| v:
25| if !builtins.isAttrs v || isDrv v then
| ^
26| v
… while evaluating the option `system.build.toplevel':
… while evaluating definitions from `/nix/store/c73xscvypq4slnj3k075sy076gfnyb8q-source/nixos/modules/system/activation/top-level.nix':
… while evaluating the option `warnings':
… while evaluating definitions from `/nix/store/c73xscvypq4slnj3k075sy076gfnyb8q-source/nixos/modules/system/boot/systemd.nix':
… while evaluating the option `systemd.services.radicle-mirror.serviceConfig':
… while evaluating definitions from `/nix/store/hwxl98gkfpqbhs2d01szc0cv1cbc56rd-source/nix/module.nix':
(stack trace truncated; use '--show-trace' to show the full, detailed trace)
error: Refusing to evaluate package 'radicle-node-1.10.3' in /nix/store/c73xscvypq4slnj3k075sy076gfnyb8q-source/pkgs/by-name/ra/radicle-node/package.nix:165 because it is marked as insecure
Known issues:
- Private repositories are insecure: traffic between nodes is not encrypted and not authenticated.
You can install it anyway by allowing this package, using the
following methods:
a) To temporarily allow all insecure packages, you can use an environment
variable for a single invocation of the nix tools:
$ export NIXPKGS_ALLOW_INSECURE=1
Note: When using `nix shell`, `nix build`, `nix develop`, etc with a flake,
then pass `--impure` in order to allow use of environment variables.
b) for `nixos-rebuild` you can add ‘radicle-node-1.10.3’ to
`nixpkgs.config.permittedInsecurePackages` in the configuration.nix,
like so:
{
nixpkgs.config.permittedInsecurePackages = [
"radicle-node-1.10.3"
];
}
c) For `nix-env`, `nix-build`, `nix-shell` or any other Nix command you can add
‘radicle-node-1.10.3’ to `permittedInsecurePackages` in
~/.config/nixpkgs/config.nix, like so:
{
permittedInsecurePackages = [
"radicle-node-1.10.3"
];
}
|