Mic92/dotfiles build #808 failed ← #807 #809 →
eval warnings
1 kind
· 1 occurrence
- warn A legacy Nextcloud install (from before NixOS 26.11) may be installed. ×1
2 failed
| status | attribute | duration |
|---|---|---|
checks.aarch64-darwin.darwin-evo
|
2m 32s | |
nix-store-2.36.0pre: [1/2] Compiling C++ object libnixstore.2.36.0.dylib.p/meson-generated_nixstore-unity0.cpp.o FAILED: [code=1] libnixstore.2.36.0.dylib.p/mes …nix-store-2.36.0pre:
[1/2] Compiling C++ object libnixstore.2.36.0.dylib.p/meson-generated_nixstore-unity0.cpp.o
FAILED: [code=1] libnixstore.2.36.0.dylib.p/meson-generated_nixstore-unity0.cpp.o
clang++ -Ilibnixstore.2.36.0.dylib.p -I. -I.. -Iinclude -I../include -I../darwin/build -I../unix/build -Iunix/include -I../unix/include -I/nix/store/7asvmiiws8zz3c8krxpypgrx59a45da6-nix-util-2.36.0pre-dev/include -I/nix/store/kp61vxk6fc6mygavw8jbcp46rv0vhykr-libarchive-3.8.9-dev/include -I/nix/store/isybn536j7an8p4nrj0pl5ykwda6nxqq-nlohmann_json-3.12.0/include -I/nix/store/qdhck8lm021frd70ixahv7r9gsl2vwl9-curl-8.22.0-dev/include -I/nix/store/r9cljv2bvqi3ci3n6m0z0wi3ldpvlyzq-sqlite-3.53.3-dev/include -I/nix/store/3lahs2g34zsq4r6cn4yp25rxzy1h7zgq-aws-crt-cpp-0.34.3-dev/include -I/nix/store/6jh8nc6lcl14vgxdjk3icr2r1yfzdql1-aws-c-mqtt-0.13.3/inc…
libnixstore.2.36.0.dylib.p/nixstore-unity0.cpp:3:9: fatal error: '/private/var/tb/8/scratch/6a80e35e89053408/build/source/src/libstore/build/build/build-log.cc' file not found
3 | #include</private/var/tb/8/scratch/6a80e35e89053408/build/source/src/libstore/build/build/build-log.cc>
| ^~~~~~~~~~~~~~~~~~~~~~~~~~~~~~~~~~~~~~~~~~~~~~~~~~~~~~~~~~~~~~~~~~~~~~~~~~~~~~~~~~~~~~~~~~~~~~~
1 error generated.
ninja: build stopped: subcommand failed.
|
||
checks.aarch64-darwin.home-manager-common
|
40s | |
go-mockery-3.8.0: 2026-10-15T09:17:44.952776000Z ERR unable to parse packages error="error occurred when loading packages" version=v0.0.0-dev 2026-10-15T09:17:4 …go-mockery-3.8.0:
2026-10-15T09:17:44.952776000Z ERR unable to parse packages error="error occurred when loading packages" version=v0.0.0-dev
2026-10-15T09:17:44.952783000Z FTL app failed error="error occurred when loading packages" version=v0.0.0-dev
exit status 1
2026-10-15T09:17:46.967170000Z ERR encountered error when loading package error="/private/var/tb/4/scratch/3cc432dfa1de6a4e/build/source/internal/fixtures/type_alias/interface.go:3:8: could not import github.com/vektra/mockery/v3/internal/fixtures/type_alias/subpkg (reading /private/var/tb/4/scratch/3cc432dfa1de6a4e/build/go-cache/f5/f5f965ae6356c6f107c6aaa09fce58ef4760ee0a03a117b1403aea097e0ab12d-d: internal error in importing \"github.com/vektra/mockery/v3/internal/fixtures/type_alias/subpkg\" (cannot decode \"github.com/vektra/mockery/v3/internal/fixtures/type_alias/subpkg\", export data version 5 is greater than maximum supported version…
2026-10-15T09:17:46.967352000Z ERR unable to parse packages error="error occurred when loading packages" version=v0.0.0-dev
2026-10-15T09:17:46.967377000Z FTL app failed error="error occurred when loading packages" version=v0.0.0-dev
exit status 1
task: Failed to run task "test.ci": task: Failed to run task "mocks": task: Failed to run task "mocks.generate": task: Failed to run task "mocks.generate.matryer": exit status 1
nix-store-2.36.0pre:
[1/2] Compiling C++ object libnixstore.2.36.0.dylib.p/meson-generated_nixstore-unity0.cpp.o
FAILED: [code=1] libnixstore.2.36.0.dylib.p/meson-generated_nixstore-unity0.cpp.o
clang++ -Ilibnixstore.2.36.0.dylib.p -I. -I.. -Iinclude -I../include -I../darwin/build -I../unix/build -Iunix/include -I../unix/include -I/nix/store/7asvmiiws8zz3c8krxpypgrx59a45da6-nix-util-2.36.0pre-dev/include -I/nix/store/kp61vxk6fc6mygavw8jbcp46rv0vhykr-libarchive-3.8.9-dev/include -I/nix/store/isybn536j7an8p4nrj0pl5ykwda6nxqq-nlohmann_json-3.12.0/include -I/nix/store/qdhck8lm021frd70ixahv7r9gsl2vwl9-curl-8.22.0-dev/include -I/nix/store/r9cljv2bvqi3ci3n6m0z0wi3ldpvlyzq-sqlite-3.53.3-dev/include -I/nix/store/3lahs2g34zsq4r6cn4yp25rxzy1h7zgq-aws-crt-cpp-0.34.3-dev/include -I/nix/store/6jh8nc6lcl14vgxdjk3icr2r1yfzdql1-aws-c-mqtt-0.13.3/inc…
libnixstore.2.36.0.dylib.p/nixstore-unity0.cpp:3:9: fatal error: '/private/var/tb/1/scratch/ab56203148ba38be/build/source/src/libstore/build/build/build-log.cc' file not found
3 | #include</private/var/tb/1/scratch/ab56203148ba38be/build/source/src/libstore/build/build/build-log.cc>
| ^~~~~~~~~~~~~~~~~~~~~~~~~~~~~~~~~~~~~~~~~~~~~~~~~~~~~~~~~~~~~~~~~~~~~~~~~~~~~~~~~~~~~~~~~~~~~~~
1 error generated.
ninja: build stopped: subcommand failed.
|
||
31 cancelled ⚠ 1
38 succeeded
| status | attribute | duration |
|---|---|---|
| loading… | ||
194 already built
| status | attribute | duration |
|---|---|---|
| loading… | ||