nixbot

builds

cancelled checks.x86_64-linux.home-manager-common build #808 · raw · eval 15.8 s · 1.0 GiB allocated · ·

1these 36 derivations will be built:2  /nix/store/1www389y8kkkmvchnny6vnvw8sngyi8d-home-manager.drv3  /nix/store/v2m9s85ybjwqmagl4cjdys6jgy0yy42z-nix-store-2.36.0pre.drv4  /nix/store/2nadarzfx4204sjkl2xwjdf3z19n63y2-nix-fetchers-2.36.0pre.drv5  /nix/store/sxnasgvjr7a8hvg3n8w9l961pciy1g13-nix-store-c-2.36.0pre.drv6  /nix/store/a5npk3j5sjqhwnkq163h9ijccxcdwk48-nix-expr-2.36.0pre.drv7  /nix/store/vp65rb9lbq5c6pwf1mkabyz09nwgigbr-nix-expr-c-2.36.0pre.drv8  /nix/store/ikxwb4anvib05pz97a7irdd3zdcqfkbd-nix-fetchers-c-2.36.0pre.drv9  /nix/store/lp7vgrj5rx8vkc522ghffw5v51zn8gg1-nix-flake-2.36.0pre.drv10  /nix/store/78vrmb9y2cmwk57b3dj19688frsm44n2-nix-flake-c-2.36.0pre.drv11  /nix/store/9kzwqrbpa8566m45rw2lbc6qn4ckabda-nix-store-test-support-2.36.0pre.drv12  /nix/store/9cjrmbhhg6ymlppx70yn5158wy8hrm8z-nix-util-test-support-2.36.0pre.drv13  /nix/store/dzsdf6nk4j6wz2my53l01pvv955w5fvn-nix-flake-tests-2.36.0pre.drv14  /nix/store/21qcasyk6cfp1f1cg8a5yp6cgfr215ng-nix-flake-tests-run.drv15  /nix/store/4icdkj224c8057aga1c4xvi14576ibfs-forge-triage-0.1.0.drv16  /nix/store/gkqgcnhs8mhk2iph8z1gv8gkm6s8c8p2-go-mockery-3.8.0.drv17  /nix/store/5blymz8vn1vs1g9ajhfd431n9m17vkh4-sesh-2.32.0.drv18  /nix/store/ws9l2l2phzjvnfl4ck3iyki9rci8909k-nix-expr-tests-2.36.0pre.drv19  /nix/store/5dj8slb0dzaa2anmd71r51cf585bv9jq-nix-expr-tests-run.drv20  /nix/store/hkqkwa2zs6bfmqlb3i9mhx2jb9i6yxvx-merge-when-green-0.3.0.drv21  /nix/store/mmdd6pjxl5pcq39dvnjyza8an45jj38a-nix-main-2.36.0pre.drv22  /nix/store/kyvnhy1bsksljwyfx8y9qfd1a7qgd84c-nix-cmd-2.36.0pre.drv23  /nix/store/rxnmvhf70i800adkpqff584ami6ng8dp-nix-main-c-2.36.0pre.drv24  /nix/store/ckgk8lxiwdy04pg1l6jh1vkxnk095r61-nix-2.36.0pre20260918_09e24b6.drv25  /nix/store/9709y4fpmlmignzwbfrbiaf82fxj9b1f-nix-store-tests-2.36.0pre.drv26  /nix/store/kgj36snczcgjlry62di6h0zyh7sw8226-nix-store-tests-run.drv27  /nix/store/r71nhkmrrrmrbs8hzrcp323qawbd8w7x-nix-functional-tests-2.36.0pre20260918_09e24b6.drv28  /nix/store/sxgcj2cz28l4njbgvd2jvp9ypc3dhcwq-nix-manual-2.36.0pre20260918_09e24b6.drv29  /nix/store/dqi93g30b3xag1fqrdlnljjy1iy2mxgv-nix-fetchers-tests-2.36.0pre.drv30  /nix/store/w5sbnbc4yayksrk7pjjhjhcrq6wzzvbc-nix-fetchers-tests-run.drv31  /nix/store/m3p49al1vh52z8njjsp5fkm34qnq9dx3-nix-2.36.0pre20260918_09e24b6.drv32  /nix/store/vfwcha69043j8gwn39ad8nsmqqr3w7mg-iets-0.1.0.drv33  /nix/store/hizrsalgkaxxhd325m1fy14y8wsi3w4r-home-manager-path.drv34  /nix/store/84v2iqivjwbc9jbcc5hl1gbcmrvpr7qx-activation-script.drv35  /nix/store/94hajy9xc51s9nc8v38xsi0imrglc98c-home-manager-files.drv36  /nix/store/yvs6q8804x4pws60wlscqs19kxx0pbz1-hm-putter.json.drv37  /nix/store/lcknc80gcbg0ay2rz6862di6zl1r7sw5-home-manager-generation.drv38these 21 paths will be fetched (170.3 MiB download, 624.1 MiB unpacked):39  /nix/store/4xa8fsb2d19czha0p33103pvsi3sg605-basedpyright-1.39.840  /nix/store/hghy3gf6bdvp8qw7ljdv7g4vjhfvcllm-bash-language-server-5.8.141  /nix/store/wfb8cpsz58qlbxygdq08l3irlh6ckccx-bat-0.26.142  /nix/store/kxmsfp2w76lycyrpl5ipqiycwa3dfyhj-eza-0.23.543  /nix/store/z1wk8lx3f9zyfzmhkvwnk0qdfbd32x70-eza-0.23.5-man44  /nix/store/x6kcq7g4cwysbwjiyz152rbl6fv7l55w-gh-2.102.045  /nix/store/chg799vd8g09v1h52rzf77plxpfz0diz-git-absorb-0.9.046  /nix/store/s3i4lkb8m4cnijakqn8mb6rhp0qbaiyj-go-1.27.247  /nix/store/3gax8wb82c05afr6bsi56ighadlzaqkc-go-task-3.53.148  /nix/store/b0inbf1lgaz51sxqxxf4f0b2n40kbb8q-govulncheck-1.8.049  /nix/store/frmmbd2clcxp69qpmshay1hviqx1a1q3-jjui-0.10.1150  /nix/store/hssxbwgr1bq95rhfqm05sg3wjmxv19gg-jujutsu-0.46.051  /nix/store/bgyfdhb9ngszzpwczbwy1bkfnx6kbml0-lazygit-0.66.052  /nix/store/w3rpfygd441473pyl3mbnim6z4k1kss7-mergiraf-0.20.053  /nix/store/fp1zhwzw3hamxrzr9bgar6avk1my3qpc-nixd-2.9.354  /nix/store/r63c7iln6cb0pxy1laj1k62hwrlf3v15-nixf-2.9.355  /nix/store/ja74h2qwcacphdcrk8ybgdc3a66ljs61-nixt-2.9.356  /nix/store/sv5rr3ffd8fyxx015gj4w2vi2lr8rixx-procs-0.14.1257  /nix/store/hq2d2pc2m0lnzdi4qlvsim3kx8r0pb35-selene-0.32.058  /nix/store/svxjx8andhlhhpfamz1wv5fgg6z6cdc5-tea-0.16.059  /nix/store/0gibr00811qx62fwchd42rcbrl2lg15c-typos-1.50.360building '/nix/store/94hajy9xc51s9nc8v38xsi0imrglc98c-home-manager-files.drv'61home-manager-files> tribuchet: building on jamie62building '/nix/store/v2m9s85ybjwqmagl4cjdys6jgy0yy42z-nix-store-2.36.0pre.drv'63nix-store-2.36.0pre> tribuchet: building on jamie64nix-store-2.36.0pre> structuredAttrs is enabled65nix-store-2.36.0pre> Running phase: unpackPhase66nix-store-2.36.0pre> unpacking source archive /nix/store/pbz1v61cy6xzq80izg37pszbvi1kd5x6-source67nix-store-2.36.0pre> source root is source/./src/libstore68nix-store-2.36.0pre> separate-debug-info: recording checksum of source files for debug support...69nix-store-2.36.0pre> Running phase: patchPhase70nix-store-2.36.0pre> Running phase: updateAutotoolsGnuConfigScriptsPhase71nix-store-2.36.0pre> Running phase: configurePhase72nix-store-2.36.0pre> mesonConfigurePhase flags: --prefix=/nix/store/rzrwfv0mg39v19wnxpjg44icc4fva3a0-nix-store-2.36.0pre --libdir=/nix/store/rzrwfv0mg39v19wnxpjg44icc4fva3a0-nix-store-2.36.0pre/lib --libexecdir=/nix/store/rzrwfv0mg39v19wnxpjg44icc4fva3a0-nix-store-2.36.0pre/libexec --bindir=/nix/store/rzrwfv0mg39v19wnxpjg44icc4fva3a0-nix-store-2.36.0pre/bin --sbindir=/nix/store/rzrwfv0mg39v19wnxpjg44icc4fva3a0-nix-store-2.36.0pre/sbin --includedir=/nix/store/vnj3zmcz9lsaf8x7y6vg9fmm7dvqmj9c-nix-store-2.36.0pre-dev/include --mandir=/nix/store/rzrwfv0mg39v19wnxpjg44icc4fva3a0-nix-store-2.36.0pre/share/man --infodir=/nix/store/rzrwfv0mg39v19wnxpjg44icc4fva3a0-nix-store-2.36.0pre/share/info --localedir=/nix/store/rzrwfv0mg39v19wnxpjg44icc4fva3a0-nix-store-2.36.0pre/share/locale -Dauto_features=enabled -Dwrap_mode=nodownload --buildtype=release -Dseccomp-sandboxing=enabled -Dembedded-sandbox-shell=false -Ds3-aws-auth=enabled -Dsandbox-shell=/nix/store/r6zw8gd10c7qv9sifzg4r7h1s5qmrxjp-busybox-1.37.0/bin/busybox -Dunity=on -Dunity_size=8192 -Db_pch=false -Db_lto=true73building '/nix/store/yvs6q8804x4pws60wlscqs19kxx0pbz1-hm-putter.json.drv'74hm-putter.json> tribuchet: building on jamie75hm-putter.json> structuredAttrs is enabled76building '/nix/store/gkqgcnhs8mhk2iph8z1gv8gkm6s8c8p2-go-mockery-3.8.0.drv'77go-mockery-3.8.0> tribuchet: building on jamie78nix-store-2.36.0pre> The Meson build system79nix-store-2.36.0pre> Version: 1.12.180nix-store-2.36.0pre> Source dir: /build/source/src/libstore81nix-store-2.36.0pre> Build dir: /build/source/src/libstore/build82nix-store-2.36.0pre> Build type: native build83nix-store-2.36.0pre> Project name: nix-store84nix-store-2.36.0pre> Project version: 2.36.0pre85nix-store-2.36.0pre> C++ compiler for the host machine: g++ (gcc 16.2.0 "g++ (GCC) 16.2.0")86nix-store-2.36.0pre> C++ linker for the host machine: g++ ld.bfd 2.4687nix-store-2.36.0pre> Host machine cpu family: x86_6488nix-store-2.36.0pre> Host machine cpu: x86_6489nix-store-2.36.0pre> Found pkg-config: YES (/nix/store/b9izmrfjp0qnnyahdwwrzdwi87s1h179-pkg-config-wrapper-0.29.2/bin/pkg-config) 0.29.290nix-store-2.36.0pre> Run-time dependency nix-util found: YES 2.36.0pre91nix-store-2.36.0pre> Program ln found: YES (/nix/store/2gfxiwls9hbgwdwcy43mprchwsq36mg6-coreutils-9.11/bin/ln)92nix-store-2.36.0pre> Checking for function "posix_fallocate" : YES 93nix-store-2.36.0pre> Checking for function "statvfs" : YES 94nix-store-2.36.0pre> Checking for function "open_tree" : YES 95nix-store-2.36.0pre> Checking for function "move_mount" : YES 96nix-store-2.36.0pre> Has header "linux/landlock.h" : YES 97nix-store-2.36.0pre> Has header "sys/xattr.h" : YES 98nix-store-2.36.0pre> Checking for function "llistxattr" : YES 99nix-store-2.36.0pre> Checking for function "lremovexattr" : YES 100nix-store-2.36.0pre> Run-time dependency Boost (found: container, url) for cpp found: YES 1.91.0101nix-store-2.36.0pre> Run-time dependency libcurl found: YES 8.22.0102nix-store-2.36.0pre> Run-time dependency libseccomp found: YES 2.6.1103nix-store-2.36.0pre> Run-time dependency nlohmann_json found: YES 3.12.0104nix-store-2.36.0pre> Run-time dependency sqlite3 found: YES 3.53.3105nix-store-2.36.0pre> Found CMake: /nix/store/jcvvpih1046akxcwh9hdiak5q24jqcf0-cmake-4.4.3/bin/cmake (4.4.3)106nix-store-2.36.0pre> Run-time dependency aws-crt-cpp (modules: AWS::aws-crt-cpp) found: YES 0.34.3107nix-store-2.36.0pre> Program /nix/store/r6zw8gd10c7qv9sifzg4r7h1s5qmrxjp-busybox-1.37.0/bin/busybox found: YES (/nix/store/r6zw8gd10c7qv9sifzg4r7h1s5qmrxjp-busybox-1.37.0/bin/busybox)108nix-store-2.36.0pre> Program lsof found: NO109nix-store-2.36.0pre> Configuring store-config-private.hh using configuration110nix-store-2.36.0pre> Run-time dependency threads found: YES111nix-store-2.36.0pre> Compiler for C++ supports arguments -Wdeprecated-copy: YES 112nix-store-2.36.0pre> Compiler for C++ supports arguments -Werror=suggest-override: YES 113nix-store-2.36.0pre> Compiler for C++ supports arguments -Werror=switch: YES 114nix-store-2.36.0pre> Compiler for C++ supports arguments -Werror=switch-enum: YES 115nix-store-2.36.0pre> Compiler for C++ supports arguments -Werror=undef: YES 116nix-store-2.36.0pre> Compiler for C++ supports arguments -Werror=unused-result: YES 117nix-store-2.36.0pre> Compiler for C++ supports arguments -Werror=sign-compare: YES 118nix-store-2.36.0pre> Compiler for C++ supports arguments -Werror=return-type: YES 119nix-store-2.36.0pre> Compiler for C++ supports arguments -Werror=non-virtual-dtor: YES 120nix-store-2.36.0pre> Compiler for C++ supports arguments -Wignored-qualifiers: YES 121nix-store-2.36.0pre> Compiler for C++ supports arguments -Wimplicit-fallthrough: YES 122nix-store-2.36.0pre> Compiler for C++ supports arguments -Wno-c23-extensions: NO 123nix-store-2.36.0pre> Compiler for C++ supports arguments -Wno-deprecated-declarations: YES 124nix-store-2.36.0pre> Compiler for C++ supports arguments -Wno-interference-size: YES 125nix-store-2.36.0pre> Compiler for C++ supports arguments -Wno-subobject-linkage: YES 126nix-store-2.36.0pre> Compiler for C++ supports arguments -Werror=c99-designator: NO 127nix-store-2.36.0pre> Compiler for C++ supports arguments -Werror=weak-vtables: NO 128nix-store-2.36.0pre> Checking if "using libstdc++" compiles: YES 129nix-store-2.36.0pre> Checking if "linker can wrap __assert_fail" links: YES 130nix-store-2.36.0pre> Program python3 found: YES131nix-store-2.36.0pre> Program run-clang-tidy found: NO132nix-store-2.36.0pre> Run-time dependency nix-clang-tidy found: NO  (tried pkg-config and cmake)133nix-store-2.36.0pre> meson.build:257: WARNING: 'build/build-log.cc' is a generated file, and should be passed by reference instead of string name. This will become a hard error in Meson 2.0134nix-store-2.36.0pre> meson.build:257: WARNING: 'build/derivation-builder-impl.cc' is a generated file, and should be passed by reference instead of string name. This will become a hard error in Meson 2.0135nix-store-2.36.0pre> meson.build:257: WARNING: 'build/derivation-builder.cc' is a generated file, and should be passed by reference instead of string name. This will become a hard error in Meson 2.0136nix-store-2.36.0pre> meson.build:257: WARNING: 'build/derivation-building-goal.cc' is a generated file, and should be passed by reference instead of string name. This will become a hard error in Meson 2.0137nix-store-2.36.0pre> meson.build:257: WARNING: 'build/derivation-check.cc' is a generated file, and should be passed by reference instead of string name. This will become a hard error in Meson 2.0138nix-store-2.36.0pre> meson.build:257: WARNING: 'build/derivation-env-desugar.cc' is a generated file, and should be passed by reference instead of string name. This will become a hard error in Meson 2.0139nix-store-2.36.0pre> meson.build:257: WARNING: 'build/derivation-goal.cc' is a generated file, and should be passed by reference instead of string name. This will become a hard error in Meson 2.0140nix-store-2.36.0pre> meson.build:257: WARNING: 'build/derivation-resolution-goal.cc' is a generated file, and should be passed by reference instead of string name. This will become a hard error in Meson 2.0141nix-store-2.36.0pre> meson.build:257: WARNING: 'build/derivation-trampoline-goal.cc' is a generated file, and should be passed by reference instead of string name. This will become a hard error in Meson 2.0142nix-store-2.36.0pre> meson.build:257: WARNING: 'build/drv-output-substitution-goal.cc' is a generated file, and should be passed by reference instead of string name. This will become a hard error in Meson 2.0143nix-store-2.36.0pre> meson.build:257: WARNING: 'build/entry-points.cc' is a generated file, and should be passed by reference instead of string name. This will become a hard error in Meson 2.0144nix-store-2.36.0pre> meson.build:257: WARNING: 'build/goal.cc' is a generated file, and should be passed by reference instead of string name. This will become a hard error in Meson 2.0145nix-store-2.36.0pre> meson.build:257: WARNING: 'build/substitution-goal.cc' is a generated file, and should be passed by reference instead of string name. This will become a hard error in Meson 2.0146nix-store-2.36.0pre> meson.build:257: WARNING: 'build/worker.cc' is a generated file, and should be passed by reference instead of string name. This will become a hard error in Meson 2.0147nix-store-2.36.0pre> Configuring config.hh using configuration148nix-store-2.36.0pre> Found pkg-config: YES (/nix/store/b9izmrfjp0qnnyahdwwrzdwi87s1h179-pkg-config-wrapper-0.29.2/bin/pkg-config) 0.29.2149nix-store-2.36.0pre> Build targets in project: 1150nix-store-2.36.0pre> 151nix-store-2.36.0pre> nix-store 2.36.0pre152nix-store-2.36.0pre> 153nix-store-2.36.0pre>     can hardlink to symlink: YES154nix-store-2.36.0pre> 155nix-store-2.36.0pre>   User defined options156nix-store-2.36.0pre>     auto_features          : enabled157nix-store-2.36.0pre>     b_lto                  : true158nix-store-2.36.0pre>     b_pch                  : false159nix-store-2.36.0pre>     bindir                 : /nix/store/rzrwfv0mg39v19wnxpjg44icc4fva3a0-nix-store-2.36.0pre/bin160nix-store-2.36.0pre>     buildtype              : release161nix-store-2.36.0pre>     embedded-sandbox-shell : false162nix-store-2.36.0pre>     includedir             : /nix/store/vnj3zmcz9lsaf8x7y6vg9fmm7dvqmj9c-nix-store-2.36.0pre-dev/include163nix-store-2.36.0pre>     infodir                : /nix/store/rzrwfv0mg39v19wnxpjg44icc4fva3a0-nix-store-2.36.0pre/share/info164nix-store-2.36.0pre>     libdir                 : /nix/store/rzrwfv0mg39v19wnxpjg44icc4fva3a0-nix-store-2.36.0pre/lib165nix-store-2.36.0pre>     libexecdir             : /nix/store/rzrwfv0mg39v19wnxpjg44icc4fva3a0-nix-store-2.36.0pre/libexec166nix-store-2.36.0pre>     localedir              : /nix/store/rzrwfv0mg39v19wnxpjg44icc4fva3a0-nix-store-2.36.0pre/share/locale167nix-store-2.36.0pre>     mandir                 : /nix/store/rzrwfv0mg39v19wnxpjg44icc4fva3a0-nix-store-2.36.0pre/share/man168nix-store-2.36.0pre>     prefix                 : /nix/store/rzrwfv0mg39v19wnxpjg44icc4fva3a0-nix-store-2.36.0pre169nix-store-2.36.0pre>     s3-aws-auth            : enabled170nix-store-2.36.0pre>     sandbox-shell          : /nix/store/r6zw8gd10c7qv9sifzg4r7h1s5qmrxjp-busybox-1.37.0/bin/busybox171nix-store-2.36.0pre>     sbindir                : /nix/store/rzrwfv0mg39v19wnxpjg44icc4fva3a0-nix-store-2.36.0pre/sbin172nix-store-2.36.0pre>     seccomp-sandboxing     : enabled173nix-store-2.36.0pre>     unity                  : on174nix-store-2.36.0pre>     unity_size             : 8192175nix-store-2.36.0pre>     wrap_mode              : nodownload176nix-store-2.36.0pre> 177nix-store-2.36.0pre> Found ninja-1.13.2 at /nix/store/4nsdla28c4177ssp0hlyv5l2yzj8wcba-ninja-1.13.2/bin/ninja178nix-store-2.36.0pre> Running postconf script '/nix/store/lb41b0anx1f98y9y5s9mdv97gjgsq740-python3-3.14.7/bin/python3.14 /build/source/src/libstore/nix-meson-build-support/common/clang-tidy/clean_compdb.py /build/source/src/libstore/build/compile_commands.json /build/source/src/libstore/build/nix-meson-build-support/common/clang-tidy/compile_commands.json'179nix-store-2.36.0pre> Running phase: buildPhase180nix-store-2.36.0pre> build flags: -j24181nix-store-2.36.0pre> [1/2] Compiling C++ object libnixstore.so.2.36.0.p/meson-generated_nixstore-unity0.cpp.o182nix-store-2.36.0pre> FAILED: [code=1] libnixstore.so.2.36.0.p/meson-generated_nixstore-unity0.cpp.o 183nix-store-2.36.0pre> g++ -Ilibnixstore.so.2.36.0.p -I. -I.. -Iinclude -I../include -I../linux/build -Ilinux/include -I../linux/include -I../unix/build -Iunix/include -I../unix/include -I/nix/store/la1rzzb3q1wjdz50dyvh62fix41ayifa-nix-util-2.36.0pre-dev/include -I/nix/store/2ybid2fqf6nfqrwcgizv9qvvckyp6axh-libarchive-3.8.9-dev/include -I/nix/store/0dz9bi5rv50d46w8xykwdxrj4ssy6pnp-nlohmann_json-3.12.0/include -I/nix/store/aph5dkajglxjn9642bp0h3x7cwzijr52-curl-8.22.0-dev/include -I/nix/store/q2yrf8yhmj405nv9qbbraxr8wlz7n5kv-libseccomp-2.6.1-dev/include -I/nix/store/xrcjl59yi7zswbv0vzm8cmvw4vplsbgj-sqlite-3.53.3-dev/include -I/nix/store/2zgasbvd9mzmj145mxsmnzxiy7rnz82b-aws-c-http-0.11.0/include -I/nix/store/3qrc60ba9qwxiyx8wlnfwwvqknpmhbmb-aws-crt-cpp-0.34.3-dev/include -I/nix/store/45ndmvc3vy9rd30mk71bq89gigzdx64p-aws-c-sdkutils-0.2.4/include -I/nix/store/5w514y0s25ym17bsrw43wl33fbxvy91a-aws-c-compression-0.3.1/include -I/nix/store/ai6kkxbkfjgkmpkwamrvhc5d1m3l5v1d-aws-c-cal-0.9.2/include -I/nix/store/bg4d55k9sg2x763215brap5ndhnqil53-aws-c-auth-0.9.1/include -I/nix/store/cf610ccndgvh5nfhbarjbqpvr3zkb3vr-aws-c-event-stream-0.7.0/include -I/nix/store/hc6mxys4iyawmwiyaixkcl9izjrqmr2q-openssl-3.5.8-dev/include -I/nix/store/igm0j0xhbj57bn2sm4w07jnhz8fb22pc-aws-c-mqtt-0.13.3/include -I/nix/store/lpglqdmacwwq3csbqknbl8d427rky1ba-aws-c-common-0.12.4/include -I/nix/store/r3rc5z2wvz9igh9gpf4323y3ds0xq3l9-aws-c-s3-0.8.7/include -I/nix/store/yk25gm6nvm11mjkika1b00m41mh247di-aws-c-io-0.27.2/include -I/nix/store/yryxvlaj6vw4sdk3ryl4wspnaqhm6vxd-aws-checksums-0.2.7/include -flto=auto -fdiagnostics-color=always -D_FILE_OFFSET_BITS=64 -Wall -Winvalid-pch -std=c++23 -O3 -Wdeprecated-copy -Werror=suggest-override -Werror=switch -Werror=switch-enum -Werror=undef -Werror=unused-result -Werror=sign-compare -Werror=return-type -Werror=non-virtual-dtor -Wignored-qualifiers -Wimplicit-fallthrough -Wno-deprecated-declarations -Wno-interference-size -Wno-subobject-linkage -D_GLIBCXX_USE_TBB_PAR_BACKEND=0 -fno-semantic-interposition -Wl,-Bsymbolic-functions -fPIC -DAWS_AUTH_USE_IMPORT_EXPORT -DAWS_CAL_USE_IMPORT_EXPORT -DAWS_CHECKSUMS_USE_IMPORT_EXPORT -DAWS_COMMON_USE_IMPORT_EXPORT -DAWS_COMPRESSION_USE_IMPORT_EXPORT -DAWS_CRT_CPP_USE_IMPORT_EXPORT -DAWS_ENABLE_EPOLL -DAWS_EVENT_STREAM_USE_IMPORT_EXPORT -DAWS_HTTP_USE_IMPORT_EXPORT -DAWS_IO_USE_IMPORT_EXPORT -DAWS_MQTT_USE_IMPORT_EXPORT -DAWS_S3_USE_IMPORT_EXPORT -DAWS_SDKUTILS_USE_IMPORT_EXPORT -DBOOST_CONTAINER_DYN_LINK=1 -DBOOST_ALL_NO_LIB -pthread -std=c++23 -MD -MQ libnixstore.so.2.36.0.p/meson-generated_nixstore-unity0.cpp.o -MF libnixstore.so.2.36.0.p/meson-generated_nixstore-unity0.cpp.o.d -o libnixstore.so.2.36.0.p/meson-generated_nixstore-unity0.cpp.o -c libnixstore.so.2.36.0.p/nixstore-unity0.cpp184nix-store-2.36.0pre> libnixstore.so.2.36.0.p/nixstore-unity0.cpp:3:9: fatal error: /build/source/src/libstore/build/build/build-log.cc: No such file or directory185nix-store-2.36.0pre>     3 | #include</build/source/src/libstore/build/build/build-log.cc>186nix-store-2.36.0pre>       |         ^~~~~~~~~~~~~~~~~~~~~~~~~~~~~~~~~~~~~~~~~~~~~~~~~~~~~187nix-store-2.36.0pre> compilation terminated.188nix-store-2.36.0pre> ninja: build stopped: subcommand failed.189error: Cannot build '/nix/store/v2m9s85ybjwqmagl4cjdys6jgy0yy42z-nix-store-2.36.0pre.drv'.190       Reason: builder failed with exit code 1.191       Output paths:192         /nix/store/qm5hxb4f94hppsp7sdjr0vncszzm8d8c-nix-store-2.36.0pre-debug193         /nix/store/rzrwfv0mg39v19wnxpjg44icc4fva3a0-nix-store-2.36.0pre194         /nix/store/vnj3zmcz9lsaf8x7y6vg9fmm7dvqmj9c-nix-store-2.36.0pre-dev195       Last 25 log lines:196       >     libdir                 : /nix/store/rzrwfv0mg39v19wnxpjg44icc4fva3a0-nix-store-2.36.0pre/lib197       >     libexecdir             : /nix/store/rzrwfv0mg39v19wnxpjg44icc4fva3a0-nix-store-2.36.0pre/libexec198       >     localedir              : /nix/store/rzrwfv0mg39v19wnxpjg44icc4fva3a0-nix-store-2.36.0pre/share/locale199       >     mandir                 : /nix/store/rzrwfv0mg39v19wnxpjg44icc4fva3a0-nix-store-2.36.0pre/share/man200       >     prefix                 : /nix/store/rzrwfv0mg39v19wnxpjg44icc4fva3a0-nix-store-2.36.0pre201       >     s3-aws-auth            : enabled202       >     sandbox-shell          : /nix/store/r6zw8gd10c7qv9sifzg4r7h1s5qmrxjp-busybox-1.37.0/bin/busybox203       >     sbindir                : /nix/store/rzrwfv0mg39v19wnxpjg44icc4fva3a0-nix-store-2.36.0pre/sbin204       >     seccomp-sandboxing     : enabled205       >     unity                  : on206       >     unity_size             : 8192207       >     wrap_mode              : nodownload208       >209       > Found ninja-1.13.2 at /nix/store/4nsdla28c4177ssp0hlyv5l2yzj8wcba-ninja-1.13.2/bin/ninja210       > Running postconf script '/nix/store/lb41b0anx1f98y9y5s9mdv97gjgsq740-python3-3.14.7/bin/python3.14 /build/source/src/libstore/nix-meson-build-support/common/clang-tidy/clean_compdb.py /build/source/src/libstore/build/compile_commands.json /build/source/src/libstore/build/nix-meson-build-support/common/clang-tidy/compile_commands.json'211       > Running phase: buildPhase212       > build flags: -j24213       > [1/2] Compiling C++ object libnixstore.so.2.36.0.p/meson-generated_nixstore-unity0.cpp.o214       > FAILED: [code=1] libnixstore.so.2.36.0.p/meson-generated_nixstore-unity0.cpp.o215       > g++ -Ilibnixstore.so.2.36.0.p -I. -I.. -Iinclude -I../include -I../linux/build -Ilinux/include -I../linux/include -I../unix/build -Iunix/include -I../unix/include -I/nix/store/la1rzzb3q1wjdz50dyvh62fix41ayifa-nix-util-2.36.0pre-dev/include -I/nix/store/2ybid2fqf6nfqrwcgizv9qvvckyp6axh-libarchive-3.8.9-dev/include -I/nix/store/0dz9bi5rv50d46w8xykwdxrj4ssy6pnp-nlohmann_json-3.12.0/include -I/nix/store/aph5dkajglxjn9642bp0h3x7cwzijr52-curl-8.22.0-dev/include -I/nix/store/q2yrf8yhmj405nv9qbbraxr8wlz7n5kv-libseccomp-2.6.1-dev/include -I/nix/store/xrcjl59yi7zswbv0vzm8cmvw4vplsbgj-sqlite-3.53.3-dev/include -I/nix/store/2zgasbvd9mzmj145mxsmnzxiy7rnz82b-aws-c-http-0.11.0/include -I/nix/store/3qrc60ba9qwxiyx8wlnfwwvqknpmhbmb-aws-crt-cpp-0.34.3-dev/include -I/nix/store/45ndmvc3vy9rd30mk71bq89gigzdx64p-aws-c-sdkutils-0.2.4/include -I/nix/store/5w514y0s25ym17bsrw43wl33fbxvy91a-aws-c-compression-0.3.1/include -I/nix/store/ai6kkxbkfjgkmpkwamrvhc5d1m3l5v1d-aws-c-cal-0.9.2/include -I/nix/store/bg4d55k9sg2x763215brap5ndhnqil53-aws-c-auth-0.9.1/include -I/nix/store/cf610ccndgvh5nfhbarjbqpvr3zkb3vr-aws-c-event-stream-0.7.0/include -I/nix/store/hc6mxys4iyawmwiyaixkcl9izjrqmr2q-openssl-3.5.8-dev/include -I/nix/store/igm0j0xhbj57bn2sm4w07jnhz8fb22pc-aws-c-mqtt-0.13.3/include -I/nix/store/lpglqdmacwwq3csbqknbl8d427rky1ba-aws-c-common-0.12.4/include -I/nix/store/r3rc5z2wvz9igh9gpf4323y3ds0xq3l9-aws-c-s3-0.8.7/include -I/nix/store/yk25gm6nvm11mjkika1b00m41mh247di-aws-c-io-0.27.2/include -I/nix/store/yryxvlaj6vw4sdk3ryl4wspnaqhm6vxd-aws-checksums-0.2.7/include -flto=auto -fdiagnostics-color=always -D_FILE_OFFSET_BITS=64 -Wall -Winvalid-pch -std=c++23 -O3 -Wdeprecated-copy -Werror=suggest-override -Werror=switch -Werror=switch-enum -Werror=undef -Werror=unused-result -Werror=sign-compare -Werror=return-type -Werror=non-virtual-dtor -Wignored-qualifiers -Wimplicit-fallthrough -Wno-deprecated-declarations -Wno-interference-size -Wno-subobject-linkage -D_GLIBCXX_USE_TBB_PAR_BACKEND=0 -fno-semantic-interposition -Wl,-Bsymbolic-functions -fPIC -DAWS_AUTH_USE_IMPORT_EXPORT -DAWS_CAL_USE_IMPORT_EXPORT -DAWS_CHECKSUMS_USE_IMPORT_EXPORT -DAWS_COMMON_USE_IMPORT_EXPORT -DAWS_COMPRESSION_USE_IMPORT_EXPORT -DAWS_CRT_CPP_USE_IMPORT_EXPORT -DAWS_ENABLE_EPOLL -DAWS_EVENT_STREAM_USE_IMPORT_EXPORT -DAWS_HTTP_USE_IMPORT_EXPORT -DAWS_IO_USE_IMPORT_EXPORT -DAWS_MQTT_USE_IMPORT_EXPORT -DAWS_S3_USE_IMPORT_EXPORT -DAWS_SDKUTILS_USE_IMPORT_EXPORT -DBOOST_CONTAINER_DYN_LINK=1 -DBOOST_ALL_NO_LIB -pthread -std=c++23 -MD -MQ libnixstore.so.2.36.0.p/meson-generated_nixstore-unity0.cpp.o -MF libnixstore.so.2.36.0.p/meson-generated_nixstore-unity0.cpp.o.d -o libnixstore.so.2.36.0.p/meson-generated_nixstore-unity0.cpp.o -c libnixstore.so.2.36.0.p/nixstore-unity0.cpp216       > libnixstore.so.2.36.0.p/nixstore-unity0.cpp:3:9: fatal error: /build/source/src/libstore/build/build/build-log.cc: No such file or directory217       >     3 | #include</build/source/src/libstore/build/build/build-log.cc>218       >       |         ^~~~~~~~~~~~~~~~~~~~~~~~~~~~~~~~~~~~~~~~~~~~~~~~~~~~~219       > compilation terminated.220       > ninja: build stopped: subcommand failed.221       For full logs, run:222         nix log /nix/store/v2m9s85ybjwqmagl4cjdys6jgy0yy42z-nix-store-2.36.0pre.drv223error: Cannot build '/nix/store/2nadarzfx4204sjkl2xwjdf3z19n63y2-nix-fetchers-2.36.0pre.drv'.224       Reason: 1 dependency failed.225       Output paths:226         /nix/store/hd38i5wb7wbvf6rwzwdrz2n3nfx72j8a-nix-fetchers-2.36.0pre-dev227         /nix/store/hj79dpl45d9az4blqiarc1r7r6hlnj51-nix-fetchers-2.36.0pre-debug228         /nix/store/l4hfd896ya6k5bmnld6rpb8pq2p3ykcb-nix-fetchers-2.36.0pre229error: Cannot build '/nix/store/sxnasgvjr7a8hvg3n8w9l961pciy1g13-nix-store-c-2.36.0pre.drv'.230       Reason: 1 dependency failed.231       Output paths:232         /nix/store/2mc4yxy9w19kv55v9pp1i39wisvd2rqr-nix-store-c-2.36.0pre-dev233         /nix/store/7ryvsv18nml3ldzzxzgg8iv1z347j6pl-nix-store-c-2.36.0pre-debug234         /nix/store/spxyzyqffcww3wcig12knbjv22km17gm-nix-store-c-2.36.0pre235error: Cannot build '/nix/store/a5npk3j5sjqhwnkq163h9ijccxcdwk48-nix-expr-2.36.0pre.drv'.236       Reason: 2 dependencies failed.237       Output paths:238         /nix/store/1k55xpzifxkfwwskak6d8x811g3gfl4n-nix-expr-2.36.0pre-dev239         /nix/store/3km4yxp7q7sd70jv8xcc25g0l3nribdw-nix-expr-2.36.0pre240         /nix/store/p3b2rhn4kk71bih0y9pscfv8y4m3d3z3-nix-expr-2.36.0pre-debug241error: Cannot build '/nix/store/9kzwqrbpa8566m45rw2lbc6qn4ckabda-nix-store-test-support-2.36.0pre.drv'.242       Reason: 2 dependencies failed.243       Output paths:244         /nix/store/5rrgib4daz3bdigsbb72qnh4aq0v2shg-nix-store-test-support-2.36.0pre245         /nix/store/c1k4nz6jaymdx8k6zm6bd37fxvrjkwhz-nix-store-test-support-2.36.0pre-dev246         /nix/store/lrv6cjicl1h56jm9s3d5zdz5j1xdifzi-nix-store-test-support-2.36.0pre-debug247error: Cannot build '/nix/store/vp65rb9lbq5c6pwf1mkabyz09nwgigbr-nix-expr-c-2.36.0pre.drv'.248       Reason: 2 dependencies failed.249       Output paths:250         /nix/store/acnlxxb1vy21fsmxb6zlwyvydl02qp97-nix-expr-c-2.36.0pre-dev251         /nix/store/b4m37rw88x67ia4q2lnjj6dhrh3w450k-nix-expr-c-2.36.0pre252         /nix/store/d3f0wvk6zkxfk6nv9285hspnmal5rliq-nix-expr-c-2.36.0pre-debug253error: Cannot build '/nix/store/lp7vgrj5rx8vkc522ghffw5v51zn8gg1-nix-flake-2.36.0pre.drv'.254       Reason: 3 dependencies failed.255       Output paths:256         /nix/store/5cjrqiy0sfxc4dbjkciwn9bpx5qzywym-nix-flake-2.36.0pre-dev257         /nix/store/jcsx9adlxxlypj54s7zkfcd0n7kf4bhh-nix-flake-2.36.0pre258         /nix/store/yl9s5ans2q73ydlvad5q7hwxd68684n4-nix-flake-2.36.0pre-debug259error: Cannot build '/nix/store/mmdd6pjxl5pcq39dvnjyza8an45jj38a-nix-main-2.36.0pre.drv'.260       Reason: 2 dependencies failed.261       Output paths:262         /nix/store/5p9xr84f1ll9yzg29piyi98lxvg6lf8x-nix-main-2.36.0pre-debug263         /nix/store/6n1667bxxnmm54lchalbcwwhmmxw08hs-nix-main-2.36.0pre264         /nix/store/8qbjg61xm2f79ff7w61mkp1dfjkz6ij0-nix-main-2.36.0pre-dev265error: Cannot build '/nix/store/9709y4fpmlmignzwbfrbiaf82fxj9b1f-nix-store-tests-2.36.0pre.drv'.266       Reason: 3 dependencies failed.267       Output paths:268         /nix/store/1x97b9s2cc3f2nxvw0gdjlxjmkavxz5n-nix-store-tests-2.36.0pre269         /nix/store/sy3p4qb0fn4m3wykhl0lf56qplrxlwby-nix-store-tests-2.36.0pre-debug270error: Cannot build '/nix/store/kyvnhy1bsksljwyfx8y9qfd1a7qgd84c-nix-cmd-2.36.0pre.drv'.271       Reason: 5 dependencies failed.272       Output paths:273         /nix/store/d5617a1kkb07anfr38gfzw25ihlmn2d7-nix-cmd-2.36.0pre-dev274         /nix/store/jrxs6h7lxzr12p8hf1q899cy4qhahgy7-nix-cmd-2.36.0pre275         /nix/store/vfklia2gdl2cr0k1jzsqwi2b05lnia3s-nix-cmd-2.36.0pre-debug276error: Cannot build '/nix/store/ikxwb4anvib05pz97a7irdd3zdcqfkbd-nix-fetchers-c-2.36.0pre.drv'.277       Reason: 3 dependencies failed.278       Output paths:279         /nix/store/g6pbpaxlri10ibvw7292jrizx9j853ra-nix-fetchers-c-2.36.0pre-dev280         /nix/store/n3s54qm08qvhl93smjdbqn2aqfd1is7k-nix-fetchers-c-2.36.0pre281         /nix/store/p92xgwzsgvfbz9ybsrfrwxqf6rygph6y-nix-fetchers-c-2.36.0pre-debug282error: Cannot build '/nix/store/rxnmvhf70i800adkpqff584ami6ng8dp-nix-main-c-2.36.0pre.drv'.283       Reason: 3 dependencies failed.284       Output paths:285         /nix/store/45mbgw9nxpk29vdx1md6vxnc0w4yj1pg-nix-main-c-2.36.0pre-debug286         /nix/store/gf8fnbn1k06lakh0agk3fyn0r388xqck-nix-main-c-2.36.0pre-dev287         /nix/store/xb81f8xs8wfxm8q8c50cbzda3s573wpa-nix-main-c-2.36.0pre288error: Cannot build '/nix/store/kgj36snczcgjlry62di6h0zyh7sw8226-nix-store-tests-run.drv'.289       Reason: 1 dependency failed.290       Output paths:291         /nix/store/llm5rmn1cx63xql6lq6f8wiijp5v4k4n-nix-store-tests-run292error: Cannot build '/nix/store/9cjrmbhhg6ymlppx70yn5158wy8hrm8z-nix-util-test-support-2.36.0pre.drv'.293       Reason: 3 dependencies failed.294       Output paths:295         /nix/store/a573yylngcig1k3q18brclqfbnps5bvn-nix-util-test-support-2.36.0pre-dev296         /nix/store/g9fjxh647c0h5nrbag7xxiqvr7r3n38p-nix-util-test-support-2.36.0pre-debug297         /nix/store/yginsv9651dd52qjpg89wyf1n8j9kssq-nix-util-test-support-2.36.0pre298error: Cannot build '/nix/store/ws9l2l2phzjvnfl4ck3iyki9rci8909k-nix-expr-tests-2.36.0pre.drv'.299       Reason: 3 dependencies failed.300       Output paths:301         /nix/store/ljv5nl80r2r1caiy5cs9dinsfj08f321-nix-expr-tests-2.36.0pre-debug302         /nix/store/v2mkg7mzfigd8dpfj0dqhs51yqd5y0a0-nix-expr-tests-2.36.0pre303error: Cannot build '/nix/store/dqi93g30b3xag1fqrdlnljjy1iy2mxgv-nix-fetchers-tests-2.36.0pre.drv'.304       Reason: 3 dependencies failed.305       Output paths:306         /nix/store/c1k3pc3kjvdg5vwyr3psl63jgbndkf5r-nix-fetchers-tests-2.36.0pre307         /nix/store/lqbjly8j5szfkag8i1s2b4ab62khkrxd-nix-fetchers-tests-2.36.0pre-debug308error: Cannot build '/nix/store/78vrmb9y2cmwk57b3dj19688frsm44n2-nix-flake-c-2.36.0pre.drv'.309       Reason: 4 dependencies failed.310       Output paths:311         /nix/store/0qlcsdydk7a0agi4qb3nrmcv77fgbilw-nix-flake-c-2.36.0pre-debug312         /nix/store/7gg0swjhz03qf7mnah7xxg1gq193jkls-nix-flake-c-2.36.0pre-dev313         /nix/store/p6j3yvl124zmsr3jfh1w0aj6izcml8z7-nix-flake-c-2.36.0pre314error: Cannot build '/nix/store/ckgk8lxiwdy04pg1l6jh1vkxnk095r61-nix-2.36.0pre20260918_09e24b6.drv'.315       Reason: 9 dependencies failed.316       Output paths:317         /nix/store/7fdq8x6bqnnzl8386245wa8hc9bcpqid-nix-2.36.0pre20260918_09e24b6318         /nix/store/wymhar3bnbxrv281ah8v3pn4xyxfx7sa-nix-2.36.0pre20260918_09e24b6-debug319error: Cannot build '/nix/store/5dj8slb0dzaa2anmd71r51cf585bv9jq-nix-expr-tests-run.drv'.320       Reason: 1 dependency failed.321       Output paths:322         /nix/store/5gvqjv862v0n9p7f97swblzv1x4x697z-nix-expr-tests-run323error: Cannot build '/nix/store/w5sbnbc4yayksrk7pjjhjhcrq6wzzvbc-nix-fetchers-tests-run.drv'.324       Reason: 1 dependency failed.325       Output paths:326         /nix/store/wjnx5mxfpydgj8xil5zxyq6kl84r2djn-nix-fetchers-tests-run327error: Cannot build '/nix/store/dzsdf6nk4j6wz2my53l01pvv955w5fvn-nix-flake-tests-2.36.0pre.drv'.328       Reason: 3 dependencies failed.329       Output paths:330         /nix/store/gz53gx716l37k8ryraxk9npaxcia71nl-nix-flake-tests-2.36.0pre-debug331         /nix/store/p33j3hc6ij2qq61vsbp0y059m06nz05j-nix-flake-tests-2.36.0pre332error: Cannot build '/nix/store/21qcasyk6cfp1f1cg8a5yp6cgfr215ng-nix-flake-tests-run.drv'.333       Reason: 1 dependency failed.334       Output paths:335         /nix/store/5j1w5ryvpwakcz65i3slg0dnsn4ka5k1-nix-flake-tests-run336error: Cannot build '/nix/store/r71nhkmrrrmrbs8hzrcp323qawbd8w7x-nix-functional-tests-2.36.0pre20260918_09e24b6.drv'.337       Reason: 3 dependencies failed.338       Output paths:339         /nix/store/bz7zx51h7xjmf7sszfprc7zg6qy5v1rw-nix-functional-tests-2.36.0pre20260918_09e24b6340error: Cannot build '/nix/store/sxgcj2cz28l4njbgvd2jvp9ypc3dhcwq-nix-manual-2.36.0pre20260918_09e24b6.drv'.341       Reason: 1 dependency failed.342       Output paths:343         /nix/store/8rmg5229m28874aamisin7ir8qfkppg8-nix-manual-2.36.0pre20260918_09e24b6-man344         /nix/store/jhh6cl4r79rkqg4lc9m0fifbfmmnq8f7-nix-manual-2.36.0pre20260918_09e24b6345error: Cannot build '/nix/store/sxgcj2cz28l4njbgvd2jvp9ypc3dhcwq-nix-manual-2.36.0pre20260918_09e24b6.drv'.346       Reason: 1 dependency failed.347       Output paths:348         /nix/store/8rmg5229m28874aamisin7ir8qfkppg8-nix-manual-2.36.0pre20260918_09e24b6-man349         /nix/store/jhh6cl4r79rkqg4lc9m0fifbfmmnq8f7-nix-manual-2.36.0pre20260918_09e24b6350error: Cannot build '/nix/store/m3p49al1vh52z8njjsp5fkm34qnq9dx3-nix-2.36.0pre20260918_09e24b6.drv'.351       Reason: 19 dependencies failed.352       Output paths:353         /nix/store/galf079i6yqb0v0s1dr21kbjczqml28a-nix-2.36.0pre20260918_09e24b6-dev354         /nix/store/q2rb5l2ak3sv6b2gz54fw9b42ramaia9-nix-2.36.0pre20260918_09e24b6355         /nix/store/wyy2bq6c3rrvx6agdn3lgmzrrl958rxp-nix-2.36.0pre20260918_09e24b6-man356         /nix/store/yaif46chghmn7frwy8kp12ic4qqrlk1f-nix-2.36.0pre20260918_09e24b6-doc357error: Cannot build '/nix/store/m3p49al1vh52z8njjsp5fkm34qnq9dx3-nix-2.36.0pre20260918_09e24b6.drv'.358       Reason: 19 dependencies failed.359       Output paths:360         /nix/store/galf079i6yqb0v0s1dr21kbjczqml28a-nix-2.36.0pre20260918_09e24b6-dev361         /nix/store/q2rb5l2ak3sv6b2gz54fw9b42ramaia9-nix-2.36.0pre20260918_09e24b6362         /nix/store/wyy2bq6c3rrvx6agdn3lgmzrrl958rxp-nix-2.36.0pre20260918_09e24b6-man363         /nix/store/yaif46chghmn7frwy8kp12ic4qqrlk1f-nix-2.36.0pre20260918_09e24b6-doc364go-mockery-3.8.0> Using versionCheckHook365go-mockery-3.8.0> Running phase: unpackPhase366go-mockery-3.8.0> unpacking source archive /nix/store/vrlv5sg9z041kz82fnr9qr2mzmb6grd5-source367go-mockery-3.8.0> source root is source368go-mockery-3.8.0> Running phase: patchPhase369go-mockery-3.8.0> patching script interpreter paths in e2e370go-mockery-3.8.0> e2e/test_mockery_generation.sh: interpreter directive changed from "#!/bin/bash" to "/nix/store/10dxp0qxqxxsyiljrh2kp0xqhz6arhcx-bash-5.3p15/bin/bash"371go-mockery-3.8.0> e2e/test_missing_interface/run.sh: interpreter directive changed from "#!/bin/bash" to "/nix/store/10dxp0qxqxxsyiljrh2kp0xqhz6arhcx-bash-5.3p15/bin/bash"372go-mockery-3.8.0> e2e/run_all.sh: interpreter directive changed from "#!/bin/bash" to "/nix/store/10dxp0qxqxxsyiljrh2kp0xqhz6arhcx-bash-5.3p15/bin/bash"373go-mockery-3.8.0> e2e/test_infinite_mocking.sh: interpreter directive changed from "#!/bin/bash" to "/nix/store/10dxp0qxqxxsyiljrh2kp0xqhz6arhcx-bash-5.3p15/bin/bash"374go-mockery-3.8.0> Running phase: updateAutotoolsGnuConfigScriptsPhase375go-mockery-3.8.0> Running phase: configurePhase376go-mockery-3.8.0> Running phase: buildPhase377go-mockery-3.8.0> Building subPackage ./.378go-mockery-3.8.0> go: downloading github.com/knadh/koanf/v2 v2.3.2379go-mockery-3.8.0> go: downloading github.com/rs/zerolog v1.34.0380go-mockery-3.8.0> go: downloading github.com/spf13/cobra v1.10.2381go-mockery-3.8.0> go: downloading github.com/spf13/pflag v1.0.10382go-mockery-3.8.0> go: downloading github.com/knadh/koanf/providers/structs v1.0.0383go-mockery-3.8.0> go: downloading golang.org/x/term v0.40.0384go-mockery-3.8.0> go: downloading github.com/jedib0t/go-pretty/v6 v6.7.8385go-mockery-3.8.0> go: downloading golang.org/x/tools v0.49.0386go-mockery-3.8.0> go: downloading gopkg.in/yaml.v3 v3.0.1387go-mockery-3.8.0> go: downloading github.com/knadh/koanf/parsers/yaml v1.1.0388go-mockery-3.8.0> go: downloading github.com/brunoga/deep v1.3.1389go-mockery-3.8.0> go: downloading github.com/knadh/koanf/providers/env v1.1.0390go-mockery-3.8.0> go: downloading github.com/knadh/koanf/providers/file v1.2.1391go-mockery-3.8.0> go: downloading github.com/knadh/koanf/providers/posflag v1.0.1392go-mockery-3.8.0> go: downloading github.com/go-viper/mapstructure/v2 v2.5.0393go-mockery-3.8.0> go: downloading golang.org/x/exp v0.0.0-20260212183809-81e46e3db34a394go-mockery-3.8.0> go: downloading github.com/huandu/xstrings v1.5.0395go-mockery-3.8.0> go: downloading github.com/xeipuuv/gojsonschema v1.2.0396go-mockery-3.8.0> go: downloading github.com/fsnotify/fsnotify v1.9.0397go-mockery-3.8.0> go: downloading github.com/knadh/koanf/maps v0.1.2398go-mockery-3.8.0> go: downloading github.com/fatih/structs v1.1.0399go-mockery-3.8.0> go: downloading go.yaml.in/yaml/v3 v3.0.4400go-mockery-3.8.0> go: downloading github.com/mitchellh/copystructure v1.2.0401go-mockery-3.8.0> go: downloading golang.org/x/sys v0.47.0402go-mockery-3.8.0> go: downloading github.com/mitchellh/reflectwalk v1.0.2403go-mockery-3.8.0> go: downloading github.com/mattn/go-colorable v0.1.14404go-mockery-3.8.0> go: downloading github.com/mattn/go-isatty v0.0.20405go-mockery-3.8.0> go: downloading github.com/xeipuuv/gojsonreference v0.0.0-20180127040603-bd5ef7bd5415406go-mockery-3.8.0> go: downloading github.com/xeipuuv/gojsonpointer v0.0.0-20190905194746-02993c407bfb407go-mockery-3.8.0> go: downloading github.com/mattn/go-runewidth v0.0.19408go-mockery-3.8.0> go: downloading golang.org/x/text v0.34.0409go-mockery-3.8.0> go: downloading github.com/clipperhouse/uax29/v2 v2.2.0410go-mockery-3.8.0> go: downloading golang.org/x/sync v0.22.0411go-mockery-3.8.0> go: downloading golang.org/x/mod v0.39.0412go-mockery-3.8.0> Running phase: checkPhase413go-mockery-3.8.0> task: [mocks.remove.unix] find . -name '*_mock.go' -o -name 'mock_*_test.go' -o -name "mocks_moq.go"  -o -name 'mocks_test.go' -o -name 'mocks_*_test.go' -o -name 'mocks_matryer_*.go' -o -name 'mocks.go' | xargs -r rm414go-mockery-3.8.0> task: [mocks.remove.unix] rm -rf mocks/415go-mockery-3.8.0> task: [mocks.generate.matryer] MOCKERY_CONFIG=./.mockery_matryer.yml GOWORK=off go run .416go-mockery-3.8.0> task: [mocks.generate.testify] MOCKERY_CONFIG=./.mockery_testify.yml GOWORK=off go run .417go-mockery-3.8.0> 2026-10-15T09:18:17.820950654Z INF Starting mockery config-file=./.mockery_matryer.yml version=v0.0.0-dev418go-mockery-3.8.0> 2026-10-15T09:18:17.821102684Z INF Parsing configured packages... version=v0.0.0-dev419go-mockery-3.8.0> 2026-10-15T09:18:18.102571631Z INF Starting mockery config-file=./.mockery_testify.yml version=v0.0.0-dev420go-mockery-3.8.0> 2026-10-15T09:18:18.102712781Z INF Parsing configured packages... version=v0.0.0-dev421go-mockery-3.8.0> 2026-10-15T09:18:18.226845855Z ERR encountered error when loading package error="/build/source/internal/fixtures/embedded_types/service.go:3:8: could not import context (reading /build/go-cache/16/16d7426311830f53869cc8722ab1bcb3419c71216fa9c306d75d02f25431fbee-d: internal error in importing \"context\" (cannot decode \"context\", export data version 5 is greater than maximum supported version 4); please report an issue)" version=v0.0.0-dev422go-mockery-3.8.0> 2026-10-15T09:18:18.226971265Z ERR unable to parse packages error="error occurred when loading packages" version=v0.0.0-dev423go-mockery-3.8.0> 2026-10-15T09:18:18.227003825Z FTL app failed error="error occurred when loading packages" version=v0.0.0-dev424go-mockery-3.8.0> exit status 1425go-mockery-3.8.0> 2026-10-15T09:18:19.686032094Z ERR encountered error when loading package error="/nix/store/s3i4lkb8m4cnijakqn8mb6rhp0qbaiyj-go-1.27.2/share/go/src/io/io.go:16:2: could not import errors (reading /build/go-cache/64/64bcccb3b27500a3a0f6fdc79a672810d6683ea360fbc5f9d7df4b0383c2cf74-d: internal error in importing \"errors\" (cannot decode \"errors\", export data version 5 is greater than maximum supported version 4); please report an issue)" version=v0.0.0-dev426go-mockery-3.8.0> 2026-10-15T09:18:19.686182324Z ERR encountered error when loading package error="/nix/store/s3i4lkb8m4cnijakqn8mb6rhp0qbaiyj-go-1.27.2/share/go/src/io/io.go:17:2: could not import sync (reading /build/go-cache/27/2736f9ab4399cc1406d9b685507448a397c14245acf9169e7b8bd2fa26d095bb-d: internal error in importing \"sync\" (cannot decode \"sync\", export data version 5 is greater than maximum supported version 4); please report an issue)" version=v0.0.0-dev427go-mockery-3.8.0> 2026-10-15T09:18:19.686241024Z ERR encountered error when loading package error="/nix/store/s3i4lkb8m4cnijakqn8mb6rhp0qbaiyj-go-1.27.2/share/go/src/io/pipe.go:22:4: a.Lock undefined (type *onceError has no field or method Lock)" version=v0.0.0-dev428go-mockery-3.8.0> 2026-10-15T09:18:19.686280864Z ERR encountered error when loading package error="/nix/store/s3i4lkb8m4cnijakqn8mb6rhp0qbaiyj-go-1.27.2/share/go/src/io/pipe.go:23:10: a.Unlock undefined (type *onceError has no field or method Unlock)" version=v0.0.0-dev429go-mockery-3.8.0> 2026-10-15T09:18:19.686310244Z ERR encountered error when loading package error="/nix/store/s3i4lkb8m4cnijakqn8mb6rhp0qbaiyj-go-1.27.2/share/go/src/io/pipe.go:30:4: a.Lock undefined (type *onceError has no field or method Lock)" version=v0.0.0-dev430go-mockery-3.8.0> 2026-10-15T09:18:19.686346674Z ERR encountered error when loading package error="/nix/store/s3i4lkb8m4cnijakqn8mb6rhp0qbaiyj-go-1.27.2/share/go/src/io/pipe.go:31:10: a.Unlock undefined (type *onceError has no field or method Unlock)" version=v0.0.0-dev431go-mockery-3.8.0> 2026-10-15T09:18:19.686378374Z ERR unable to parse packages error="error occurred when loading packages" version=v0.0.0-dev432go-mockery-3.8.0> 2026-10-15T09:18:19.686413114Z FTL app failed error="error occurred when loading packages" version=v0.0.0-dev433go-mockery-3.8.0> exit status 1434go-mockery-3.8.0> task: Failed to run task "test.ci": task: Failed to run task "mocks": task: Failed to run task "mocks.generate": task: Failed to run task "mocks.generate.matryer": exit status 1435error: Cannot build '/nix/store/gkqgcnhs8mhk2iph8z1gv8gkm6s8c8p2-go-mockery-3.8.0.drv'.436       Reason: builder failed with exit code 201.437       Output paths:438         /nix/store/d17x8sn2schb2x6r357i35ql9i7h0f4y-go-mockery-3.8.0439       Last 25 log lines:440       > go: downloading golang.org/x/sync v0.22.0441       > go: downloading golang.org/x/mod v0.39.0442       > Running phase: checkPhase443       > task: [mocks.remove.unix] find . -name '*_mock.go' -o -name 'mock_*_test.go' -o -name "mocks_moq.go"  -o -name 'mocks_test.go' -o -name 'mocks_*_test.go' -o -name 'mocks_matryer_*.go' -o -name 'mocks.go' | xargs -r rm444       > task: [mocks.remove.unix] rm -rf mocks/445       > task: [mocks.generate.matryer] MOCKERY_CONFIG=./.mockery_matryer.yml GOWORK=off go run .446       > task: [mocks.generate.testify] MOCKERY_CONFIG=./.mockery_testify.yml GOWORK=off go run .447       > 2026-10-15T09:18:17.820950654Z INF Starting mockery config-file=./.mockery_matryer.yml version=v0.0.0-dev448       > 2026-10-15T09:18:17.821102684Z INF Parsing configured packages... version=v0.0.0-dev449       > 2026-10-15T09:18:18.102571631Z INF Starting mockery config-file=./.mockery_testify.yml version=v0.0.0-dev450       > 2026-10-15T09:18:18.102712781Z INF Parsing configured packages... version=v0.0.0-dev451       > 2026-10-15T09:18:18.226845855Z ERR encountered error when loading package error="/build/source/internal/fixtures/embedded_types/service.go:3:8: could not import context (reading /build/go-cache/16/16d7426311830f53869cc8722ab1bcb3419c71216fa9c306d75d02f25431fbee-d: internal error in importing \"context\" (cannot decode \"context\", export data version 5 is greater than maximum supported version 4); please report an issue)" version=v0.0.0-dev452       > 2026-10-15T09:18:18.226971265Z ERR unable to parse packages error="error occurred when loading packages" version=v0.0.0-dev453       > 2026-10-15T09:18:18.227003825Z FTL app failed error="error occurred when loading packages" version=v0.0.0-dev454       > exit status 1455       > 2026-10-15T09:18:19.686032094Z ERR encountered error when loading package error="/nix/store/s3i4lkb8m4cnijakqn8mb6rhp0qbaiyj-go-1.27.2/share/go/src/io/io.go:16:2: could not import errors (reading /build/go-cache/64/64bcccb3b27500a3a0f6fdc79a672810d6683ea360fbc5f9d7df4b0383c2cf74-d: internal error in importing \"errors\" (cannot decode \"errors\", export data version 5 is greater than maximum supported version 4); please report an issue)" version=v0.0.0-dev456       > 2026-10-15T09:18:19.686182324Z ERR encountered error when loading package error="/nix/store/s3i4lkb8m4cnijakqn8mb6rhp0qbaiyj-go-1.27.2/share/go/src/io/io.go:17:2: could not import sync (reading /build/go-cache/27/2736f9ab4399cc1406d9b685507448a397c14245acf9169e7b8bd2fa26d095bb-d: internal error in importing \"sync\" (cannot decode \"sync\", export data version 5 is greater than maximum supported version 4); please report an issue)" version=v0.0.0-dev457       > 2026-10-15T09:18:19.686241024Z ERR encountered error when loading package error="/nix/store/s3i4lkb8m4cnijakqn8mb6rhp0qbaiyj-go-1.27.2/share/go/src/io/pipe.go:22:4: a.Lock undefined (type *onceError has no field or method Lock)" version=v0.0.0-dev458       > 2026-10-15T09:18:19.686280864Z ERR encountered error when loading package error="/nix/store/s3i4lkb8m4cnijakqn8mb6rhp0qbaiyj-go-1.27.2/share/go/src/io/pipe.go:23:10: a.Unlock undefined (type *onceError has no field or method Unlock)" version=v0.0.0-dev459       > 2026-10-15T09:18:19.686310244Z ERR encountered error when loading package error="/nix/store/s3i4lkb8m4cnijakqn8mb6rhp0qbaiyj-go-1.27.2/share/go/src/io/pipe.go:30:4: a.Lock undefined (type *onceError has no field or method Lock)" version=v0.0.0-dev460       > 2026-10-15T09:18:19.686346674Z ERR encountered error when loading package error="/nix/store/s3i4lkb8m4cnijakqn8mb6rhp0qbaiyj-go-1.27.2/share/go/src/io/pipe.go:31:10: a.Unlock undefined (type *onceError has no field or method Unlock)" version=v0.0.0-dev461       > 2026-10-15T09:18:19.686378374Z ERR unable to parse packages error="error occurred when loading packages" version=v0.0.0-dev462       > 2026-10-15T09:18:19.686413114Z FTL app failed error="error occurred when loading packages" version=v0.0.0-dev463       > exit status 1464       > task: Failed to run task "test.ci": task: Failed to run task "mocks": task: Failed to run task "mocks.generate": task: Failed to run task "mocks.generate.matryer": exit status 1465       For full logs, run:466         nix log /nix/store/gkqgcnhs8mhk2iph8z1gv8gkm6s8c8p2-go-mockery-3.8.0.drv467error: Cannot build '/nix/store/5blymz8vn1vs1g9ajhfd431n9m17vkh4-sesh-2.32.0.drv'.468       Reason: 1 dependency failed.469       Output paths:470         /nix/store/slrxxr0bjf6zgkb4znqvbr9fwkjmfcrz-sesh-2.32.0