nixbot

builds

cancelled checks.x86_64-linux.nixos-matchbox build #808 · raw · eval 18.4 s · 1.4 GiB allocated · ·

1these 93 derivations will be built:2  /nix/store/8bf493v80l25yf2dvhfv77125dv6h84i-vendor-registry.drv3  /nix/store/vsd57k6nv0phs7d9jjpd8i916zlmr2cs-vendor-cargo-deps.drv4  /nix/store/3myy80cr2ysz6x2s6fsnz4q3dwqdk098-tincd-deps-0.1.0.drv5  /nix/store/dfgvgnbfa7836ilrs8qsxrwgrvncawad-tincd-0.1.0.drv6  /nix/store/02rs77wpqi7zlrip8drsa3k65jikpzyk-unit-tincr-retiolum.service.drv7  /nix/store/v2m9s85ybjwqmagl4cjdys6jgy0yy42z-nix-store-2.36.0pre.drv8  /nix/store/2nadarzfx4204sjkl2xwjdf3z19n63y2-nix-fetchers-2.36.0pre.drv9  /nix/store/sxnasgvjr7a8hvg3n8w9l961pciy1g13-nix-store-c-2.36.0pre.drv10  /nix/store/a5npk3j5sjqhwnkq163h9ijccxcdwk48-nix-expr-2.36.0pre.drv11  /nix/store/vp65rb9lbq5c6pwf1mkabyz09nwgigbr-nix-expr-c-2.36.0pre.drv12  /nix/store/ikxwb4anvib05pz97a7irdd3zdcqfkbd-nix-fetchers-c-2.36.0pre.drv13  /nix/store/lp7vgrj5rx8vkc522ghffw5v51zn8gg1-nix-flake-2.36.0pre.drv14  /nix/store/78vrmb9y2cmwk57b3dj19688frsm44n2-nix-flake-c-2.36.0pre.drv15  /nix/store/9kzwqrbpa8566m45rw2lbc6qn4ckabda-nix-store-test-support-2.36.0pre.drv16  /nix/store/9cjrmbhhg6ymlppx70yn5158wy8hrm8z-nix-util-test-support-2.36.0pre.drv17  /nix/store/dzsdf6nk4j6wz2my53l01pvv955w5fvn-nix-flake-tests-2.36.0pre.drv18  /nix/store/21qcasyk6cfp1f1cg8a5yp6cgfr215ng-nix-flake-tests-run.drv19  /nix/store/ws9l2l2phzjvnfl4ck3iyki9rci8909k-nix-expr-tests-2.36.0pre.drv20  /nix/store/5dj8slb0dzaa2anmd71r51cf585bv9jq-nix-expr-tests-run.drv21  /nix/store/mmdd6pjxl5pcq39dvnjyza8an45jj38a-nix-main-2.36.0pre.drv22  /nix/store/kyvnhy1bsksljwyfx8y9qfd1a7qgd84c-nix-cmd-2.36.0pre.drv23  /nix/store/rxnmvhf70i800adkpqff584ami6ng8dp-nix-main-c-2.36.0pre.drv24  /nix/store/ckgk8lxiwdy04pg1l6jh1vkxnk095r61-nix-2.36.0pre20260918_09e24b6.drv25  /nix/store/9709y4fpmlmignzwbfrbiaf82fxj9b1f-nix-store-tests-2.36.0pre.drv26  /nix/store/kgj36snczcgjlry62di6h0zyh7sw8226-nix-store-tests-run.drv27  /nix/store/r71nhkmrrrmrbs8hzrcp323qawbd8w7x-nix-functional-tests-2.36.0pre20260918_09e24b6.drv28  /nix/store/sxgcj2cz28l4njbgvd2jvp9ypc3dhcwq-nix-manual-2.36.0pre20260918_09e24b6.drv29  /nix/store/dqi93g30b3xag1fqrdlnljjy1iy2mxgv-nix-fetchers-tests-2.36.0pre.drv30  /nix/store/w5sbnbc4yayksrk7pjjhjhcrq6wzzvbc-nix-fetchers-tests-run.drv31  /nix/store/m3p49al1vh52z8njjsp5fkm34qnq9dx3-nix-2.36.0pre20260918_09e24b6.drv32  /nix/store/1hl5v882hlf9c6b0fy74kjr50hv7v105-nixos-option-26.11.drv33  /nix/store/5iv5crlkwdcnizv7j08pzb8xflml9kdn-nixos-rebuild-ng-26.11.drv34  /nix/store/7143b3wsldjlbirzpl9205jzn5gnhkl6-system-path.drv35  /nix/store/wz95bfp2kxs5adpvzyskysd1wyr8f0xq-dbus-1.drv36  /nix/store/jw4alj5lnlx6j0p0xslalvmfjwgqgybn-X-Restart-Triggers-dbus-broker.drv37  /nix/store/1yisvwwxg8k0v9mdlmpbfbmsbls3c70x-unit-dbus-broker.service.drv38  /nix/store/2l0yz98xdjpkvrn84dkdb2nrk934anw8-nginx.conf.drv39  /nix/store/7b09vfibiw9y09a1blg2g787hpb2vwd1-set-environment.drv40  /nix/store/36v9xk9wjiskwj9y8jbb59vf5vm6r10k-etc-zshenv.drv41  /nix/store/qm9r843awzizdpxcm9kkfk65zrh6s7v8-unit-dbus-broker.service.drv42  /nix/store/523jizxm6wk7r6vgr1isxvsni4znxr3c-user-units.drv43  /nix/store/mcz1ish3r8y9xzx30kmgx438iqs9z33q-config.toml.drv44  /nix/store/610bh8a87sy70fcr00ww0hg1vld3rgqq-unit-telegraf.service.drv45  /nix/store/6ph3qx4yk2kk6c47mw54rrhimiwh0d18-tmpfiles.d.drv46  /nix/store/x4f05kddgbncp12gigwpk2mj38l864c2-nix-tarmac-0.1.0.drv47  /nix/store/yn2pynw1kjn8rgj34rg76npbywgxf8v1-nix-tarmac-0.1.0.drv48  /nix/store/73m5kf01zlgk3jhw7vxf3f9vp2snbbsl-nix-tarmac-dispatcher.drv49  /nix/store/84s1ly0ac80185ch8fysprizg58a5j6d-torrc.drv50  /nix/store/9gxbpp3kl6f4cil9zch9mqgmps02n8dj-systemd-boot.drv51  /nix/store/866kb8xsbf5wbbn8jia4k2jwgmxyav91-install-systemd-boot.sh.drv52  /nix/store/v25gg9j57kr1xizycbsvjl10w7nm64fq-zfs-kernel-2.4.4-7.2.9.drv53  /nix/store/86lrs1461jbmvb6z0v2nbs76ybknmvmw-linux-7.2.9-modules.drv54  /nix/store/gbxril701xnmld6lsndqhfvp6v72xhsr-etc-pam-environment.drv55  /nix/store/9qc36z13l6mhscry5ajq4wx6dnihybws-fluent-bit-journal-filter-static-wasm32-unknown-wasip1-0.1.0.drv56  /nix/store/sy6rc54shmjif98h5ycyxgx6jvladmd2-fluent-bit.yaml.drv57  /nix/store/948w5kaa57m04si615n2pwa3pfriykrr-unit-fluent-bit.service.drv58  /nix/store/vg11cy79kipxawmrqc73s3rwpk75fk47-unit-script-nginx-pre-start.drv59  /nix/store/ahqsxszlff6r9h2mi31vdi48yc1j95iv-unit-nginx.service.drv60  /nix/store/lqmdk0xx8m0ph3xbif1x0js8zyfwfa2k-manage.drv61  /nix/store/ip5f5r4liw0rjd34yrdl3vlnrzaw7rq0-unit-script-photoprism-pre-start.drv62  /nix/store/yb84chqnpvj08jgli1lacawn26zwk0n7-unit-script-photoprism-start.drv63  /nix/store/b1w5rvkmx62y4mmrn48l5zs3if2cvdl1-unit-photoprism.service.drv64  /nix/store/p7v2z7416s7nl47bzcr56k80sabaddy9-hosts.drv65  /nix/store/c6hv0mwq430cf3zy9wial79m7lmrkm8i-nftables-rules.drv66  /nix/store/dnbpx9kc8qmqsnwdjdg6nxpcsslhghm0-unit-nftables.service.drv67  /nix/store/dnzqz0mw9sj6l2kaarmid6qdbab721ny-unit-harmonia-gc.service.drv68  /nix/store/k1vhm3j3c0qh6slhipx2myyz20dkr48v-X-Restart-Triggers-tor.drv69  /nix/store/hjq8p886lx1mlwxdrg526p8lmkark41r-unit-tor.service.drv70  /nix/store/zmrbrqzsa7rahyd1l5szmqlpg4j6fd3a-nix.conf.drv71  /nix/store/c3inw53lcrs5bxcmpd1gfpzvq798cnvf-X-Restart-Triggers-nix-daemon.drv72  /nix/store/iygz9dh1sp1apk7f2ykmmnnbrlmvawpr-unit-nix-daemon.service.drv73  /nix/store/wp812r8idmqf5q1fgmz39riqh71xy2w0-unit-script-nix-gc-start.drv74  /nix/store/jh4cj3gwvqkgcmycciky1n6y5g48yjzl-unit-nix-gc.service.drv75  /nix/store/lvzmcqzhi0ywbdmkjjw17xz6m39ymils-unit-nix-optimise.service.drv76  /nix/store/mcqm0il24v51wmp9759kaf31049924w4-unit-generate-shutdown-ramfs.service.drv77  /nix/store/xcj23cifkfyzpp8qnhq3wds2xcgs9aq2-X-Restart-Triggers-systemd-tmpfiles-resetup.drv78  /nix/store/q9crnn0xw5968gwx2i817npyaccrcn5q-unit-systemd-tmpfiles-resetup.service.drv79  /nix/store/mkw3bj7a1bn1kw9zkm1qi3fqjzhk1kky-unit-script-update-prefetch-start.drv80  /nix/store/zy3iz584jwii0fnx46jdf1s23237cdl8-unit-update-prefetch.service.drv81  /nix/store/gmsbn3ldi98zabw2mhsj4h27015hms8k-system-units.drv82  /nix/store/hzbjhz95nfqlivic49m6w4qjg5cz310k-system-generators.drv83  /nix/store/lbh8cmk637gk9fsr838a08hmamjy4f63-system-crontab.drv84  /nix/store/nsff7jbxb759k3d5gycfyf273rbind74-crontabs.drv85  /nix/store/vcmqfk7pix565xjvlgfb995n1jmb4524-etc-profile.drv86  /nix/store/whxvxhi0wvvfjl70gi141nm5ixalglrw-user-generators.drv87  /nix/store/zlm3m91nqnlh0l9v9a1563rw6vn6iknk-system-shutdown.drv88  /nix/store/8zds2da1hbpiirp1jnr6m4q8qpl9p1dg-etc.drv89  /nix/store/vf1dvmb0nhli4aq1hxk55ydfv3svly80-linux-7.2.9-modules-shrunk.drv90  /nix/store/jhag2a3jymryhm87yna99aqwrv69ay31-initrd-linux-7.2.9.drv91  /nix/store/l4cdpw5058xjlfmq1gbg7ag4ybvgfza9-boot.json.drv92  /nix/store/qr6818xz63sg3gkq2k8rkwf4zq4s2gvi-activate.drv93  /nix/store/x3i1v567k5l3livvsh3db8mpvmjhiy86-pre-switch-checks.drv94  /nix/store/q4h8qw0z0y72mwmskhz6w9h07xq3yawr-nixos-system-matchbox-26.11.20261015.3a3da56.drv95these 8 paths will be fetched (286.0 MiB download, 807.8 MiB unpacked):96  /nix/store/h3zrgsrdpycscwffd6k4nq066m9chljd-cgif-0.5.497  /nix/store/nn8jp94lgma7nn4q9qv3jj4wj6qpqr37-colord-1.4.898  /nix/store/3x5jbsxb4hwp6f8wj9nm2d914502kwp5-colord-gtk-0.3.199  /nix/store/4z6zx6a8sxkm68l644raf40gg1pskxmv-darktable-5.6.2100  /nix/store/5w1piiwkzkb07mnh3i47cy5x5cc51k8q-linux-7.2.9-dev101  /nix/store/4banir6pmxh4999qb2sc05q9z6hl30z1-photoprism-260728-bbde8f452102  /nix/store/d66h1mqx0zg9r8y3kvmbamadvxv58s7q-photoprism-backend-260728-bbde8f452103  /nix/store/wrfn9h2cmxynkhag4lnfnjrwwpmwam52-vips-8.18.7104building '/nix/store/p7v2z7416s7nl47bzcr56k80sabaddy9-hosts.drv'105building '/nix/store/2l0yz98xdjpkvrn84dkdb2nrk934anw8-nginx.conf.drv'106hosts> tribuchet: building on jamie107nginx.conf> tribuchet: building on jamie108building '/nix/store/mcz1ish3r8y9xzx30kmgx438iqs9z33q-config.toml.drv'109building '/nix/store/x3i1v567k5l3livvsh3db8mpvmjhiy86-pre-switch-checks.drv'110config.toml> tribuchet: building on jamie111pre-switch-checks> tribuchet: building on jamie112building '/nix/store/lqmdk0xx8m0ph3xbif1x0js8zyfwfa2k-manage.drv'113building '/nix/store/yb84chqnpvj08jgli1lacawn26zwk0n7-unit-script-photoprism-start.drv'114manage> tribuchet: building on jamie115unit-script-photoprism-start> tribuchet: building on jamie116config.toml> structuredAttrs is enabled117pre-switch-checks> structuredAttrs is enabled118building '/nix/store/c6hv0mwq430cf3zy9wial79m7lmrkm8i-nftables-rules.drv'119building '/nix/store/610bh8a87sy70fcr00ww0hg1vld3rgqq-unit-telegraf.service.drv'120nftables-rules> tribuchet: building on jamie121unit-telegraf.service> tribuchet: building on jamie122building '/nix/store/v2m9s85ybjwqmagl4cjdys6jgy0yy42z-nix-store-2.36.0pre.drv'123nix-store-2.36.0pre> tribuchet: building on jamie124nix-store-2.36.0pre> structuredAttrs is enabled125nix-store-2.36.0pre> Running phase: unpackPhase126nix-store-2.36.0pre> unpacking source archive /nix/store/pbz1v61cy6xzq80izg37pszbvi1kd5x6-source127nix-store-2.36.0pre> source root is source/./src/libstore128nix-store-2.36.0pre> separate-debug-info: recording checksum of source files for debug support...129nix-store-2.36.0pre> Running phase: patchPhase130nix-store-2.36.0pre> Running phase: updateAutotoolsGnuConfigScriptsPhase131nix-store-2.36.0pre> Running phase: configurePhase132nix-store-2.36.0pre> mesonConfigurePhase flags: --prefix=/nix/store/rzrwfv0mg39v19wnxpjg44icc4fva3a0-nix-store-2.36.0pre --libdir=/nix/store/rzrwfv0mg39v19wnxpjg44icc4fva3a0-nix-store-2.36.0pre/lib --libexecdir=/nix/store/rzrwfv0mg39v19wnxpjg44icc4fva3a0-nix-store-2.36.0pre/libexec --bindir=/nix/store/rzrwfv0mg39v19wnxpjg44icc4fva3a0-nix-store-2.36.0pre/bin --sbindir=/nix/store/rzrwfv0mg39v19wnxpjg44icc4fva3a0-nix-store-2.36.0pre/sbin --includedir=/nix/store/vnj3zmcz9lsaf8x7y6vg9fmm7dvqmj9c-nix-store-2.36.0pre-dev/include --mandir=/nix/store/rzrwfv0mg39v19wnxpjg44icc4fva3a0-nix-store-2.36.0pre/share/man --infodir=/nix/store/rzrwfv0mg39v19wnxpjg44icc4fva3a0-nix-store-2.36.0pre/share/info --localedir=/nix/store/rzrwfv0mg39v19wnxpjg44icc4fva3a0-nix-store-2.36.0pre/share/locale -Dauto_features=enabled -Dwrap_mode=nodownload --buildtype=release -Dseccomp-sandboxing=enabled -Dembedded-sandbox-shell=false -Ds3-aws-auth=enabled -Dsandbox-shell=/nix/store/r6zw8gd10c7qv9sifzg4r7h1s5qmrxjp-busybox-1.37.0/bin/busybox -Dunity=on -Dunity_size=8192 -Db_pch=false -Db_lto=true133nix-store-2.36.0pre> The Meson build system134nix-store-2.36.0pre> Version: 1.12.1135nix-store-2.36.0pre> Source dir: /build/source/src/libstore136nix-store-2.36.0pre> Build dir: /build/source/src/libstore/build137nix-store-2.36.0pre> Build type: native build138nix-store-2.36.0pre> Project name: nix-store139nix-store-2.36.0pre> Project version: 2.36.0pre140nix-store-2.36.0pre> C++ compiler for the host machine: g++ (gcc 16.2.0 "g++ (GCC) 16.2.0")141nix-store-2.36.0pre> C++ linker for the host machine: g++ ld.bfd 2.46142nix-store-2.36.0pre> Host machine cpu family: x86_64143nix-store-2.36.0pre> Host machine cpu: x86_64144nix-store-2.36.0pre> Found pkg-config: YES (/nix/store/b9izmrfjp0qnnyahdwwrzdwi87s1h179-pkg-config-wrapper-0.29.2/bin/pkg-config) 0.29.2145nix-store-2.36.0pre> Run-time dependency nix-util found: YES 2.36.0pre146nix-store-2.36.0pre> Program ln found: YES (/nix/store/2gfxiwls9hbgwdwcy43mprchwsq36mg6-coreutils-9.11/bin/ln)147nix-store-2.36.0pre> Checking for function "posix_fallocate" : YES 148nix-store-2.36.0pre> Checking for function "statvfs" : YES 149nix-store-2.36.0pre> Checking for function "open_tree" : YES 150nix-store-2.36.0pre> Checking for function "move_mount" : YES 151nix-store-2.36.0pre> Has header "linux/landlock.h" : YES 152nix-store-2.36.0pre> Has header "sys/xattr.h" : YES 153nix-store-2.36.0pre> Checking for function "llistxattr" : YES 154nix-store-2.36.0pre> Checking for function "lremovexattr" : YES 155nix-store-2.36.0pre> Run-time dependency Boost (found: container, url) for cpp found: YES 1.91.0156nix-store-2.36.0pre> Run-time dependency libcurl found: YES 8.22.0157nix-store-2.36.0pre> Run-time dependency libseccomp found: YES 2.6.1158nix-store-2.36.0pre> Run-time dependency nlohmann_json found: YES 3.12.0159nix-store-2.36.0pre> Run-time dependency sqlite3 found: YES 3.53.3160nix-store-2.36.0pre> Found CMake: /nix/store/jcvvpih1046akxcwh9hdiak5q24jqcf0-cmake-4.4.3/bin/cmake (4.4.3)161nix-store-2.36.0pre> Run-time dependency aws-crt-cpp (modules: AWS::aws-crt-cpp) found: YES 0.34.3162nix-store-2.36.0pre> Program /nix/store/r6zw8gd10c7qv9sifzg4r7h1s5qmrxjp-busybox-1.37.0/bin/busybox found: YES (/nix/store/r6zw8gd10c7qv9sifzg4r7h1s5qmrxjp-busybox-1.37.0/bin/busybox)163nix-store-2.36.0pre> Program lsof found: NO164nix-store-2.36.0pre> Configuring store-config-private.hh using configuration165nix-store-2.36.0pre> Run-time dependency threads found: YES166nix-store-2.36.0pre> Compiler for C++ supports arguments -Wdeprecated-copy: YES 167nix-store-2.36.0pre> Compiler for C++ supports arguments -Werror=suggest-override: YES 168nix-store-2.36.0pre> Compiler for C++ supports arguments -Werror=switch: YES 169nix-store-2.36.0pre> Compiler for C++ supports arguments -Werror=switch-enum: YES 170nix-store-2.36.0pre> Compiler for C++ supports arguments -Werror=undef: YES 171nix-store-2.36.0pre> Compiler for C++ supports arguments -Werror=unused-result: YES 172nix-store-2.36.0pre> Compiler for C++ supports arguments -Werror=sign-compare: YES 173nix-store-2.36.0pre> Compiler for C++ supports arguments -Werror=return-type: YES 174nix-store-2.36.0pre> Compiler for C++ supports arguments -Werror=non-virtual-dtor: YES 175nix-store-2.36.0pre> Compiler for C++ supports arguments -Wignored-qualifiers: YES 176nix-store-2.36.0pre> Compiler for C++ supports arguments -Wimplicit-fallthrough: YES 177nix-store-2.36.0pre> Compiler for C++ supports arguments -Wno-c23-extensions: NO 178nix-store-2.36.0pre> Compiler for C++ supports arguments -Wno-deprecated-declarations: YES 179nix-store-2.36.0pre> Compiler for C++ supports arguments -Wno-interference-size: YES 180nix-store-2.36.0pre> Compiler for C++ supports arguments -Wno-subobject-linkage: YES 181nix-store-2.36.0pre> Compiler for C++ supports arguments -Werror=c99-designator: NO 182nix-store-2.36.0pre> Compiler for C++ supports arguments -Werror=weak-vtables: NO 183nix-store-2.36.0pre> Checking if "using libstdc++" compiles: YES 184nix-store-2.36.0pre> Checking if "linker can wrap __assert_fail" links: YES 185nix-store-2.36.0pre> Program python3 found: YES186nix-store-2.36.0pre> Program run-clang-tidy found: NO187nix-store-2.36.0pre> Run-time dependency nix-clang-tidy found: NO  (tried pkg-config and cmake)188nix-store-2.36.0pre> meson.build:257: WARNING: 'build/build-log.cc' is a generated file, and should be passed by reference instead of string name. This will become a hard error in Meson 2.0189nix-store-2.36.0pre> meson.build:257: WARNING: 'build/derivation-builder-impl.cc' is a generated file, and should be passed by reference instead of string name. This will become a hard error in Meson 2.0190nix-store-2.36.0pre> meson.build:257: WARNING: 'build/derivation-builder.cc' is a generated file, and should be passed by reference instead of string name. This will become a hard error in Meson 2.0191nix-store-2.36.0pre> meson.build:257: WARNING: 'build/derivation-building-goal.cc' is a generated file, and should be passed by reference instead of string name. This will become a hard error in Meson 2.0192nix-store-2.36.0pre> meson.build:257: WARNING: 'build/derivation-check.cc' is a generated file, and should be passed by reference instead of string name. This will become a hard error in Meson 2.0193nix-store-2.36.0pre> meson.build:257: WARNING: 'build/derivation-env-desugar.cc' is a generated file, and should be passed by reference instead of string name. This will become a hard error in Meson 2.0194nix-store-2.36.0pre> meson.build:257: WARNING: 'build/derivation-goal.cc' is a generated file, and should be passed by reference instead of string name. This will become a hard error in Meson 2.0195nix-store-2.36.0pre> meson.build:257: WARNING: 'build/derivation-resolution-goal.cc' is a generated file, and should be passed by reference instead of string name. This will become a hard error in Meson 2.0196nix-store-2.36.0pre> meson.build:257: WARNING: 'build/derivation-trampoline-goal.cc' is a generated file, and should be passed by reference instead of string name. This will become a hard error in Meson 2.0197nix-store-2.36.0pre> meson.build:257: WARNING: 'build/drv-output-substitution-goal.cc' is a generated file, and should be passed by reference instead of string name. This will become a hard error in Meson 2.0198nix-store-2.36.0pre> meson.build:257: WARNING: 'build/entry-points.cc' is a generated file, and should be passed by reference instead of string name. This will become a hard error in Meson 2.0199nix-store-2.36.0pre> meson.build:257: WARNING: 'build/goal.cc' is a generated file, and should be passed by reference instead of string name. This will become a hard error in Meson 2.0200nix-store-2.36.0pre> meson.build:257: WARNING: 'build/substitution-goal.cc' is a generated file, and should be passed by reference instead of string name. This will become a hard error in Meson 2.0201nix-store-2.36.0pre> meson.build:257: WARNING: 'build/worker.cc' is a generated file, and should be passed by reference instead of string name. This will become a hard error in Meson 2.0202nix-store-2.36.0pre> Configuring config.hh using configuration203nix-store-2.36.0pre> Found pkg-config: YES (/nix/store/b9izmrfjp0qnnyahdwwrzdwi87s1h179-pkg-config-wrapper-0.29.2/bin/pkg-config) 0.29.2204nix-store-2.36.0pre> Build targets in project: 1205nix-store-2.36.0pre> 206nix-store-2.36.0pre> nix-store 2.36.0pre207nix-store-2.36.0pre> 208nix-store-2.36.0pre>     can hardlink to symlink: YES209nix-store-2.36.0pre> 210nix-store-2.36.0pre>   User defined options211nix-store-2.36.0pre>     auto_features          : enabled212nix-store-2.36.0pre>     b_lto                  : true213nix-store-2.36.0pre>     b_pch                  : false214nix-store-2.36.0pre>     bindir                 : /nix/store/rzrwfv0mg39v19wnxpjg44icc4fva3a0-nix-store-2.36.0pre/bin215nix-store-2.36.0pre>     buildtype              : release216nix-store-2.36.0pre>     embedded-sandbox-shell : false217nix-store-2.36.0pre>     includedir             : /nix/store/vnj3zmcz9lsaf8x7y6vg9fmm7dvqmj9c-nix-store-2.36.0pre-dev/include218nix-store-2.36.0pre>     infodir                : /nix/store/rzrwfv0mg39v19wnxpjg44icc4fva3a0-nix-store-2.36.0pre/share/info219nix-store-2.36.0pre>     libdir                 : /nix/store/rzrwfv0mg39v19wnxpjg44icc4fva3a0-nix-store-2.36.0pre/lib220nix-store-2.36.0pre>     libexecdir             : /nix/store/rzrwfv0mg39v19wnxpjg44icc4fva3a0-nix-store-2.36.0pre/libexec221nix-store-2.36.0pre>     localedir              : /nix/store/rzrwfv0mg39v19wnxpjg44icc4fva3a0-nix-store-2.36.0pre/share/locale222nix-store-2.36.0pre>     mandir                 : /nix/store/rzrwfv0mg39v19wnxpjg44icc4fva3a0-nix-store-2.36.0pre/share/man223nix-store-2.36.0pre>     prefix                 : /nix/store/rzrwfv0mg39v19wnxpjg44icc4fva3a0-nix-store-2.36.0pre224nix-store-2.36.0pre>     s3-aws-auth            : enabled225nix-store-2.36.0pre>     sandbox-shell          : /nix/store/r6zw8gd10c7qv9sifzg4r7h1s5qmrxjp-busybox-1.37.0/bin/busybox226nix-store-2.36.0pre>     sbindir                : /nix/store/rzrwfv0mg39v19wnxpjg44icc4fva3a0-nix-store-2.36.0pre/sbin227nix-store-2.36.0pre>     seccomp-sandboxing     : enabled228nix-store-2.36.0pre>     unity                  : on229nix-store-2.36.0pre>     unity_size             : 8192230nix-store-2.36.0pre>     wrap_mode              : nodownload231nix-store-2.36.0pre> 232nix-store-2.36.0pre> Found ninja-1.13.2 at /nix/store/4nsdla28c4177ssp0hlyv5l2yzj8wcba-ninja-1.13.2/bin/ninja233nix-store-2.36.0pre> Running postconf script '/nix/store/lb41b0anx1f98y9y5s9mdv97gjgsq740-python3-3.14.7/bin/python3.14 /build/source/src/libstore/nix-meson-build-support/common/clang-tidy/clean_compdb.py /build/source/src/libstore/build/compile_commands.json /build/source/src/libstore/build/nix-meson-build-support/common/clang-tidy/compile_commands.json'234nix-store-2.36.0pre> Running phase: buildPhase235nix-store-2.36.0pre> build flags: -j24236nix-store-2.36.0pre> [1/2] Compiling C++ object libnixstore.so.2.36.0.p/meson-generated_nixstore-unity0.cpp.o237nix-store-2.36.0pre> FAILED: [code=1] libnixstore.so.2.36.0.p/meson-generated_nixstore-unity0.cpp.o 238nix-store-2.36.0pre> g++ -Ilibnixstore.so.2.36.0.p -I. -I.. -Iinclude -I../include -I../linux/build -Ilinux/include -I../linux/include -I../unix/build -Iunix/include -I../unix/include -I/nix/store/la1rzzb3q1wjdz50dyvh62fix41ayifa-nix-util-2.36.0pre-dev/include -I/nix/store/2ybid2fqf6nfqrwcgizv9qvvckyp6axh-libarchive-3.8.9-dev/include -I/nix/store/0dz9bi5rv50d46w8xykwdxrj4ssy6pnp-nlohmann_json-3.12.0/include -I/nix/store/aph5dkajglxjn9642bp0h3x7cwzijr52-curl-8.22.0-dev/include -I/nix/store/q2yrf8yhmj405nv9qbbraxr8wlz7n5kv-libseccomp-2.6.1-dev/include -I/nix/store/xrcjl59yi7zswbv0vzm8cmvw4vplsbgj-sqlite-3.53.3-dev/include -I/nix/store/2zgasbvd9mzmj145mxsmnzxiy7rnz82b-aws-c-http-0.11.0/include -I/nix/store/3qrc60ba9qwxiyx8wlnfwwvqknpmhbmb-aws-crt-cpp-0.34.3-dev/include -I/nix/store/45ndmvc3vy9rd30mk71bq89gigzdx64p-aws-c-sdkutils-0.2.4/include -I/nix/store/5w514y0s25ym17bsrw43wl33fbxvy91a-aws-c-compression-0.3.1/include -I/nix/store/ai6kkxbkfjgkmpkwamrvhc5d1m3l5v1d-aws-c-cal-0.9.2/include -I/nix/store/bg4d55k9sg2x763215brap5ndhnqil53-aws-c-auth-0.9.1/include -I/nix/store/cf610ccndgvh5nfhbarjbqpvr3zkb3vr-aws-c-event-stream-0.7.0/include -I/nix/store/hc6mxys4iyawmwiyaixkcl9izjrqmr2q-openssl-3.5.8-dev/include -I/nix/store/igm0j0xhbj57bn2sm4w07jnhz8fb22pc-aws-c-mqtt-0.13.3/include -I/nix/store/lpglqdmacwwq3csbqknbl8d427rky1ba-aws-c-common-0.12.4/include -I/nix/store/r3rc5z2wvz9igh9gpf4323y3ds0xq3l9-aws-c-s3-0.8.7/include -I/nix/store/yk25gm6nvm11mjkika1b00m41mh247di-aws-c-io-0.27.2/include -I/nix/store/yryxvlaj6vw4sdk3ryl4wspnaqhm6vxd-aws-checksums-0.2.7/include -flto=auto -fdiagnostics-color=always -D_FILE_OFFSET_BITS=64 -Wall -Winvalid-pch -std=c++23 -O3 -Wdeprecated-copy -Werror=suggest-override -Werror=switch -Werror=switch-enum -Werror=undef -Werror=unused-result -Werror=sign-compare -Werror=return-type -Werror=non-virtual-dtor -Wignored-qualifiers -Wimplicit-fallthrough -Wno-deprecated-declarations -Wno-interference-size -Wno-subobject-linkage -D_GLIBCXX_USE_TBB_PAR_BACKEND=0 -fno-semantic-interposition -Wl,-Bsymbolic-functions -fPIC -DAWS_AUTH_USE_IMPORT_EXPORT -DAWS_CAL_USE_IMPORT_EXPORT -DAWS_CHECKSUMS_USE_IMPORT_EXPORT -DAWS_COMMON_USE_IMPORT_EXPORT -DAWS_COMPRESSION_USE_IMPORT_EXPORT -DAWS_CRT_CPP_USE_IMPORT_EXPORT -DAWS_ENABLE_EPOLL -DAWS_EVENT_STREAM_USE_IMPORT_EXPORT -DAWS_HTTP_USE_IMPORT_EXPORT -DAWS_IO_USE_IMPORT_EXPORT -DAWS_MQTT_USE_IMPORT_EXPORT -DAWS_S3_USE_IMPORT_EXPORT -DAWS_SDKUTILS_USE_IMPORT_EXPORT -DBOOST_CONTAINER_DYN_LINK=1 -DBOOST_ALL_NO_LIB -pthread -std=c++23 -MD -MQ libnixstore.so.2.36.0.p/meson-generated_nixstore-unity0.cpp.o -MF libnixstore.so.2.36.0.p/meson-generated_nixstore-unity0.cpp.o.d -o libnixstore.so.2.36.0.p/meson-generated_nixstore-unity0.cpp.o -c libnixstore.so.2.36.0.p/nixstore-unity0.cpp239nix-store-2.36.0pre> libnixstore.so.2.36.0.p/nixstore-unity0.cpp:3:9: fatal error: /build/source/src/libstore/build/build/build-log.cc: No such file or directory240nix-store-2.36.0pre>     3 | #include</build/source/src/libstore/build/build/build-log.cc>241nix-store-2.36.0pre>       |         ^~~~~~~~~~~~~~~~~~~~~~~~~~~~~~~~~~~~~~~~~~~~~~~~~~~~~242nix-store-2.36.0pre> compilation terminated.243nix-store-2.36.0pre> ninja: build stopped: subcommand failed.244error: Cannot build '/nix/store/v2m9s85ybjwqmagl4cjdys6jgy0yy42z-nix-store-2.36.0pre.drv'.245       Reason: builder failed with exit code 1.246       Output paths:247         /nix/store/qm5hxb4f94hppsp7sdjr0vncszzm8d8c-nix-store-2.36.0pre-debug248         /nix/store/rzrwfv0mg39v19wnxpjg44icc4fva3a0-nix-store-2.36.0pre249         /nix/store/vnj3zmcz9lsaf8x7y6vg9fmm7dvqmj9c-nix-store-2.36.0pre-dev250       Last 25 log lines:251       >     libdir                 : /nix/store/rzrwfv0mg39v19wnxpjg44icc4fva3a0-nix-store-2.36.0pre/lib252       >     libexecdir             : /nix/store/rzrwfv0mg39v19wnxpjg44icc4fva3a0-nix-store-2.36.0pre/libexec253       >     localedir              : /nix/store/rzrwfv0mg39v19wnxpjg44icc4fva3a0-nix-store-2.36.0pre/share/locale254       >     mandir                 : /nix/store/rzrwfv0mg39v19wnxpjg44icc4fva3a0-nix-store-2.36.0pre/share/man255       >     prefix                 : /nix/store/rzrwfv0mg39v19wnxpjg44icc4fva3a0-nix-store-2.36.0pre256       >     s3-aws-auth            : enabled257       >     sandbox-shell          : /nix/store/r6zw8gd10c7qv9sifzg4r7h1s5qmrxjp-busybox-1.37.0/bin/busybox258       >     sbindir                : /nix/store/rzrwfv0mg39v19wnxpjg44icc4fva3a0-nix-store-2.36.0pre/sbin259       >     seccomp-sandboxing     : enabled260       >     unity                  : on261       >     unity_size             : 8192262       >     wrap_mode              : nodownload263       >264       > Found ninja-1.13.2 at /nix/store/4nsdla28c4177ssp0hlyv5l2yzj8wcba-ninja-1.13.2/bin/ninja265       > Running postconf script '/nix/store/lb41b0anx1f98y9y5s9mdv97gjgsq740-python3-3.14.7/bin/python3.14 /build/source/src/libstore/nix-meson-build-support/common/clang-tidy/clean_compdb.py /build/source/src/libstore/build/compile_commands.json /build/source/src/libstore/build/nix-meson-build-support/common/clang-tidy/compile_commands.json'266       > Running phase: buildPhase267       > build flags: -j24268       > [1/2] Compiling C++ object libnixstore.so.2.36.0.p/meson-generated_nixstore-unity0.cpp.o269       > FAILED: [code=1] libnixstore.so.2.36.0.p/meson-generated_nixstore-unity0.cpp.o270       > g++ -Ilibnixstore.so.2.36.0.p -I. -I.. -Iinclude -I../include -I../linux/build -Ilinux/include -I../linux/include -I../unix/build -Iunix/include -I../unix/include -I/nix/store/la1rzzb3q1wjdz50dyvh62fix41ayifa-nix-util-2.36.0pre-dev/include -I/nix/store/2ybid2fqf6nfqrwcgizv9qvvckyp6axh-libarchive-3.8.9-dev/include -I/nix/store/0dz9bi5rv50d46w8xykwdxrj4ssy6pnp-nlohmann_json-3.12.0/include -I/nix/store/aph5dkajglxjn9642bp0h3x7cwzijr52-curl-8.22.0-dev/include -I/nix/store/q2yrf8yhmj405nv9qbbraxr8wlz7n5kv-libseccomp-2.6.1-dev/include -I/nix/store/xrcjl59yi7zswbv0vzm8cmvw4vplsbgj-sqlite-3.53.3-dev/include -I/nix/store/2zgasbvd9mzmj145mxsmnzxiy7rnz82b-aws-c-http-0.11.0/include -I/nix/store/3qrc60ba9qwxiyx8wlnfwwvqknpmhbmb-aws-crt-cpp-0.34.3-dev/include -I/nix/store/45ndmvc3vy9rd30mk71bq89gigzdx64p-aws-c-sdkutils-0.2.4/include -I/nix/store/5w514y0s25ym17bsrw43wl33fbxvy91a-aws-c-compression-0.3.1/include -I/nix/store/ai6kkxbkfjgkmpkwamrvhc5d1m3l5v1d-aws-c-cal-0.9.2/include -I/nix/store/bg4d55k9sg2x763215brap5ndhnqil53-aws-c-auth-0.9.1/include -I/nix/store/cf610ccndgvh5nfhbarjbqpvr3zkb3vr-aws-c-event-stream-0.7.0/include -I/nix/store/hc6mxys4iyawmwiyaixkcl9izjrqmr2q-openssl-3.5.8-dev/include -I/nix/store/igm0j0xhbj57bn2sm4w07jnhz8fb22pc-aws-c-mqtt-0.13.3/include -I/nix/store/lpglqdmacwwq3csbqknbl8d427rky1ba-aws-c-common-0.12.4/include -I/nix/store/r3rc5z2wvz9igh9gpf4323y3ds0xq3l9-aws-c-s3-0.8.7/include -I/nix/store/yk25gm6nvm11mjkika1b00m41mh247di-aws-c-io-0.27.2/include -I/nix/store/yryxvlaj6vw4sdk3ryl4wspnaqhm6vxd-aws-checksums-0.2.7/include -flto=auto -fdiagnostics-color=always -D_FILE_OFFSET_BITS=64 -Wall -Winvalid-pch -std=c++23 -O3 -Wdeprecated-copy -Werror=suggest-override -Werror=switch -Werror=switch-enum -Werror=undef -Werror=unused-result -Werror=sign-compare -Werror=return-type -Werror=non-virtual-dtor -Wignored-qualifiers -Wimplicit-fallthrough -Wno-deprecated-declarations -Wno-interference-size -Wno-subobject-linkage -D_GLIBCXX_USE_TBB_PAR_BACKEND=0 -fno-semantic-interposition -Wl,-Bsymbolic-functions -fPIC -DAWS_AUTH_USE_IMPORT_EXPORT -DAWS_CAL_USE_IMPORT_EXPORT -DAWS_CHECKSUMS_USE_IMPORT_EXPORT -DAWS_COMMON_USE_IMPORT_EXPORT -DAWS_COMPRESSION_USE_IMPORT_EXPORT -DAWS_CRT_CPP_USE_IMPORT_EXPORT -DAWS_ENABLE_EPOLL -DAWS_EVENT_STREAM_USE_IMPORT_EXPORT -DAWS_HTTP_USE_IMPORT_EXPORT -DAWS_IO_USE_IMPORT_EXPORT -DAWS_MQTT_USE_IMPORT_EXPORT -DAWS_S3_USE_IMPORT_EXPORT -DAWS_SDKUTILS_USE_IMPORT_EXPORT -DBOOST_CONTAINER_DYN_LINK=1 -DBOOST_ALL_NO_LIB -pthread -std=c++23 -MD -MQ libnixstore.so.2.36.0.p/meson-generated_nixstore-unity0.cpp.o -MF libnixstore.so.2.36.0.p/meson-generated_nixstore-unity0.cpp.o.d -o libnixstore.so.2.36.0.p/meson-generated_nixstore-unity0.cpp.o -c libnixstore.so.2.36.0.p/nixstore-unity0.cpp271       > libnixstore.so.2.36.0.p/nixstore-unity0.cpp:3:9: fatal error: /build/source/src/libstore/build/build/build-log.cc: No such file or directory272       >     3 | #include</build/source/src/libstore/build/build/build-log.cc>273       >       |         ^~~~~~~~~~~~~~~~~~~~~~~~~~~~~~~~~~~~~~~~~~~~~~~~~~~~~274       > compilation terminated.275       > ninja: build stopped: subcommand failed.276       For full logs, run:277         nix log /nix/store/v2m9s85ybjwqmagl4cjdys6jgy0yy42z-nix-store-2.36.0pre.drv278error: Cannot build '/nix/store/2nadarzfx4204sjkl2xwjdf3z19n63y2-nix-fetchers-2.36.0pre.drv'.279       Reason: 1 dependency failed.280       Output paths:281         /nix/store/hd38i5wb7wbvf6rwzwdrz2n3nfx72j8a-nix-fetchers-2.36.0pre-dev282         /nix/store/hj79dpl45d9az4blqiarc1r7r6hlnj51-nix-fetchers-2.36.0pre-debug283         /nix/store/l4hfd896ya6k5bmnld6rpb8pq2p3ykcb-nix-fetchers-2.36.0pre284error: Cannot build '/nix/store/sxnasgvjr7a8hvg3n8w9l961pciy1g13-nix-store-c-2.36.0pre.drv'.285       Reason: 1 dependency failed.286       Output paths:287         /nix/store/2mc4yxy9w19kv55v9pp1i39wisvd2rqr-nix-store-c-2.36.0pre-dev288         /nix/store/7ryvsv18nml3ldzzxzgg8iv1z347j6pl-nix-store-c-2.36.0pre-debug289         /nix/store/spxyzyqffcww3wcig12knbjv22km17gm-nix-store-c-2.36.0pre290error: Cannot build '/nix/store/a5npk3j5sjqhwnkq163h9ijccxcdwk48-nix-expr-2.36.0pre.drv'.291       Reason: 2 dependencies failed.292       Output paths:293         /nix/store/1k55xpzifxkfwwskak6d8x811g3gfl4n-nix-expr-2.36.0pre-dev294         /nix/store/3km4yxp7q7sd70jv8xcc25g0l3nribdw-nix-expr-2.36.0pre295         /nix/store/p3b2rhn4kk71bih0y9pscfv8y4m3d3z3-nix-expr-2.36.0pre-debug296error: Cannot build '/nix/store/9kzwqrbpa8566m45rw2lbc6qn4ckabda-nix-store-test-support-2.36.0pre.drv'.297       Reason: 2 dependencies failed.298       Output paths:299         /nix/store/5rrgib4daz3bdigsbb72qnh4aq0v2shg-nix-store-test-support-2.36.0pre300         /nix/store/c1k4nz6jaymdx8k6zm6bd37fxvrjkwhz-nix-store-test-support-2.36.0pre-dev301         /nix/store/lrv6cjicl1h56jm9s3d5zdz5j1xdifzi-nix-store-test-support-2.36.0pre-debug302error: Cannot build '/nix/store/yn2pynw1kjn8rgj34rg76npbywgxf8v1-nix-tarmac-0.1.0.drv'.303       Reason: 2 dependencies failed.304       Output paths:305         /nix/store/zmabykzyc4ww2dgk7xq7m715zb3674sd-nix-tarmac-0.1.0306error: Cannot build '/nix/store/vp65rb9lbq5c6pwf1mkabyz09nwgigbr-nix-expr-c-2.36.0pre.drv'.307       Reason: 2 dependencies failed.308       Output paths:309         /nix/store/acnlxxb1vy21fsmxb6zlwyvydl02qp97-nix-expr-c-2.36.0pre-dev310         /nix/store/b4m37rw88x67ia4q2lnjj6dhrh3w450k-nix-expr-c-2.36.0pre311         /nix/store/d3f0wvk6zkxfk6nv9285hspnmal5rliq-nix-expr-c-2.36.0pre-debug312error: Cannot build '/nix/store/lp7vgrj5rx8vkc522ghffw5v51zn8gg1-nix-flake-2.36.0pre.drv'.313       Reason: 3 dependencies failed.314       Output paths:315         /nix/store/5cjrqiy0sfxc4dbjkciwn9bpx5qzywym-nix-flake-2.36.0pre-dev316         /nix/store/jcsx9adlxxlypj54s7zkfcd0n7kf4bhh-nix-flake-2.36.0pre317         /nix/store/yl9s5ans2q73ydlvad5q7hwxd68684n4-nix-flake-2.36.0pre-debug318error: Cannot build '/nix/store/mmdd6pjxl5pcq39dvnjyza8an45jj38a-nix-main-2.36.0pre.drv'.319       Reason: 2 dependencies failed.320       Output paths:321         /nix/store/5p9xr84f1ll9yzg29piyi98lxvg6lf8x-nix-main-2.36.0pre-debug322         /nix/store/6n1667bxxnmm54lchalbcwwhmmxw08hs-nix-main-2.36.0pre323         /nix/store/8qbjg61xm2f79ff7w61mkp1dfjkz6ij0-nix-main-2.36.0pre-dev324error: Cannot build '/nix/store/9709y4fpmlmignzwbfrbiaf82fxj9b1f-nix-store-tests-2.36.0pre.drv'.325       Reason: 3 dependencies failed.326       Output paths:327         /nix/store/1x97b9s2cc3f2nxvw0gdjlxjmkavxz5n-nix-store-tests-2.36.0pre328         /nix/store/sy3p4qb0fn4m3wykhl0lf56qplrxlwby-nix-store-tests-2.36.0pre-debug329error: Cannot build '/nix/store/73m5kf01zlgk3jhw7vxf3f9vp2snbbsl-nix-tarmac-dispatcher.drv'.330       Reason: 1 dependency failed.331       Output paths:332         /nix/store/5xn646a4l1zphdbrv6g95ah1lnxdibfg-nix-tarmac-dispatcher333error: Cannot build '/nix/store/kyvnhy1bsksljwyfx8y9qfd1a7qgd84c-nix-cmd-2.36.0pre.drv'.334       Reason: 5 dependencies failed.335       Output paths:336         /nix/store/d5617a1kkb07anfr38gfzw25ihlmn2d7-nix-cmd-2.36.0pre-dev337         /nix/store/jrxs6h7lxzr12p8hf1q899cy4qhahgy7-nix-cmd-2.36.0pre338         /nix/store/vfklia2gdl2cr0k1jzsqwi2b05lnia3s-nix-cmd-2.36.0pre-debug339error: Cannot build '/nix/store/ikxwb4anvib05pz97a7irdd3zdcqfkbd-nix-fetchers-c-2.36.0pre.drv'.340       Reason: 3 dependencies failed.341       Output paths:342         /nix/store/g6pbpaxlri10ibvw7292jrizx9j853ra-nix-fetchers-c-2.36.0pre-dev343         /nix/store/n3s54qm08qvhl93smjdbqn2aqfd1is7k-nix-fetchers-c-2.36.0pre344         /nix/store/p92xgwzsgvfbz9ybsrfrwxqf6rygph6y-nix-fetchers-c-2.36.0pre-debug345error: Cannot build '/nix/store/rxnmvhf70i800adkpqff584ami6ng8dp-nix-main-c-2.36.0pre.drv'.346       Reason: 3 dependencies failed.347       Output paths:348         /nix/store/45mbgw9nxpk29vdx1md6vxnc0w4yj1pg-nix-main-c-2.36.0pre-debug349         /nix/store/gf8fnbn1k06lakh0agk3fyn0r388xqck-nix-main-c-2.36.0pre-dev350         /nix/store/xb81f8xs8wfxm8q8c50cbzda3s573wpa-nix-main-c-2.36.0pre351error: Cannot build '/nix/store/kgj36snczcgjlry62di6h0zyh7sw8226-nix-store-tests-run.drv'.352       Reason: 1 dependency failed.353       Output paths:354         /nix/store/llm5rmn1cx63xql6lq6f8wiijp5v4k4n-nix-store-tests-run355error: Cannot build '/nix/store/9cjrmbhhg6ymlppx70yn5158wy8hrm8z-nix-util-test-support-2.36.0pre.drv'.356       Reason: 3 dependencies failed.357       Output paths:358         /nix/store/a573yylngcig1k3q18brclqfbnps5bvn-nix-util-test-support-2.36.0pre-dev359         /nix/store/g9fjxh647c0h5nrbag7xxiqvr7r3n38p-nix-util-test-support-2.36.0pre-debug360         /nix/store/yginsv9651dd52qjpg89wyf1n8j9kssq-nix-util-test-support-2.36.0pre361error: Cannot build '/nix/store/ws9l2l2phzjvnfl4ck3iyki9rci8909k-nix-expr-tests-2.36.0pre.drv'.362       Reason: 3 dependencies failed.363       Output paths:364         /nix/store/ljv5nl80r2r1caiy5cs9dinsfj08f321-nix-expr-tests-2.36.0pre-debug365         /nix/store/v2mkg7mzfigd8dpfj0dqhs51yqd5y0a0-nix-expr-tests-2.36.0pre366error: Cannot build '/nix/store/dqi93g30b3xag1fqrdlnljjy1iy2mxgv-nix-fetchers-tests-2.36.0pre.drv'.367       Reason: 3 dependencies failed.368       Output paths:369         /nix/store/c1k3pc3kjvdg5vwyr3psl63jgbndkf5r-nix-fetchers-tests-2.36.0pre370         /nix/store/lqbjly8j5szfkag8i1s2b4ab62khkrxd-nix-fetchers-tests-2.36.0pre-debug371error: Cannot build '/nix/store/78vrmb9y2cmwk57b3dj19688frsm44n2-nix-flake-c-2.36.0pre.drv'.372       Reason: 4 dependencies failed.373       Output paths:374         /nix/store/0qlcsdydk7a0agi4qb3nrmcv77fgbilw-nix-flake-c-2.36.0pre-debug375         /nix/store/7gg0swjhz03qf7mnah7xxg1gq193jkls-nix-flake-c-2.36.0pre-dev376         /nix/store/p6j3yvl124zmsr3jfh1w0aj6izcml8z7-nix-flake-c-2.36.0pre377error: Cannot build '/nix/store/ckgk8lxiwdy04pg1l6jh1vkxnk095r61-nix-2.36.0pre20260918_09e24b6.drv'.378       Reason: 9 dependencies failed.379       Output paths:380         /nix/store/7fdq8x6bqnnzl8386245wa8hc9bcpqid-nix-2.36.0pre20260918_09e24b6381         /nix/store/wymhar3bnbxrv281ah8v3pn4xyxfx7sa-nix-2.36.0pre20260918_09e24b6-debug382error: Cannot build '/nix/store/5dj8slb0dzaa2anmd71r51cf585bv9jq-nix-expr-tests-run.drv'.383       Reason: 1 dependency failed.384       Output paths:385         /nix/store/5gvqjv862v0n9p7f97swblzv1x4x697z-nix-expr-tests-run386error: Cannot build '/nix/store/w5sbnbc4yayksrk7pjjhjhcrq6wzzvbc-nix-fetchers-tests-run.drv'.387       Reason: 1 dependency failed.388       Output paths:389         /nix/store/wjnx5mxfpydgj8xil5zxyq6kl84r2djn-nix-fetchers-tests-run390error: Cannot build '/nix/store/dzsdf6nk4j6wz2my53l01pvv955w5fvn-nix-flake-tests-2.36.0pre.drv'.391       Reason: 3 dependencies failed.392       Output paths:393         /nix/store/gz53gx716l37k8ryraxk9npaxcia71nl-nix-flake-tests-2.36.0pre-debug394         /nix/store/p33j3hc6ij2qq61vsbp0y059m06nz05j-nix-flake-tests-2.36.0pre395error: Cannot build '/nix/store/21qcasyk6cfp1f1cg8a5yp6cgfr215ng-nix-flake-tests-run.drv'.396       Reason: 1 dependency failed.397       Output paths:398         /nix/store/5j1w5ryvpwakcz65i3slg0dnsn4ka5k1-nix-flake-tests-run399error: Cannot build '/nix/store/r71nhkmrrrmrbs8hzrcp323qawbd8w7x-nix-functional-tests-2.36.0pre20260918_09e24b6.drv'.400       Reason: 3 dependencies failed.401       Output paths:402         /nix/store/bz7zx51h7xjmf7sszfprc7zg6qy5v1rw-nix-functional-tests-2.36.0pre20260918_09e24b6403error: Cannot build '/nix/store/sxgcj2cz28l4njbgvd2jvp9ypc3dhcwq-nix-manual-2.36.0pre20260918_09e24b6.drv'.404       Reason: 1 dependency failed.405       Output paths:406         /nix/store/8rmg5229m28874aamisin7ir8qfkppg8-nix-manual-2.36.0pre20260918_09e24b6-man407         /nix/store/jhh6cl4r79rkqg4lc9m0fifbfmmnq8f7-nix-manual-2.36.0pre20260918_09e24b6408error: Cannot build '/nix/store/sxgcj2cz28l4njbgvd2jvp9ypc3dhcwq-nix-manual-2.36.0pre20260918_09e24b6.drv'.409       Reason: 1 dependency failed.410       Output paths:411         /nix/store/8rmg5229m28874aamisin7ir8qfkppg8-nix-manual-2.36.0pre20260918_09e24b6-man412         /nix/store/jhh6cl4r79rkqg4lc9m0fifbfmmnq8f7-nix-manual-2.36.0pre20260918_09e24b6413error: Cannot build '/nix/store/m3p49al1vh52z8njjsp5fkm34qnq9dx3-nix-2.36.0pre20260918_09e24b6.drv'.414       Reason: 19 dependencies failed.415       Output paths:416         /nix/store/galf079i6yqb0v0s1dr21kbjczqml28a-nix-2.36.0pre20260918_09e24b6-dev417         /nix/store/q2rb5l2ak3sv6b2gz54fw9b42ramaia9-nix-2.36.0pre20260918_09e24b6418         /nix/store/wyy2bq6c3rrvx6agdn3lgmzrrl958rxp-nix-2.36.0pre20260918_09e24b6-man419         /nix/store/yaif46chghmn7frwy8kp12ic4qqrlk1f-nix-2.36.0pre20260918_09e24b6-doc420error: Cannot build '/nix/store/zmrbrqzsa7rahyd1l5szmqlpg4j6fd3a-nix.conf.drv'.421       Reason: 2 dependencies failed.422       Output paths:423         /nix/store/p07vgqqa5sl4nm4rcpnk8h0728dqm4pj-nix.conf424error: Cannot build '/nix/store/1hl5v882hlf9c6b0fy74kjr50hv7v105-nixos-option-26.11.drv'.425       Reason: 1 dependency failed.426       Output paths:427         /nix/store/rqh7cjyhf88rj5viv3gww02rhrwcqdda-nixos-option-26.11428error: Cannot build '/nix/store/5iv5crlkwdcnizv7j08pzb8xflml9kdn-nixos-rebuild-ng-26.11.drv'.429       Reason: 1 dependency failed.430       Output paths:431         /nix/store/bqw7ki7ik1nqhsk8118xljjhwl5c6j1c-nixos-rebuild-ng-26.11432         /nix/store/nq90kgwcrknycjzkmdpvsbb9dilqynpb-nixos-rebuild-ng-26.11-dist433error: Cannot build '/nix/store/hzbjhz95nfqlivic49m6w4qjg5cz310k-system-generators.drv'.434       Reason: 1 dependency failed.435       Output paths:436         /nix/store/03sii54a8q0jiz3rah5i75lvlf0cyxaj-system-generators437error: Cannot build '/nix/store/zlm3m91nqnlh0l9v9a1563rw6vn6iknk-system-shutdown.drv'.438       Reason: 1 dependency failed.439       Output paths:440         /nix/store/jwqj8mizkjgyz7mbf0xipb040bp2fdgg-system-shutdown441error: Cannot build '/nix/store/9gxbpp3kl6f4cil9zch9mqgmps02n8dj-systemd-boot.drv'.442       Reason: 1 dependency failed.443       Output paths:444         /nix/store/326y93f8d5b59cnakrk21a1hrk8hdcps-systemd-boot445error: Cannot build '/nix/store/6ph3qx4yk2kk6c47mw54rrhimiwh0d18-tmpfiles.d.drv'.446       Reason: 1 dependency failed.447       Output paths:448         /nix/store/y9cv5djyw8p9qxlvhbxgr1q5r1phhbp7-tmpfiles.d449error: Cannot build '/nix/store/dnzqz0mw9sj6l2kaarmid6qdbab721ny-unit-harmonia-gc.service.drv'.450       Reason: 1 dependency failed.451       Output paths:452         /nix/store/0v9fh5ysndr0887c78dq887z7si0p2w0-unit-harmonia-gc.service453error: Cannot build '/nix/store/lvzmcqzhi0ywbdmkjjw17xz6m39ymils-unit-nix-optimise.service.drv'.454       Reason: 1 dependency failed.455       Output paths:456         /nix/store/szdlyb1193ak6glaxi0blj3pazaqmlr4-unit-nix-optimise.service457error: Cannot build '/nix/store/wp812r8idmqf5q1fgmz39riqh71xy2w0-unit-script-nix-gc-start.drv'.458       Reason: 1 dependency failed.459       Output paths:460         /nix/store/1xqy3x84izf1pqzprmr67xkd1kga2hm8-unit-script-nix-gc-start461error: Cannot build '/nix/store/mkw3bj7a1bn1kw9zkm1qi3fqjzhk1kky-unit-script-update-prefetch-start.drv'.462       Reason: 1 dependency failed.463       Output paths:464         /nix/store/f2l11wfbz3g727b2jyrq6kbl70smr933-unit-script-update-prefetch-start465error: Cannot build '/nix/store/whxvxhi0wvvfjl70gi141nm5ixalglrw-user-generators.drv'.466       Reason: 1 dependency failed.467       Output paths:468         /nix/store/wimn988hsap58n1g580g11xv8gwkvh6b-user-generators469error: Cannot build '/nix/store/c3inw53lcrs5bxcmpd1gfpzvq798cnvf-X-Restart-Triggers-nix-daemon.drv'.470       Reason: 1 dependency failed.471       Output paths:472         /nix/store/k4y3zs15v77l7l9nm2x8wwvggv8p2kzv-X-Restart-Triggers-nix-daemon473error: Cannot build '/nix/store/xcj23cifkfyzpp8qnhq3wds2xcgs9aq2-X-Restart-Triggers-systemd-tmpfiles-resetup.drv'.474       Reason: 1 dependency failed.475       Output paths:476         /nix/store/jvs88276y6mnkkk160mic32zf5pp5ml0-X-Restart-Triggers-systemd-tmpfiles-resetup477error: Cannot build '/nix/store/866kb8xsbf5wbbn8jia4k2jwgmxyav91-install-systemd-boot.sh.drv'.478       Reason: 1 dependency failed.479       Output paths:480         /nix/store/c2j42mrq690jwjj7vsdcapnn84mqfnvk-install-systemd-boot.sh481error: Cannot build '/nix/store/jh4cj3gwvqkgcmycciky1n6y5g48yjzl-unit-nix-gc.service.drv'.482       Reason: 1 dependency failed.483       Output paths:484         /nix/store/kqhbagfkf020i84a3wr9nx9kg7qznhrh-unit-nix-gc.service485error: Cannot build '/nix/store/zy3iz584jwii0fnx46jdf1s23237cdl8-unit-update-prefetch.service.drv'.486       Reason: 1 dependency failed.487       Output paths:488         /nix/store/6ka9xr33dxvnrbd9sf85wmhxxk137cja-unit-update-prefetch.service489error: Cannot build '/nix/store/iygz9dh1sp1apk7f2ykmmnnbrlmvawpr-unit-nix-daemon.service.drv'.490       Reason: 2 dependencies failed.491       Output paths:492         /nix/store/w84ixypqjxicjxd02i50g2msifkaardr-unit-nix-daemon.service493error: Cannot build '/nix/store/q9crnn0xw5968gwx2i817npyaccrcn5q-unit-systemd-tmpfiles-resetup.service.drv'.494       Reason: 1 dependency failed.495       Output paths:496         /nix/store/d2xh26z4ak4vd3g1pc7ak52gq0747rm7-unit-systemd-tmpfiles-resetup.service497nginx.conf> structuredAttrs is enabled