nixbot

builds

cancelled checks.x86_64-linux.nixos-turingmachine build #808 · raw · eval 18.5 s · 1.1 GiB allocated · ·

1these 128 derivations will be built:2  /nix/store/199ss93ic949rrs91ml1f82mym5wxbyf-cups-progs.drv3  /nix/store/sh54d20i04262kwph2fx0lv4jb4cm9b2-desktops.drv4  /nix/store/kwn8qgd39bxssy2xxw5sv78s8cj1ykxs-set-environment.drv5  /nix/store/0zvnrmwbllj1zdy3bhgsslsr55l1cq15-etc-zshenv.drv6  /nix/store/82sdiriqkcgg48psjx41cpjs154va0az-extra-udev-rules.drv7  /nix/store/3g864g1dk4cc3d4lf7y5ikybgpqmwy2l-udev-rules.drv8  /nix/store/11lwv38q9v9q2m08nrxf6iljkrn8mhg1-X-Restart-Triggers-systemd-udevd.drv9  /nix/store/gzzdzrs46yf6mg7l6hmx6wwklphm2q6h-steam-run-1.0.0.87-fhsenv-rootfs.drv10  /nix/store/1bcz33d0cxw2prvp849niiav8qsqlirb-steam-run-1.0.0.87-bwrap.drv11  /nix/store/v2m9s85ybjwqmagl4cjdys6jgy0yy42z-nix-store-2.36.0pre.drv12  /nix/store/2nadarzfx4204sjkl2xwjdf3z19n63y2-nix-fetchers-2.36.0pre.drv13  /nix/store/sxnasgvjr7a8hvg3n8w9l961pciy1g13-nix-store-c-2.36.0pre.drv14  /nix/store/a5npk3j5sjqhwnkq163h9ijccxcdwk48-nix-expr-2.36.0pre.drv15  /nix/store/vp65rb9lbq5c6pwf1mkabyz09nwgigbr-nix-expr-c-2.36.0pre.drv16  /nix/store/ikxwb4anvib05pz97a7irdd3zdcqfkbd-nix-fetchers-c-2.36.0pre.drv17  /nix/store/lp7vgrj5rx8vkc522ghffw5v51zn8gg1-nix-flake-2.36.0pre.drv18  /nix/store/78vrmb9y2cmwk57b3dj19688frsm44n2-nix-flake-c-2.36.0pre.drv19  /nix/store/9kzwqrbpa8566m45rw2lbc6qn4ckabda-nix-store-test-support-2.36.0pre.drv20  /nix/store/9cjrmbhhg6ymlppx70yn5158wy8hrm8z-nix-util-test-support-2.36.0pre.drv21  /nix/store/dzsdf6nk4j6wz2my53l01pvv955w5fvn-nix-flake-tests-2.36.0pre.drv22  /nix/store/21qcasyk6cfp1f1cg8a5yp6cgfr215ng-nix-flake-tests-run.drv23  /nix/store/ws9l2l2phzjvnfl4ck3iyki9rci8909k-nix-expr-tests-2.36.0pre.drv24  /nix/store/5dj8slb0dzaa2anmd71r51cf585bv9jq-nix-expr-tests-run.drv25  /nix/store/mmdd6pjxl5pcq39dvnjyza8an45jj38a-nix-main-2.36.0pre.drv26  /nix/store/kyvnhy1bsksljwyfx8y9qfd1a7qgd84c-nix-cmd-2.36.0pre.drv27  /nix/store/rxnmvhf70i800adkpqff584ami6ng8dp-nix-main-c-2.36.0pre.drv28  /nix/store/ckgk8lxiwdy04pg1l6jh1vkxnk095r61-nix-2.36.0pre20260918_09e24b6.drv29  /nix/store/9709y4fpmlmignzwbfrbiaf82fxj9b1f-nix-store-tests-2.36.0pre.drv30  /nix/store/kgj36snczcgjlry62di6h0zyh7sw8226-nix-store-tests-run.drv31  /nix/store/r71nhkmrrrmrbs8hzrcp323qawbd8w7x-nix-functional-tests-2.36.0pre20260918_09e24b6.drv32  /nix/store/sxgcj2cz28l4njbgvd2jvp9ypc3dhcwq-nix-manual-2.36.0pre20260918_09e24b6.drv33  /nix/store/dqi93g30b3xag1fqrdlnljjy1iy2mxgv-nix-fetchers-tests-2.36.0pre.drv34  /nix/store/w5sbnbc4yayksrk7pjjhjhcrq6wzzvbc-nix-fetchers-tests-run.drv35  /nix/store/m3p49al1vh52z8njjsp5fkm34qnq9dx3-nix-2.36.0pre20260918_09e24b6.drv36  /nix/store/1hl5v882hlf9c6b0fy74kjr50hv7v105-nixos-option-26.11.drv37  /nix/store/2fik5v95zrbllnfxpxam429wnp4a35i3-unit-systemd-udevd.service.drv38  /nix/store/64782arb4jh8a16x4fsqwdgjpn38djqc-graphics-drivers-32bit.drv39  /nix/store/msm7a4rzj5bp5p1q8415gb8zjgk7ifi0-graphics-driver.conf.drv40  /nix/store/drvxgz04clmh20zsiha6nalzcz3mhjgm-tmpfiles.d.drv41  /nix/store/7mq0iv43262j2ya65bvglmr7i2d184h9-X-Restart-Triggers-systemd-tmpfiles-resetup.drv42  /nix/store/37db4p1c8jzcg4imdhsr332v7bys68pf-unit-systemd-tmpfiles-resetup.service.drv43  /nix/store/f0avsx6fmz6njqk1lkh8rvmn9qmz0z00-unit-script-update-prefetch-start.drv44  /nix/store/3gnkqq36mjfvwf3rg440xjclnns3kkns-unit-update-prefetch.service.drv45  /nix/store/gcva5a7y6wvgsy4ww602yynya7az4xsd-torrc.drv46  /nix/store/ik24kg54p8izf49g7p7lhqa06ik7ik0r-X-Restart-Triggers-tor.drv47  /nix/store/45zih7qgkqn3nqnhm6rkiq5kg78acnkd-unit-tor.service.drv48  /nix/store/pg8rl8z6ihl6sf19lxgh9mm6v9zqlllz-hosts.drv49  /nix/store/m4pazyz8vcgl89wzj4gvqzaph82b7k0h-nftables-rules.drv50  /nix/store/4l7sii5zl2ckr75pxxwgwlms67fyhb8w-unit-nftables.service.drv51  /nix/store/8bf493v80l25yf2dvhfv77125dv6h84i-vendor-registry.drv52  /nix/store/vsd57k6nv0phs7d9jjpd8i916zlmr2cs-vendor-cargo-deps.drv53  /nix/store/3myy80cr2ysz6x2s6fsnz4q3dwqdk098-tincd-deps-0.1.0.drv54  /nix/store/dfgvgnbfa7836ilrs8qsxrwgrvncawad-tincd-0.1.0.drv55  /nix/store/57c65na0abnrmvsagnxgw8c9h28yfvg3-unit-tincr-retiolum.service.drv56  /nix/store/5azccf64bnn8sksb0dskswihn82k53m7-unit-caddy.service.drv57  /nix/store/65ny5z2ripqdzp1ya73fiw64zjqx1b2s-unit-docker-prune.service.drv58  /nix/store/6v9pnl5hbgwnpkj7f4p39li04pv59d9n-unit-telegraf.service.drv59  /nix/store/9qc36z13l6mhscry5ajq4wx6dnihybws-fluent-bit-journal-filter-static-wasm32-unknown-wasip1-0.1.0.drv60  /nix/store/sy6rc54shmjif98h5ycyxgx6jvladmd2-fluent-bit.yaml.drv61  /nix/store/948w5kaa57m04si615n2pwa3pfriykrr-unit-fluent-bit.service.drv62  /nix/store/3dl4zp1g57j4rq366p3f61jidnqyil70-noctalia-shell-4.7.7.drv63  /nix/store/5iv5crlkwdcnizv7j08pzb8xflml9kdn-nixos-rebuild-ng-26.11.drv64  /nix/store/4k1gkxvkzr7isdfkp8krl6kvhwvcxwxg-steam-1.0.0.87-fhsenv-rootfs.drv65  /nix/store/w85mc2h37wqj7p2my9m53vyw3w12knar-steam-1.0.0.87-bwrap.drv66  /nix/store/6mn37r76f944bmxiyl1g5z9rgglydz7i-steam-1.0.0.87.drv67  /nix/store/ghcx6d5zlzrc7qs1lgav81yqk64lhzf6-openvpn-tum.drv68  /nix/store/khv6n3hm9fyqmakrn055xxcw588qvca3-steam-run-1.0.0.87.drv69  /nix/store/v4s1jxmwvkqxz7ikhrmjqxfianv7dkmd-live-text-0.1.0.drv70  /nix/store/xmlbka8776y5i8030m464b03j99d6ak0-perf-linux-7.2.9.drv71  /nix/store/wsll57r054f39wgsxdpnckln2rhzn5xw-system-path.drv72  /nix/store/5v2gk2dcvdd07zmkzya8vcdmypcbcwn2-X-Restart-Triggers-polkit.drv73  /nix/store/a25y02r7463am5y1a5w8nxmg6z133rq4-unit-polkit.service.drv74  /nix/store/82cak8vvv66lvp3njy1yiw22hmr51h4v-dbus-1.drv75  /nix/store/1qkab7vxygn8jgvyn44f378cvqamp108-X-Restart-Triggers-dbus-broker.drv76  /nix/store/amg6zdp7z8i651r47zh38frd5s0501qa-unit-dbus-broker.service.drv77  /nix/store/dnzqz0mw9sj6l2kaarmid6qdbab721ny-unit-harmonia-gc.service.drv78  /nix/store/jcgd895fzd5fdmrzza4azh02j25nkq9w-userborn.json.drv79  /nix/store/25n3k1m1nw320himbjzq2mapxh2z0k7g-X-Restart-Triggers-userborn.drv80  /nix/store/hcs0wkz475glissi3i5vyr599jwgxbsm-unit-userborn.service.drv81  /nix/store/wp812r8idmqf5q1fgmz39riqh71xy2w0-unit-script-nix-gc-start.drv82  /nix/store/jh4cj3gwvqkgcmycciky1n6y5g48yjzl-unit-nix-gc.service.drv83  /nix/store/lvzmcqzhi0ywbdmkjjw17xz6m39ymils-unit-nix-optimise.service.drv84  /nix/store/jfxbnpn3dvr3difhd4zmijy7n7n8lvfb-security-wrapper-dumpcap-x86_64-unknown-linux-musl.drv85  /nix/store/iw40b3gfdvqxdvhp5s5fdy7k9shg0r2w-unit-script-suid-sgid-wrappers-start.drv86  /nix/store/m3q1c6fblpbv5517dcdxvj4hg84g0438-unit-suid-sgid-wrappers.service.drv87  /nix/store/mcqm0il24v51wmp9759kaf31049924w4-unit-generate-shutdown-ramfs.service.drv88  /nix/store/n7rdq57sg82m5pvbw83dprj7k5ajyi00-unit-docker.service.drv89  /nix/store/s14msyv6q6wmy85yx7liv7z83r51z72b-cups-files.conf.drv90  /nix/store/z8hhaafk7wvw0s1c9x7h48nbrcygks3v-cups-progs.drv91  /nix/store/291gnrxgs7k1mhzmx3jsxdsc2sgp9dc0-unit-script-cups-pre-start.drv92  /nix/store/nlnll3k8r5azimbhd899z2qpwayzfz30-unit-cups.service.drv93  /nix/store/n9779rxkzmf850x55cjwc7yghd2kzx5k-greetd.toml.drv94  /nix/store/vdhnzp539p5dylhw2l5mq7fy0hi8v3rk-unit-greetd.service.drv95  /nix/store/x4f05kddgbncp12gigwpk2mj38l864c2-nix-tarmac-0.1.0.drv96  /nix/store/yn2pynw1kjn8rgj34rg76npbywgxf8v1-nix-tarmac-0.1.0.drv97  /nix/store/73m5kf01zlgk3jhw7vxf3f9vp2snbbsl-nix-tarmac-dispatcher.drv98  /nix/store/lr8pa9r5vrzn89nmfh0ii37jrh8xyw4x-nix-grpc-store-0.2.0.drv99  /nix/store/lqmxgizl9hnv8ymi72bm062wj6kgzdrd-nix-grpc-store-dispatcher.drv100  /nix/store/gb1v79bxrihsh39bxnmb8vf1nw4rznhf-nix.conf.drv101  /nix/store/cjavarxg55f6rv8h8jnf7f04j0zfnmsi-X-Restart-Triggers-nix-daemon.drv102  /nix/store/zk546zwqyv88frqg61sz8hgy176q3gr7-unit-nix-daemon.service.drv103  /nix/store/1lsf5kahc6d6apb68ciy1kfcczc1zplz-system-units.drv104  /nix/store/2cg0yq1q10f1752qj8c730570brv709i-system-generators.drv105  /nix/store/5kr0rg6ivc60kknd85z3nbkd0zdpdq7s-etc-profile.drv106  /nix/store/68l5j2bkcng33x3lclbbichi1f95k3a9-unit-dbus-broker.service.drv107  /nix/store/v25gg9j57kr1xizycbsvjl10w7nm64fq-zfs-kernel-2.4.4-7.2.9.drv108  /nix/store/6gjarkb00y882ggd8qzyfd6ihrq97gal-linux-7.2.9-modules.drv109  /nix/store/8ai2l6xc47lpgzvvj9q6b84d93crxyq6-linux-7.2.9-modules-shrunk.drv110  /nix/store/9521wiqpk1w0r2iz1hz0r9n9q8mrbxd6-initrd-linux-7.2.9.drv111  /nix/store/hjf18yzwa4ln7md4qw34nhhpj528ay03-etc-pam-environment.drv112  /nix/store/j323ildjbyky6j5ni6wj4wfkzyl8dhym-hwdb.bin.drv113  /nix/store/l6q11d8fjyqmh5ly0vb4c0y7lvd3qgr4-user-generators.drv114  /nix/store/a6l7cm92m5cmvdr87iqgn10w564cijc2-unit-noctalia-shell.service.drv115  /nix/store/llr1d5yj1j8iw5n8d601ldk1lw8g3f86-user-units.drv116  /nix/store/qpp1cp1v2597jp89b3pmmpq26iar9cip-etc-zshrc.drv117  /nix/store/xb9wg2kl2xqj0xy1jp4bf60wvjl6n879-system-shutdown.drv118  /nix/store/l0bizs6zp5wfn3010j8p43ysj66qzmmc-etc.drv119  /nix/store/bklh1n65zn4mf5snw8a5s2vjcpcyw5gz-etc-json.drv120  /nix/store/i8fn4dp0h903xrmd62n66xr0pd6gyzj3-etc-dump.drv121  /nix/store/zkixvjqfi10rbaxilhl02kdqxlhic7fp-etc-metadata.erofs.drv122  /nix/store/9x0w4fllkz6sb8r7727kfr211ggp3n36-activate.drv123  /nix/store/m999jqkdlv91gg3hykc708acg4gr2p18-limine-install.json.drv124  /nix/store/ay1kqnl29ksqkkq5d520g6jm7nsk3bsm-limine-install.py.drv125  /nix/store/gcr2nq9y73ckmhqfra6v5gkzd48izyr0-pre-switch-checks.drv126  /nix/store/pzg5vb05h830xl05n41ygj5x76akavd4-ensure-all-wrappers-paths-exist.drv127  /nix/store/vmi55glinyybsxaqfd7x7i6a6l1bl4n2-limine-install.sh.drv128  /nix/store/ybzag3xkddq67l88ikmv2w47alrnhl73-boot.json.drv129  /nix/store/bw9sz1j3s3ysxyjky34fbdcv8gbkalbc-nixos-system-turingmachine-26.11.20261015.3a3da56.drv130these 33 paths will be fetched (490.7 MiB download, 1.4 GiB unpacked):131  /nix/store/rayvz00kx3771ikwlzwpvjba7znacc4h-7zz-26.04132  /nix/store/15awvgj4irn76am3m3p2smzibpd2p9ap-7zz-26.04-lib133  /nix/store/fj7vrrzr8wpjisp4v0i6jlwasmg8v2xj-NetworkManager-openvpn-1.12.5134  /nix/store/l6106p7kvyz9hk29j7m23q9v4i5071jm-adw-gtk3-6.5135  /nix/store/2aynq10g4n1s0bmya4qgm74mfnsm087q-apache-httpd-2.4.69136  /nix/store/95hr3qbmspavzzkwmbc7bf6bmlxi1ncd-caddy-2.11.7137  /nix/store/whhv5gn82mg489m51bxfabsmpbqd9ni6-chafa-1.18.3138  /nix/store/4x0gcmzlid9q6ba2vi0fca6nqa64liv5-chafa-1.18.3-bin139  /nix/store/604jhshvxyznrqilif07z639bm1fn25g-cliphist-0.7.0140  /nix/store/30hnp1hgcncjgdi9i979n6174ij1k5js-docker-29.8.1141  /nix/store/xv8pqblbf7i6kvx5014lx36kx4a7ybdi-docker-compose-5.6.0142  /nix/store/w84zg2fw26fl8knf6szz05rx2fwffqc4-docker-containerd-29.8.1143  /nix/store/2dwgaza81qqlsxhkglz4d7qjsrafrlmh-gnome-user-share-48.3144  /nix/store/0dd8l4f9mgrwf7mm0i97vs84z5rd34s3-gvfs-1.60.3145  /nix/store/53r6k7bf5zkccm5cgpmyz8az4hfvrqvr-libmsgraph-0.3.4146  /nix/store/26rivhpwsy7h5skpa5axwy4qa01kzkhj-limine-12.9.3147  /nix/store/5w1piiwkzkb07mnh3i47cy5x5cc51k8q-linux-7.2.9-dev148  /nix/store/gv5p3awjzyxn9k5ilwmhrf9lnc26zk1x-moby-29.8.1149  /nix/store/kljdwbv61v0xdmaax02rnvg3jq3kwscv-mod_dnssd-0.6150  /nix/store/bi43hiy0mcsfn7v7pwxldv8x80nvlx0f-nautilus-50.2.2151  /nix/store/66hps6l05pmbqacdhsl8mskn0nsjjw25-niri-26.04152  /nix/store/7f3ia8i944zgddj9vd9lk7qxmgvqwmja-noctalia-qs-0.0.12153  /nix/store/fxzjvsqz10ahz7b5gypyg1548jj9mlki-python3.14-onnxruntime-1.27.1154  /nix/store/11y7rxr96dhd02anzafssjbkz605b65m-python3.14-rapidocr-3.9.2155  /nix/store/wiimy38pvx409d17zi7vg0fv77hdyg1s-slirp4netns-1.3.5156  /nix/store/havdy2rg4rvcyvin25hxpb36qdhprks4-tailscale-1.104.1157  /nix/store/0z450qalys8njb58hw4774c67rm383a0-wdisplays-1.3.0158  /nix/store/20r45sfiabr0m83xj921zv18v7j46lz5-wireshark-cli-4.6.9159  /nix/store/n6imvqfr3yxvd3dkz2mwnksdj7xvi8g9-xdg-desktop-portal-gnome-50.0160  /nix/store/0zpqsqhfx00wsicjdl2sda3zdhxdzdyl-xwayland-satellite-0.8.3161  /nix/store/snmw7fagqbcfkwk13d8m36n2s6nc0prl-xwayland-satellite-0.8.3-man162  /nix/store/ff44zn2sjmgaddp1fgsj2dl4l05s4bza-yazi-26.9.1163  /nix/store/kkx5vrl90gh43wfchlvl2gib0786zivl-yazi-26.9.1164building '/nix/store/qpp1cp1v2597jp89b3pmmpq26iar9cip-etc-zshrc.drv'165building '/nix/store/pg8rl8z6ihl6sf19lxgh9mm6v9zqlllz-hosts.drv'166building '/nix/store/ghcx6d5zlzrc7qs1lgav81yqk64lhzf6-openvpn-tum.drv'167building '/nix/store/82sdiriqkcgg48psjx41cpjs154va0az-extra-udev-rules.drv'168building '/nix/store/64782arb4jh8a16x4fsqwdgjpn38djqc-graphics-drivers-32bit.drv'169building '/nix/store/gcva5a7y6wvgsy4ww602yynya7az4xsd-torrc.drv'170building '/nix/store/jcgd895fzd5fdmrzza4azh02j25nkq9w-userborn.json.drv'171etc-zshrc> tribuchet: building on jamie172extra-udev-rules> tribuchet: building on jamie173graphics-drivers-32bit> tribuchet: building on jamie174hosts> tribuchet: building on jamie175openvpn-tum> tribuchet: building on jamie176torrc> tribuchet: building on jamie177userborn.json> tribuchet: building on jamie178building '/nix/store/4k1gkxvkzr7isdfkp8krl6kvhwvcxwxg-steam-1.0.0.87-fhsenv-rootfs.drv'179building '/nix/store/gzzdzrs46yf6mg7l6hmx6wwklphm2q6h-steam-run-1.0.0.87-fhsenv-rootfs.drv'180steam-1.0.0.87-fhsenv-rootfs> tribuchet: building on jamie181building '/nix/store/sh54d20i04262kwph2fx0lv4jb4cm9b2-desktops.drv'182building '/nix/store/n9779rxkzmf850x55cjwc7yghd2kzx5k-greetd.toml.drv'183greetd.toml> tribuchet: building on jamie184desktops> tribuchet: building on jamie185steam-run-1.0.0.87-fhsenv-rootfs> tribuchet: building on jamie186building '/nix/store/pzg5vb05h830xl05n41ygj5x76akavd4-ensure-all-wrappers-paths-exist.drv'187building '/nix/store/3dl4zp1g57j4rq366p3f61jidnqyil70-noctalia-shell-4.7.7.drv'188ensure-all-wrappers-paths-exist> tribuchet: building on jamie189noctalia-shell-4.7.7> tribuchet: building on jamie190building '/nix/store/gcr2nq9y73ckmhqfra6v5gkzd48izyr0-pre-switch-checks.drv'191pre-switch-checks> tribuchet: building on jamie192building '/nix/store/jfxbnpn3dvr3difhd4zmijy7n7n8lvfb-security-wrapper-dumpcap-x86_64-unknown-linux-musl.drv'193building '/nix/store/5azccf64bnn8sksb0dskswihn82k53m7-unit-caddy.service.drv'194security-wrapper-dumpcap-x86_64-unknown-linux-musl> tribuchet: building on jamie195unit-caddy.service> tribuchet: building on jamie196building '/nix/store/65ny5z2ripqdzp1ya73fiw64zjqx1b2s-unit-docker-prune.service.drv'197building '/nix/store/n7rdq57sg82m5pvbw83dprj7k5ajyi00-unit-docker.service.drv'198unit-docker-prune.service> tribuchet: building on jamie199unit-docker.service> tribuchet: building on jamie200extra-udev-rules> structuredAttrs is enabled201graphics-drivers-32bit> structuredAttrs is enabled202graphics-drivers-32bit> created 3 symlinks in user environment203torrc> structuredAttrs is enabled204userborn.json> structuredAttrs is enabled205steam-1.0.0.87-fhsenv-rootfs> structuredAttrs is enabled206steam-run-1.0.0.87-fhsenv-rootfs> structuredAttrs is enabled207steam-1.0.0.87-fhsenv-rootfs> Warning: Schema “org.gnome.system.locale” has path “/system/locale/”.  Paths starting with “/apps/”, “/desktop/” or “/system/” are deprecated.208steam-1.0.0.87-fhsenv-rootfs> Warning: Schema “org.gnome.system.proxy” has path “/system/proxy/”.  Paths starting with “/apps/”, “/desktop/” or “/system/” are deprecated.209steam-1.0.0.87-fhsenv-rootfs> Warning: Schema “org.gnome.system.proxy.http” has path “/system/proxy/http/”.  Paths starting with “/apps/”, “/desktop/” or “/system/” are deprecated.210steam-1.0.0.87-fhsenv-rootfs> Warning: Schema “org.gnome.system.proxy.https” has path “/system/proxy/https/”.  Paths starting with “/apps/”, “/desktop/” or “/system/” are deprecated.211steam-1.0.0.87-fhsenv-rootfs> Warning: Schema “org.gnome.system.proxy.ftp” has path “/system/proxy/ftp/”.  Paths starting with “/apps/”, “/desktop/” or “/system/” are deprecated.212steam-1.0.0.87-fhsenv-rootfs> Warning: Schema “org.gnome.system.proxy.socks” has path “/system/proxy/socks/”.  Paths starting with “/apps/”, “/desktop/” or “/system/” are deprecated.213steam-run-1.0.0.87-fhsenv-rootfs> Warning: Schema “org.gnome.system.locale” has path “/system/locale/”.  Paths starting with “/apps/”, “/desktop/” or “/system/” are deprecated.214steam-run-1.0.0.87-fhsenv-rootfs> Warning: Schema “org.gnome.system.proxy” has path “/system/proxy/”.  Paths starting with “/apps/”, “/desktop/” or “/system/” are deprecated.215steam-run-1.0.0.87-fhsenv-rootfs> Warning: Schema “org.gnome.system.proxy.http” has path “/system/proxy/http/”.  Paths starting with “/apps/”, “/desktop/” or “/system/” are deprecated.216steam-run-1.0.0.87-fhsenv-rootfs> Warning: Schema “org.gnome.system.proxy.https” has path “/system/proxy/https/”.  Paths starting with “/apps/”, “/desktop/” or “/system/” are deprecated.217steam-run-1.0.0.87-fhsenv-rootfs> Warning: Schema “org.gnome.system.proxy.ftp” has path “/system/proxy/ftp/”.  Paths starting with “/apps/”, “/desktop/” or “/system/” are deprecated.218steam-run-1.0.0.87-fhsenv-rootfs> Warning: Schema “org.gnome.system.proxy.socks” has path “/system/proxy/socks/”.  Paths starting with “/apps/”, “/desktop/” or “/system/” are deprecated.219building '/nix/store/m4pazyz8vcgl89wzj4gvqzaph82b7k0h-nftables-rules.drv'220building '/nix/store/ik24kg54p8izf49g7p7lhqa06ik7ik0r-X-Restart-Triggers-tor.drv'221building '/nix/store/msm7a4rzj5bp5p1q8415gb8zjgk7ifi0-graphics-driver.conf.drv'222building '/nix/store/j323ildjbyky6j5ni6wj4wfkzyl8dhym-hwdb.bin.drv'223building '/nix/store/3g864g1dk4cc3d4lf7y5ikybgpqmwy2l-udev-rules.drv'224X-Restart-Triggers-tor> tribuchet: building on jamie225graphics-driver.conf> tribuchet: building on jamie226hwdb.bin> tribuchet: building on jamie227nftables-rules> tribuchet: building on jamie228pre-switch-checks> structuredAttrs is enabled229udev-rules> tribuchet: building on jamie230building '/nix/store/25n3k1m1nw320himbjzq2mapxh2z0k7g-X-Restart-Triggers-userborn.drv'231X-Restart-Triggers-userborn> tribuchet: building on jamie232building '/nix/store/v2m9s85ybjwqmagl4cjdys6jgy0yy42z-nix-store-2.36.0pre.drv'233nix-store-2.36.0pre> tribuchet: building on jamie234nix-store-2.36.0pre> structuredAttrs is enabled235nix-store-2.36.0pre> Running phase: unpackPhase236nix-store-2.36.0pre> unpacking source archive /nix/store/pbz1v61cy6xzq80izg37pszbvi1kd5x6-source237nix-store-2.36.0pre> source root is source/./src/libstore238nix-store-2.36.0pre> separate-debug-info: recording checksum of source files for debug support...239nix-store-2.36.0pre> Running phase: patchPhase240nix-store-2.36.0pre> Running phase: updateAutotoolsGnuConfigScriptsPhase241nix-store-2.36.0pre> Running phase: configurePhase242nix-store-2.36.0pre> mesonConfigurePhase flags: --prefix=/nix/store/rzrwfv0mg39v19wnxpjg44icc4fva3a0-nix-store-2.36.0pre --libdir=/nix/store/rzrwfv0mg39v19wnxpjg44icc4fva3a0-nix-store-2.36.0pre/lib --libexecdir=/nix/store/rzrwfv0mg39v19wnxpjg44icc4fva3a0-nix-store-2.36.0pre/libexec --bindir=/nix/store/rzrwfv0mg39v19wnxpjg44icc4fva3a0-nix-store-2.36.0pre/bin --sbindir=/nix/store/rzrwfv0mg39v19wnxpjg44icc4fva3a0-nix-store-2.36.0pre/sbin --includedir=/nix/store/vnj3zmcz9lsaf8x7y6vg9fmm7dvqmj9c-nix-store-2.36.0pre-dev/include --mandir=/nix/store/rzrwfv0mg39v19wnxpjg44icc4fva3a0-nix-store-2.36.0pre/share/man --infodir=/nix/store/rzrwfv0mg39v19wnxpjg44icc4fva3a0-nix-store-2.36.0pre/share/info --localedir=/nix/store/rzrwfv0mg39v19wnxpjg44icc4fva3a0-nix-store-2.36.0pre/share/locale -Dauto_features=enabled -Dwrap_mode=nodownload --buildtype=release -Dseccomp-sandboxing=enabled -Dembedded-sandbox-shell=false -Ds3-aws-auth=enabled -Dsandbox-shell=/nix/store/r6zw8gd10c7qv9sifzg4r7h1s5qmrxjp-busybox-1.37.0/bin/busybox -Dunity=on -Dunity_size=8192 -Db_pch=false -Db_lto=true243nix-store-2.36.0pre> The Meson build system244nix-store-2.36.0pre> Version: 1.12.1245nix-store-2.36.0pre> Source dir: /build/source/src/libstore246nix-store-2.36.0pre> Build dir: /build/source/src/libstore/build247nix-store-2.36.0pre> Build type: native build248nix-store-2.36.0pre> Project name: nix-store249nix-store-2.36.0pre> Project version: 2.36.0pre250nix-store-2.36.0pre> C++ compiler for the host machine: g++ (gcc 16.2.0 "g++ (GCC) 16.2.0")251nix-store-2.36.0pre> C++ linker for the host machine: g++ ld.bfd 2.46252nix-store-2.36.0pre> Host machine cpu family: x86_64253nix-store-2.36.0pre> Host machine cpu: x86_64254nix-store-2.36.0pre> Found pkg-config: YES (/nix/store/b9izmrfjp0qnnyahdwwrzdwi87s1h179-pkg-config-wrapper-0.29.2/bin/pkg-config) 0.29.2255nix-store-2.36.0pre> Run-time dependency nix-util found: YES 2.36.0pre256nix-store-2.36.0pre> Program ln found: YES (/nix/store/2gfxiwls9hbgwdwcy43mprchwsq36mg6-coreutils-9.11/bin/ln)257nix-store-2.36.0pre> Checking for function "posix_fallocate" : YES 258nix-store-2.36.0pre> Checking for function "statvfs" : YES 259nix-store-2.36.0pre> Checking for function "open_tree" : YES 260nix-store-2.36.0pre> Checking for function "move_mount" : YES 261nix-store-2.36.0pre> Has header "linux/landlock.h" : YES 262nix-store-2.36.0pre> Has header "sys/xattr.h" : YES 263nix-store-2.36.0pre> Checking for function "llistxattr" : YES 264nix-store-2.36.0pre> Checking for function "lremovexattr" : YES 265nix-store-2.36.0pre> Run-time dependency Boost (found: container, url) for cpp found: YES 1.91.0266nix-store-2.36.0pre> Run-time dependency libcurl found: YES 8.22.0267nix-store-2.36.0pre> Run-time dependency libseccomp found: YES 2.6.1268nix-store-2.36.0pre> Run-time dependency nlohmann_json found: YES 3.12.0269nix-store-2.36.0pre> Run-time dependency sqlite3 found: YES 3.53.3270nix-store-2.36.0pre> Found CMake: /nix/store/jcvvpih1046akxcwh9hdiak5q24jqcf0-cmake-4.4.3/bin/cmake (4.4.3)271nix-store-2.36.0pre> Run-time dependency aws-crt-cpp (modules: AWS::aws-crt-cpp) found: YES 0.34.3272nix-store-2.36.0pre> Program /nix/store/r6zw8gd10c7qv9sifzg4r7h1s5qmrxjp-busybox-1.37.0/bin/busybox found: YES (/nix/store/r6zw8gd10c7qv9sifzg4r7h1s5qmrxjp-busybox-1.37.0/bin/busybox)273nix-store-2.36.0pre> Program lsof found: NO274nix-store-2.36.0pre> Configuring store-config-private.hh using configuration275nix-store-2.36.0pre> Run-time dependency threads found: YES276nix-store-2.36.0pre> Compiler for C++ supports arguments -Wdeprecated-copy: YES 277nix-store-2.36.0pre> Compiler for C++ supports arguments -Werror=suggest-override: YES 278nix-store-2.36.0pre> Compiler for C++ supports arguments -Werror=switch: YES 279nix-store-2.36.0pre> Compiler for C++ supports arguments -Werror=switch-enum: YES 280nix-store-2.36.0pre> Compiler for C++ supports arguments -Werror=undef: YES 281nix-store-2.36.0pre> Compiler for C++ supports arguments -Werror=unused-result: YES 282nix-store-2.36.0pre> Compiler for C++ supports arguments -Werror=sign-compare: YES 283nix-store-2.36.0pre> Compiler for C++ supports arguments -Werror=return-type: YES 284nix-store-2.36.0pre> Compiler for C++ supports arguments -Werror=non-virtual-dtor: YES 285nix-store-2.36.0pre> Compiler for C++ supports arguments -Wignored-qualifiers: YES 286nix-store-2.36.0pre> Compiler for C++ supports arguments -Wimplicit-fallthrough: YES 287nix-store-2.36.0pre> Compiler for C++ supports arguments -Wno-c23-extensions: NO 288nix-store-2.36.0pre> Compiler for C++ supports arguments -Wno-deprecated-declarations: YES 289nix-store-2.36.0pre> Compiler for C++ supports arguments -Wno-interference-size: YES 290nix-store-2.36.0pre> Compiler for C++ supports arguments -Wno-subobject-linkage: YES 291nix-store-2.36.0pre> Compiler for C++ supports arguments -Werror=c99-designator: NO 292nix-store-2.36.0pre> Compiler for C++ supports arguments -Werror=weak-vtables: NO 293nix-store-2.36.0pre> Checking if "using libstdc++" compiles: YES 294nix-store-2.36.0pre> Checking if "linker can wrap __assert_fail" links: YES 295nix-store-2.36.0pre> Program python3 found: YES296nix-store-2.36.0pre> Program run-clang-tidy found: NO297nix-store-2.36.0pre> Run-time dependency nix-clang-tidy found: NO  (tried pkg-config and cmake)298nix-store-2.36.0pre> meson.build:257: WARNING: 'build/build-log.cc' is a generated file, and should be passed by reference instead of string name. This will become a hard error in Meson 2.0299nix-store-2.36.0pre> meson.build:257: WARNING: 'build/derivation-builder-impl.cc' is a generated file, and should be passed by reference instead of string name. This will become a hard error in Meson 2.0300nix-store-2.36.0pre> meson.build:257: WARNING: 'build/derivation-builder.cc' is a generated file, and should be passed by reference instead of string name. This will become a hard error in Meson 2.0301nix-store-2.36.0pre> meson.build:257: WARNING: 'build/derivation-building-goal.cc' is a generated file, and should be passed by reference instead of string name. This will become a hard error in Meson 2.0302nix-store-2.36.0pre> meson.build:257: WARNING: 'build/derivation-check.cc' is a generated file, and should be passed by reference instead of string name. This will become a hard error in Meson 2.0303nix-store-2.36.0pre> meson.build:257: WARNING: 'build/derivation-env-desugar.cc' is a generated file, and should be passed by reference instead of string name. This will become a hard error in Meson 2.0304nix-store-2.36.0pre> meson.build:257: WARNING: 'build/derivation-goal.cc' is a generated file, and should be passed by reference instead of string name. This will become a hard error in Meson 2.0305nix-store-2.36.0pre> meson.build:257: WARNING: 'build/derivation-resolution-goal.cc' is a generated file, and should be passed by reference instead of string name. This will become a hard error in Meson 2.0306nix-store-2.36.0pre> meson.build:257: WARNING: 'build/derivation-trampoline-goal.cc' is a generated file, and should be passed by reference instead of string name. This will become a hard error in Meson 2.0307nix-store-2.36.0pre> meson.build:257: WARNING: 'build/drv-output-substitution-goal.cc' is a generated file, and should be passed by reference instead of string name. This will become a hard error in Meson 2.0308nix-store-2.36.0pre> meson.build:257: WARNING: 'build/entry-points.cc' is a generated file, and should be passed by reference instead of string name. This will become a hard error in Meson 2.0309nix-store-2.36.0pre> meson.build:257: WARNING: 'build/goal.cc' is a generated file, and should be passed by reference instead of string name. This will become a hard error in Meson 2.0310nix-store-2.36.0pre> meson.build:257: WARNING: 'build/substitution-goal.cc' is a generated file, and should be passed by reference instead of string name. This will become a hard error in Meson 2.0311nix-store-2.36.0pre> meson.build:257: WARNING: 'build/worker.cc' is a generated file, and should be passed by reference instead of string name. This will become a hard error in Meson 2.0312nix-store-2.36.0pre> Configuring config.hh using configuration313nix-store-2.36.0pre> Found pkg-config: YES (/nix/store/b9izmrfjp0qnnyahdwwrzdwi87s1h179-pkg-config-wrapper-0.29.2/bin/pkg-config) 0.29.2314nix-store-2.36.0pre> Build targets in project: 1315nix-store-2.36.0pre> 316nix-store-2.36.0pre> nix-store 2.36.0pre317nix-store-2.36.0pre> 318nix-store-2.36.0pre>     can hardlink to symlink: YES319nix-store-2.36.0pre> 320nix-store-2.36.0pre>   User defined options321nix-store-2.36.0pre>     auto_features          : enabled322nix-store-2.36.0pre>     b_lto                  : true323nix-store-2.36.0pre>     b_pch                  : false324nix-store-2.36.0pre>     bindir                 : /nix/store/rzrwfv0mg39v19wnxpjg44icc4fva3a0-nix-store-2.36.0pre/bin325nix-store-2.36.0pre>     buildtype              : release326nix-store-2.36.0pre>     embedded-sandbox-shell : false327nix-store-2.36.0pre>     includedir             : /nix/store/vnj3zmcz9lsaf8x7y6vg9fmm7dvqmj9c-nix-store-2.36.0pre-dev/include328nix-store-2.36.0pre>     infodir                : /nix/store/rzrwfv0mg39v19wnxpjg44icc4fva3a0-nix-store-2.36.0pre/share/info329nix-store-2.36.0pre>     libdir                 : /nix/store/rzrwfv0mg39v19wnxpjg44icc4fva3a0-nix-store-2.36.0pre/lib330nix-store-2.36.0pre>     libexecdir             : /nix/store/rzrwfv0mg39v19wnxpjg44icc4fva3a0-nix-store-2.36.0pre/libexec331nix-store-2.36.0pre>     localedir              : /nix/store/rzrwfv0mg39v19wnxpjg44icc4fva3a0-nix-store-2.36.0pre/share/locale332nix-store-2.36.0pre>     mandir                 : /nix/store/rzrwfv0mg39v19wnxpjg44icc4fva3a0-nix-store-2.36.0pre/share/man333nix-store-2.36.0pre>     prefix                 : /nix/store/rzrwfv0mg39v19wnxpjg44icc4fva3a0-nix-store-2.36.0pre334nix-store-2.36.0pre>     s3-aws-auth            : enabled335nix-store-2.36.0pre>     sandbox-shell          : /nix/store/r6zw8gd10c7qv9sifzg4r7h1s5qmrxjp-busybox-1.37.0/bin/busybox336nix-store-2.36.0pre>     sbindir                : /nix/store/rzrwfv0mg39v19wnxpjg44icc4fva3a0-nix-store-2.36.0pre/sbin337nix-store-2.36.0pre>     seccomp-sandboxing     : enabled338nix-store-2.36.0pre>     unity                  : on339nix-store-2.36.0pre>     unity_size             : 8192340nix-store-2.36.0pre>     wrap_mode              : nodownload341nix-store-2.36.0pre> 342nix-store-2.36.0pre> Found ninja-1.13.2 at /nix/store/4nsdla28c4177ssp0hlyv5l2yzj8wcba-ninja-1.13.2/bin/ninja343nix-store-2.36.0pre> Running postconf script '/nix/store/lb41b0anx1f98y9y5s9mdv97gjgsq740-python3-3.14.7/bin/python3.14 /build/source/src/libstore/nix-meson-build-support/common/clang-tidy/clean_compdb.py /build/source/src/libstore/build/compile_commands.json /build/source/src/libstore/build/nix-meson-build-support/common/clang-tidy/compile_commands.json'344nix-store-2.36.0pre> Running phase: buildPhase345nix-store-2.36.0pre> build flags: -j24346nix-store-2.36.0pre> [1/2] Compiling C++ object libnixstore.so.2.36.0.p/meson-generated_nixstore-unity0.cpp.o347nix-store-2.36.0pre> FAILED: [code=1] libnixstore.so.2.36.0.p/meson-generated_nixstore-unity0.cpp.o 348nix-store-2.36.0pre> g++ -Ilibnixstore.so.2.36.0.p -I. -I.. -Iinclude -I../include -I../linux/build -Ilinux/include -I../linux/include -I../unix/build -Iunix/include -I../unix/include -I/nix/store/la1rzzb3q1wjdz50dyvh62fix41ayifa-nix-util-2.36.0pre-dev/include -I/nix/store/2ybid2fqf6nfqrwcgizv9qvvckyp6axh-libarchive-3.8.9-dev/include -I/nix/store/0dz9bi5rv50d46w8xykwdxrj4ssy6pnp-nlohmann_json-3.12.0/include -I/nix/store/aph5dkajglxjn9642bp0h3x7cwzijr52-curl-8.22.0-dev/include -I/nix/store/q2yrf8yhmj405nv9qbbraxr8wlz7n5kv-libseccomp-2.6.1-dev/include -I/nix/store/xrcjl59yi7zswbv0vzm8cmvw4vplsbgj-sqlite-3.53.3-dev/include -I/nix/store/2zgasbvd9mzmj145mxsmnzxiy7rnz82b-aws-c-http-0.11.0/include -I/nix/store/3qrc60ba9qwxiyx8wlnfwwvqknpmhbmb-aws-crt-cpp-0.34.3-dev/include -I/nix/store/45ndmvc3vy9rd30mk71bq89gigzdx64p-aws-c-sdkutils-0.2.4/include -I/nix/store/5w514y0s25ym17bsrw43wl33fbxvy91a-aws-c-compression-0.3.1/include -I/nix/store/ai6kkxbkfjgkmpkwamrvhc5d1m3l5v1d-aws-c-cal-0.9.2/include -I/nix/store/bg4d55k9sg2x763215brap5ndhnqil53-aws-c-auth-0.9.1/include -I/nix/store/cf610ccndgvh5nfhbarjbqpvr3zkb3vr-aws-c-event-stream-0.7.0/include -I/nix/store/hc6mxys4iyawmwiyaixkcl9izjrqmr2q-openssl-3.5.8-dev/include -I/nix/store/igm0j0xhbj57bn2sm4w07jnhz8fb22pc-aws-c-mqtt-0.13.3/include -I/nix/store/lpglqdmacwwq3csbqknbl8d427rky1ba-aws-c-common-0.12.4/include -I/nix/store/r3rc5z2wvz9igh9gpf4323y3ds0xq3l9-aws-c-s3-0.8.7/include -I/nix/store/yk25gm6nvm11mjkika1b00m41mh247di-aws-c-io-0.27.2/include -I/nix/store/yryxvlaj6vw4sdk3ryl4wspnaqhm6vxd-aws-checksums-0.2.7/include -flto=auto -fdiagnostics-color=always -D_FILE_OFFSET_BITS=64 -Wall -Winvalid-pch -std=c++23 -O3 -Wdeprecated-copy -Werror=suggest-override -Werror=switch -Werror=switch-enum -Werror=undef -Werror=unused-result -Werror=sign-compare -Werror=return-type -Werror=non-virtual-dtor -Wignored-qualifiers -Wimplicit-fallthrough -Wno-deprecated-declarations -Wno-interference-size -Wno-subobject-linkage -D_GLIBCXX_USE_TBB_PAR_BACKEND=0 -fno-semantic-interposition -Wl,-Bsymbolic-functions -fPIC -DAWS_AUTH_USE_IMPORT_EXPORT -DAWS_CAL_USE_IMPORT_EXPORT -DAWS_CHECKSUMS_USE_IMPORT_EXPORT -DAWS_COMMON_USE_IMPORT_EXPORT -DAWS_COMPRESSION_USE_IMPORT_EXPORT -DAWS_CRT_CPP_USE_IMPORT_EXPORT -DAWS_ENABLE_EPOLL -DAWS_EVENT_STREAM_USE_IMPORT_EXPORT -DAWS_HTTP_USE_IMPORT_EXPORT -DAWS_IO_USE_IMPORT_EXPORT -DAWS_MQTT_USE_IMPORT_EXPORT -DAWS_S3_USE_IMPORT_EXPORT -DAWS_SDKUTILS_USE_IMPORT_EXPORT -DBOOST_CONTAINER_DYN_LINK=1 -DBOOST_ALL_NO_LIB -pthread -std=c++23 -MD -MQ libnixstore.so.2.36.0.p/meson-generated_nixstore-unity0.cpp.o -MF libnixstore.so.2.36.0.p/meson-generated_nixstore-unity0.cpp.o.d -o libnixstore.so.2.36.0.p/meson-generated_nixstore-unity0.cpp.o -c libnixstore.so.2.36.0.p/nixstore-unity0.cpp349nix-store-2.36.0pre> libnixstore.so.2.36.0.p/nixstore-unity0.cpp:3:9: fatal error: /build/source/src/libstore/build/build/build-log.cc: No such file or directory350nix-store-2.36.0pre>     3 | #include</build/source/src/libstore/build/build/build-log.cc>351nix-store-2.36.0pre>       |         ^~~~~~~~~~~~~~~~~~~~~~~~~~~~~~~~~~~~~~~~~~~~~~~~~~~~~352nix-store-2.36.0pre> compilation terminated.353nix-store-2.36.0pre> ninja: build stopped: subcommand failed.354error: Cannot build '/nix/store/v2m9s85ybjwqmagl4cjdys6jgy0yy42z-nix-store-2.36.0pre.drv'.355       Reason: builder failed with exit code 1.356       Output paths:357         /nix/store/qm5hxb4f94hppsp7sdjr0vncszzm8d8c-nix-store-2.36.0pre-debug358         /nix/store/rzrwfv0mg39v19wnxpjg44icc4fva3a0-nix-store-2.36.0pre359         /nix/store/vnj3zmcz9lsaf8x7y6vg9fmm7dvqmj9c-nix-store-2.36.0pre-dev360       Last 25 log lines:361       >     libdir                 : /nix/store/rzrwfv0mg39v19wnxpjg44icc4fva3a0-nix-store-2.36.0pre/lib362       >     libexecdir             : /nix/store/rzrwfv0mg39v19wnxpjg44icc4fva3a0-nix-store-2.36.0pre/libexec363       >     localedir              : /nix/store/rzrwfv0mg39v19wnxpjg44icc4fva3a0-nix-store-2.36.0pre/share/locale364       >     mandir                 : /nix/store/rzrwfv0mg39v19wnxpjg44icc4fva3a0-nix-store-2.36.0pre/share/man365       >     prefix                 : /nix/store/rzrwfv0mg39v19wnxpjg44icc4fva3a0-nix-store-2.36.0pre366       >     s3-aws-auth            : enabled367       >     sandbox-shell          : /nix/store/r6zw8gd10c7qv9sifzg4r7h1s5qmrxjp-busybox-1.37.0/bin/busybox368       >     sbindir                : /nix/store/rzrwfv0mg39v19wnxpjg44icc4fva3a0-nix-store-2.36.0pre/sbin369       >     seccomp-sandboxing     : enabled370       >     unity                  : on371       >     unity_size             : 8192372       >     wrap_mode              : nodownload373       >374       > Found ninja-1.13.2 at /nix/store/4nsdla28c4177ssp0hlyv5l2yzj8wcba-ninja-1.13.2/bin/ninja375       > Running postconf script '/nix/store/lb41b0anx1f98y9y5s9mdv97gjgsq740-python3-3.14.7/bin/python3.14 /build/source/src/libstore/nix-meson-build-support/common/clang-tidy/clean_compdb.py /build/source/src/libstore/build/compile_commands.json /build/source/src/libstore/build/nix-meson-build-support/common/clang-tidy/compile_commands.json'376       > Running phase: buildPhase377       > build flags: -j24378       > [1/2] Compiling C++ object libnixstore.so.2.36.0.p/meson-generated_nixstore-unity0.cpp.o379       > FAILED: [code=1] libnixstore.so.2.36.0.p/meson-generated_nixstore-unity0.cpp.o380       > g++ -Ilibnixstore.so.2.36.0.p -I. -I.. -Iinclude -I../include -I../linux/build -Ilinux/include -I../linux/include -I../unix/build -Iunix/include -I../unix/include -I/nix/store/la1rzzb3q1wjdz50dyvh62fix41ayifa-nix-util-2.36.0pre-dev/include -I/nix/store/2ybid2fqf6nfqrwcgizv9qvvckyp6axh-libarchive-3.8.9-dev/include -I/nix/store/0dz9bi5rv50d46w8xykwdxrj4ssy6pnp-nlohmann_json-3.12.0/include -I/nix/store/aph5dkajglxjn9642bp0h3x7cwzijr52-curl-8.22.0-dev/include -I/nix/store/q2yrf8yhmj405nv9qbbraxr8wlz7n5kv-libseccomp-2.6.1-dev/include -I/nix/store/xrcjl59yi7zswbv0vzm8cmvw4vplsbgj-sqlite-3.53.3-dev/include -I/nix/store/2zgasbvd9mzmj145mxsmnzxiy7rnz82b-aws-c-http-0.11.0/include -I/nix/store/3qrc60ba9qwxiyx8wlnfwwvqknpmhbmb-aws-crt-cpp-0.34.3-dev/include -I/nix/store/45ndmvc3vy9rd30mk71bq89gigzdx64p-aws-c-sdkutils-0.2.4/include -I/nix/store/5w514y0s25ym17bsrw43wl33fbxvy91a-aws-c-compression-0.3.1/include -I/nix/store/ai6kkxbkfjgkmpkwamrvhc5d1m3l5v1d-aws-c-cal-0.9.2/include -I/nix/store/bg4d55k9sg2x763215brap5ndhnqil53-aws-c-auth-0.9.1/include -I/nix/store/cf610ccndgvh5nfhbarjbqpvr3zkb3vr-aws-c-event-stream-0.7.0/include -I/nix/store/hc6mxys4iyawmwiyaixkcl9izjrqmr2q-openssl-3.5.8-dev/include -I/nix/store/igm0j0xhbj57bn2sm4w07jnhz8fb22pc-aws-c-mqtt-0.13.3/include -I/nix/store/lpglqdmacwwq3csbqknbl8d427rky1ba-aws-c-common-0.12.4/include -I/nix/store/r3rc5z2wvz9igh9gpf4323y3ds0xq3l9-aws-c-s3-0.8.7/include -I/nix/store/yk25gm6nvm11mjkika1b00m41mh247di-aws-c-io-0.27.2/include -I/nix/store/yryxvlaj6vw4sdk3ryl4wspnaqhm6vxd-aws-checksums-0.2.7/include -flto=auto -fdiagnostics-color=always -D_FILE_OFFSET_BITS=64 -Wall -Winvalid-pch -std=c++23 -O3 -Wdeprecated-copy -Werror=suggest-override -Werror=switch -Werror=switch-enum -Werror=undef -Werror=unused-result -Werror=sign-compare -Werror=return-type -Werror=non-virtual-dtor -Wignored-qualifiers -Wimplicit-fallthrough -Wno-deprecated-declarations -Wno-interference-size -Wno-subobject-linkage -D_GLIBCXX_USE_TBB_PAR_BACKEND=0 -fno-semantic-interposition -Wl,-Bsymbolic-functions -fPIC -DAWS_AUTH_USE_IMPORT_EXPORT -DAWS_CAL_USE_IMPORT_EXPORT -DAWS_CHECKSUMS_USE_IMPORT_EXPORT -DAWS_COMMON_USE_IMPORT_EXPORT -DAWS_COMPRESSION_USE_IMPORT_EXPORT -DAWS_CRT_CPP_USE_IMPORT_EXPORT -DAWS_ENABLE_EPOLL -DAWS_EVENT_STREAM_USE_IMPORT_EXPORT -DAWS_HTTP_USE_IMPORT_EXPORT -DAWS_IO_USE_IMPORT_EXPORT -DAWS_MQTT_USE_IMPORT_EXPORT -DAWS_S3_USE_IMPORT_EXPORT -DAWS_SDKUTILS_USE_IMPORT_EXPORT -DBOOST_CONTAINER_DYN_LINK=1 -DBOOST_ALL_NO_LIB -pthread -std=c++23 -MD -MQ libnixstore.so.2.36.0.p/meson-generated_nixstore-unity0.cpp.o -MF libnixstore.so.2.36.0.p/meson-generated_nixstore-unity0.cpp.o.d -o libnixstore.so.2.36.0.p/meson-generated_nixstore-unity0.cpp.o -c libnixstore.so.2.36.0.p/nixstore-unity0.cpp381       > libnixstore.so.2.36.0.p/nixstore-unity0.cpp:3:9: fatal error: /build/source/src/libstore/build/build/build-log.cc: No such file or directory382       >     3 | #include</build/source/src/libstore/build/build/build-log.cc>383       >       |         ^~~~~~~~~~~~~~~~~~~~~~~~~~~~~~~~~~~~~~~~~~~~~~~~~~~~~384       > compilation terminated.385       > ninja: build stopped: subcommand failed.386       For full logs, run:387         nix log /nix/store/v2m9s85ybjwqmagl4cjdys6jgy0yy42z-nix-store-2.36.0pre.drv388error: Cannot build '/nix/store/2nadarzfx4204sjkl2xwjdf3z19n63y2-nix-fetchers-2.36.0pre.drv'.389       Reason: 1 dependency failed.390       Output paths:391         /nix/store/hd38i5wb7wbvf6rwzwdrz2n3nfx72j8a-nix-fetchers-2.36.0pre-dev392         /nix/store/hj79dpl45d9az4blqiarc1r7r6hlnj51-nix-fetchers-2.36.0pre-debug393         /nix/store/l4hfd896ya6k5bmnld6rpb8pq2p3ykcb-nix-fetchers-2.36.0pre394error: Cannot build '/nix/store/lr8pa9r5vrzn89nmfh0ii37jrh8xyw4x-nix-grpc-store-0.2.0.drv'.395       Reason: 1 dependency failed.396       Output paths:397         /nix/store/x1rh7qb5qnq39ibr62yxcf0adrbxk4vs-nix-grpc-store-0.2.0-debug398         /nix/store/x6bx2gbg6054aii2jcbiivpgmzg67sly-nix-grpc-store-0.2.0399error: Cannot build '/nix/store/sxnasgvjr7a8hvg3n8w9l961pciy1g13-nix-store-c-2.36.0pre.drv'.400       Reason: 1 dependency failed.401       Output paths:402         /nix/store/2mc4yxy9w19kv55v9pp1i39wisvd2rqr-nix-store-c-2.36.0pre-dev403         /nix/store/7ryvsv18nml3ldzzxzgg8iv1z347j6pl-nix-store-c-2.36.0pre-debug404         /nix/store/spxyzyqffcww3wcig12knbjv22km17gm-nix-store-c-2.36.0pre405error: Cannot build '/nix/store/a5npk3j5sjqhwnkq163h9ijccxcdwk48-nix-expr-2.36.0pre.drv'.406       Reason: 2 dependencies failed.407       Output paths:408         /nix/store/1k55xpzifxkfwwskak6d8x811g3gfl4n-nix-expr-2.36.0pre-dev409         /nix/store/3km4yxp7q7sd70jv8xcc25g0l3nribdw-nix-expr-2.36.0pre410         /nix/store/p3b2rhn4kk71bih0y9pscfv8y4m3d3z3-nix-expr-2.36.0pre-debug411error: Cannot build '/nix/store/lqmxgizl9hnv8ymi72bm062wj6kgzdrd-nix-grpc-store-dispatcher.drv'.412       Reason: 1 dependency failed.413       Output paths:414         /nix/store/4n720vlx5pfk2zwyd7rdz47z7v2hkv38-nix-grpc-store-dispatcher415error: Cannot build '/nix/store/9kzwqrbpa8566m45rw2lbc6qn4ckabda-nix-store-test-support-2.36.0pre.drv'.416       Reason: 2 dependencies failed.417       Output paths:418         /nix/store/5rrgib4daz3bdigsbb72qnh4aq0v2shg-nix-store-test-support-2.36.0pre419         /nix/store/c1k4nz6jaymdx8k6zm6bd37fxvrjkwhz-nix-store-test-support-2.36.0pre-dev420         /nix/store/lrv6cjicl1h56jm9s3d5zdz5j1xdifzi-nix-store-test-support-2.36.0pre-debug421error: Cannot build '/nix/store/yn2pynw1kjn8rgj34rg76npbywgxf8v1-nix-tarmac-0.1.0.drv'.422       Reason: 2 dependencies failed.423       Output paths:424         /nix/store/zmabykzyc4ww2dgk7xq7m715zb3674sd-nix-tarmac-0.1.0425error: Cannot build '/nix/store/vp65rb9lbq5c6pwf1mkabyz09nwgigbr-nix-expr-c-2.36.0pre.drv'.426       Reason: 2 dependencies failed.427       Output paths:428         /nix/store/acnlxxb1vy21fsmxb6zlwyvydl02qp97-nix-expr-c-2.36.0pre-dev429         /nix/store/b4m37rw88x67ia4q2lnjj6dhrh3w450k-nix-expr-c-2.36.0pre430         /nix/store/d3f0wvk6zkxfk6nv9285hspnmal5rliq-nix-expr-c-2.36.0pre-debug431error: Cannot build '/nix/store/lp7vgrj5rx8vkc522ghffw5v51zn8gg1-nix-flake-2.36.0pre.drv'.432       Reason: 3 dependencies failed.433       Output paths:434         /nix/store/5cjrqiy0sfxc4dbjkciwn9bpx5qzywym-nix-flake-2.36.0pre-dev435         /nix/store/jcsx9adlxxlypj54s7zkfcd0n7kf4bhh-nix-flake-2.36.0pre436         /nix/store/yl9s5ans2q73ydlvad5q7hwxd68684n4-nix-flake-2.36.0pre-debug437error: Cannot build '/nix/store/mmdd6pjxl5pcq39dvnjyza8an45jj38a-nix-main-2.36.0pre.drv'.438       Reason: 2 dependencies failed.439       Output paths:440         /nix/store/5p9xr84f1ll9yzg29piyi98lxvg6lf8x-nix-main-2.36.0pre-debug441         /nix/store/6n1667bxxnmm54lchalbcwwhmmxw08hs-nix-main-2.36.0pre442         /nix/store/8qbjg61xm2f79ff7w61mkp1dfjkz6ij0-nix-main-2.36.0pre-dev443error: Cannot build '/nix/store/9709y4fpmlmignzwbfrbiaf82fxj9b1f-nix-store-tests-2.36.0pre.drv'.444       Reason: 3 dependencies failed.445       Output paths:446         /nix/store/1x97b9s2cc3f2nxvw0gdjlxjmkavxz5n-nix-store-tests-2.36.0pre447         /nix/store/sy3p4qb0fn4m3wykhl0lf56qplrxlwby-nix-store-tests-2.36.0pre-debug448error: Cannot build '/nix/store/73m5kf01zlgk3jhw7vxf3f9vp2snbbsl-nix-tarmac-dispatcher.drv'.449       Reason: 1 dependency failed.450       Output paths:451         /nix/store/5xn646a4l1zphdbrv6g95ah1lnxdibfg-nix-tarmac-dispatcher452error: Cannot build '/nix/store/kyvnhy1bsksljwyfx8y9qfd1a7qgd84c-nix-cmd-2.36.0pre.drv'.453       Reason: 5 dependencies failed.454       Output paths:455         /nix/store/d5617a1kkb07anfr38gfzw25ihlmn2d7-nix-cmd-2.36.0pre-dev456         /nix/store/jrxs6h7lxzr12p8hf1q899cy4qhahgy7-nix-cmd-2.36.0pre457         /nix/store/vfklia2gdl2cr0k1jzsqwi2b05lnia3s-nix-cmd-2.36.0pre-debug458error: Cannot build '/nix/store/ikxwb4anvib05pz97a7irdd3zdcqfkbd-nix-fetchers-c-2.36.0pre.drv'.459       Reason: 3 dependencies failed.460       Output paths:461         /nix/store/g6pbpaxlri10ibvw7292jrizx9j853ra-nix-fetchers-c-2.36.0pre-dev462         /nix/store/n3s54qm08qvhl93smjdbqn2aqfd1is7k-nix-fetchers-c-2.36.0pre463         /nix/store/p92xgwzsgvfbz9ybsrfrwxqf6rygph6y-nix-fetchers-c-2.36.0pre-debug464error: Cannot build '/nix/store/rxnmvhf70i800adkpqff584ami6ng8dp-nix-main-c-2.36.0pre.drv'.465       Reason: 3 dependencies failed.466       Output paths:467         /nix/store/45mbgw9nxpk29vdx1md6vxnc0w4yj1pg-nix-main-c-2.36.0pre-debug468         /nix/store/gf8fnbn1k06lakh0agk3fyn0r388xqck-nix-main-c-2.36.0pre-dev469         /nix/store/xb81f8xs8wfxm8q8c50cbzda3s573wpa-nix-main-c-2.36.0pre470error: Cannot build '/nix/store/kgj36snczcgjlry62di6h0zyh7sw8226-nix-store-tests-run.drv'.471       Reason: 1 dependency failed.472       Output paths:473         /nix/store/llm5rmn1cx63xql6lq6f8wiijp5v4k4n-nix-store-tests-run474error: Cannot build '/nix/store/9cjrmbhhg6ymlppx70yn5158wy8hrm8z-nix-util-test-support-2.36.0pre.drv'.475       Reason: 3 dependencies failed.476       Output paths:477         /nix/store/a573yylngcig1k3q18brclqfbnps5bvn-nix-util-test-support-2.36.0pre-dev478         /nix/store/g9fjxh647c0h5nrbag7xxiqvr7r3n38p-nix-util-test-support-2.36.0pre-debug479         /nix/store/yginsv9651dd52qjpg89wyf1n8j9kssq-nix-util-test-support-2.36.0pre480error: Cannot build '/nix/store/ws9l2l2phzjvnfl4ck3iyki9rci8909k-nix-expr-tests-2.36.0pre.drv'.481       Reason: 3 dependencies failed.482       Output paths:483         /nix/store/ljv5nl80r2r1caiy5cs9dinsfj08f321-nix-expr-tests-2.36.0pre-debug484         /nix/store/v2mkg7mzfigd8dpfj0dqhs51yqd5y0a0-nix-expr-tests-2.36.0pre485error: Cannot build '/nix/store/dqi93g30b3xag1fqrdlnljjy1iy2mxgv-nix-fetchers-tests-2.36.0pre.drv'.486       Reason: 3 dependencies failed.487       Output paths:488         /nix/store/c1k3pc3kjvdg5vwyr3psl63jgbndkf5r-nix-fetchers-tests-2.36.0pre489         /nix/store/lqbjly8j5szfkag8i1s2b4ab62khkrxd-nix-fetchers-tests-2.36.0pre-debug490error: Cannot build '/nix/store/78vrmb9y2cmwk57b3dj19688frsm44n2-nix-flake-c-2.36.0pre.drv'.491       Reason: 4 dependencies failed.492       Output paths:493         /nix/store/0qlcsdydk7a0agi4qb3nrmcv77fgbilw-nix-flake-c-2.36.0pre-debug494         /nix/store/7gg0swjhz03qf7mnah7xxg1gq193jkls-nix-flake-c-2.36.0pre-dev495         /nix/store/p6j3yvl124zmsr3jfh1w0aj6izcml8z7-nix-flake-c-2.36.0pre496error: Cannot build '/nix/store/ckgk8lxiwdy04pg1l6jh1vkxnk095r61-nix-2.36.0pre20260918_09e24b6.drv'.497       Reason: 9 dependencies failed.498       Output paths:499         /nix/store/7fdq8x6bqnnzl8386245wa8hc9bcpqid-nix-2.36.0pre20260918_09e24b6500         /nix/store/wymhar3bnbxrv281ah8v3pn4xyxfx7sa-nix-2.36.0pre20260918_09e24b6-debug501error: Cannot build '/nix/store/5dj8slb0dzaa2anmd71r51cf585bv9jq-nix-expr-tests-run.drv'.502       Reason: 1 dependency failed.503       Output paths:504         /nix/store/5gvqjv862v0n9p7f97swblzv1x4x697z-nix-expr-tests-run505error: Cannot build '/nix/store/w5sbnbc4yayksrk7pjjhjhcrq6wzzvbc-nix-fetchers-tests-run.drv'.506       Reason: 1 dependency failed.507       Output paths:508         /nix/store/wjnx5mxfpydgj8xil5zxyq6kl84r2djn-nix-fetchers-tests-run509error: Cannot build '/nix/store/dzsdf6nk4j6wz2my53l01pvv955w5fvn-nix-flake-tests-2.36.0pre.drv'.510       Reason: 3 dependencies failed.511       Output paths:512         /nix/store/gz53gx716l37k8ryraxk9npaxcia71nl-nix-flake-tests-2.36.0pre-debug513         /nix/store/p33j3hc6ij2qq61vsbp0y059m06nz05j-nix-flake-tests-2.36.0pre514error: Cannot build '/nix/store/21qcasyk6cfp1f1cg8a5yp6cgfr215ng-nix-flake-tests-run.drv'.515       Reason: 1 dependency failed.516       Output paths:517         /nix/store/5j1w5ryvpwakcz65i3slg0dnsn4ka5k1-nix-flake-tests-run518error: Cannot build '/nix/store/r71nhkmrrrmrbs8hzrcp323qawbd8w7x-nix-functional-tests-2.36.0pre20260918_09e24b6.drv'.519       Reason: 3 dependencies failed.520       Output paths:521         /nix/store/bz7zx51h7xjmf7sszfprc7zg6qy5v1rw-nix-functional-tests-2.36.0pre20260918_09e24b6522error: Cannot build '/nix/store/sxgcj2cz28l4njbgvd2jvp9ypc3dhcwq-nix-manual-2.36.0pre20260918_09e24b6.drv'.523       Reason: 1 dependency failed.524       Output paths:525         /nix/store/8rmg5229m28874aamisin7ir8qfkppg8-nix-manual-2.36.0pre20260918_09e24b6-man526         /nix/store/jhh6cl4r79rkqg4lc9m0fifbfmmnq8f7-nix-manual-2.36.0pre20260918_09e24b6527error: Cannot build '/nix/store/sxgcj2cz28l4njbgvd2jvp9ypc3dhcwq-nix-manual-2.36.0pre20260918_09e24b6.drv'.528       Reason: 1 dependency failed.529       Output paths:530         /nix/store/8rmg5229m28874aamisin7ir8qfkppg8-nix-manual-2.36.0pre20260918_09e24b6-man531         /nix/store/jhh6cl4r79rkqg4lc9m0fifbfmmnq8f7-nix-manual-2.36.0pre20260918_09e24b6532error: Cannot build '/nix/store/m3p49al1vh52z8njjsp5fkm34qnq9dx3-nix-2.36.0pre20260918_09e24b6.drv'.533       Reason: 19 dependencies failed.534       Output paths:535         /nix/store/galf079i6yqb0v0s1dr21kbjczqml28a-nix-2.36.0pre20260918_09e24b6-dev536         /nix/store/q2rb5l2ak3sv6b2gz54fw9b42ramaia9-nix-2.36.0pre20260918_09e24b6537         /nix/store/wyy2bq6c3rrvx6agdn3lgmzrrl958rxp-nix-2.36.0pre20260918_09e24b6-man538         /nix/store/yaif46chghmn7frwy8kp12ic4qqrlk1f-nix-2.36.0pre20260918_09e24b6-doc539error: Cannot build '/nix/store/m3p49al1vh52z8njjsp5fkm34qnq9dx3-nix-2.36.0pre20260918_09e24b6.drv'.540       Reason: 19 dependencies failed.541       Output paths:542         /nix/store/galf079i6yqb0v0s1dr21kbjczqml28a-nix-2.36.0pre20260918_09e24b6-dev543         /nix/store/q2rb5l2ak3sv6b2gz54fw9b42ramaia9-nix-2.36.0pre20260918_09e24b6544         /nix/store/wyy2bq6c3rrvx6agdn3lgmzrrl958rxp-nix-2.36.0pre20260918_09e24b6-man545         /nix/store/yaif46chghmn7frwy8kp12ic4qqrlk1f-nix-2.36.0pre20260918_09e24b6-doc546error: Cannot build '/nix/store/m999jqkdlv91gg3hykc708acg4gr2p18-limine-install.json.drv'.547       Reason: 1 dependency failed.548       Output paths:549         /nix/store/gxg674j16wcb3yi40cxprqb4g3gsh3sp-limine-install.json550error: Cannot build '/nix/store/gb1v79bxrihsh39bxnmb8vf1nw4rznhf-nix.conf.drv'.551       Reason: 3 dependencies failed.552       Output paths:553         /nix/store/yzs4ab5x1hgsviimwhlr8mkfxzmx00a9-nix.conf554error: Cannot build '/nix/store/1hl5v882hlf9c6b0fy74kjr50hv7v105-nixos-option-26.11.drv'.555       Reason: 1 dependency failed.556       Output paths:557         /nix/store/rqh7cjyhf88rj5viv3gww02rhrwcqdda-nixos-option-26.11558error: Cannot build '/nix/store/5iv5crlkwdcnizv7j08pzb8xflml9kdn-nixos-rebuild-ng-26.11.drv'.559       Reason: 1 dependency failed.560       Output paths:561         /nix/store/bqw7ki7ik1nqhsk8118xljjhwl5c6j1c-nixos-rebuild-ng-26.11562         /nix/store/nq90kgwcrknycjzkmdpvsbb9dilqynpb-nixos-rebuild-ng-26.11-dist563error: Cannot build '/nix/store/2cg0yq1q10f1752qj8c730570brv709i-system-generators.drv'.564       Reason: 1 dependency failed.565       Output paths:566         /nix/store/j943nw6dfsxibypyhibzvzymv6zv013x-system-generators567error: Cannot build '/nix/store/xb9wg2kl2xqj0xy1jp4bf60wvjl6n879-system-shutdown.drv'.568       Reason: 1 dependency failed.569       Output paths:570         /nix/store/mcaqsmrgikdi0b93y5gcwk6lgjwxgnfq-system-shutdown571error: Cannot build '/nix/store/dnzqz0mw9sj6l2kaarmid6qdbab721ny-unit-harmonia-gc.service.drv'.572       Reason: 1 dependency failed.573       Output paths:574         /nix/store/0v9fh5ysndr0887c78dq887z7si0p2w0-unit-harmonia-gc.service575error: Cannot build '/nix/store/lvzmcqzhi0ywbdmkjjw17xz6m39ymils-unit-nix-optimise.service.drv'.576       Reason: 1 dependency failed.577       Output paths:578         /nix/store/szdlyb1193ak6glaxi0blj3pazaqmlr4-unit-nix-optimise.service579error: Cannot build '/nix/store/wp812r8idmqf5q1fgmz39riqh71xy2w0-unit-script-nix-gc-start.drv'.580       Reason: 1 dependency failed.581       Output paths:582         /nix/store/1xqy3x84izf1pqzprmr67xkd1kga2hm8-unit-script-nix-gc-start583error: Cannot build '/nix/store/f0avsx6fmz6njqk1lkh8rvmn9qmz0z00-unit-script-update-prefetch-start.drv'.584       Reason: 1 dependency failed.585       Output paths:586         /nix/store/adn0jyhb3cbrv1i4vvj9klnygld5yabh-unit-script-update-prefetch-start587error: Cannot build '/nix/store/l6q11d8fjyqmh5ly0vb4c0y7lvd3qgr4-user-generators.drv'.588       Reason: 1 dependency failed.589       Output paths:590         /nix/store/b7crrr4xh3ski4j6mb03i1613x4i8dm3-user-generators591error: Cannot build '/nix/store/cjavarxg55f6rv8h8jnf7f04j0zfnmsi-X-Restart-Triggers-nix-daemon.drv'.592       Reason: 1 dependency failed.593       Output paths:594         /nix/store/h7lakl773qaxa2bcc9g4yfdl28f4sb3y-X-Restart-Triggers-nix-daemon595error: Cannot build '/nix/store/ay1kqnl29ksqkkq5d520g6jm7nsk3bsm-limine-install.py.drv'.596       Reason: 1 dependency failed.597       Output paths:598         /nix/store/i5l8z2bc5hm7xwznvmc4x91a97xy11q8-limine-install.py599error: Cannot build '/nix/store/jh4cj3gwvqkgcmycciky1n6y5g48yjzl-unit-nix-gc.service.drv'.600       Reason: 1 dependency failed.601       Output paths:602         /nix/store/kqhbagfkf020i84a3wr9nx9kg7qznhrh-unit-nix-gc.service603error: Cannot build '/nix/store/3gnkqq36mjfvwf3rg440xjclnns3kkns-unit-update-prefetch.service.drv'.604       Reason: 1 dependency failed.605       Output paths:606         /nix/store/rlxcmazhv1clnqc632a7lw9q5afk9p62-unit-update-prefetch.service607error: Cannot build '/nix/store/vmi55glinyybsxaqfd7x7i6a6l1bl4n2-limine-install.sh.drv'.608       Reason: 1 dependency failed.609       Output paths:610         /nix/store/iiqgw31xbz3ixqb3x4xvabn0kh7wn6a7-limine-install.sh611error: Cannot build '/nix/store/zk546zwqyv88frqg61sz8hgy176q3gr7-unit-nix-daemon.service.drv'.612       Reason: 2 dependencies failed.613       Output paths:614         /nix/store/ayzk24yr60xwlib5ckiq65fzn2lpllcn-unit-nix-daemon.service