nixbot

builds

Mic92/dotfiles build #812 failed

branch main · PR #6023 · commit 0f4e6c8e2c · · took 11m 54s · eval 1m 36s

eval warnings 1 kind · 1 occurrence
  • warn A legacy Nextcloud install (from before NixOS 26.11) may be installed. ×1

21 failed ⚠ 1
failed attributes
status attribute duration
failed checks.x86_64-linux.nixos-eve
  • A legacy Nextcloud install (from before NixOS 26.11) may be installed. After nextcloud34 is installed successfully, you can safely upgrade to 35. The latest version available is Nextcloud35. Please note that Nextcloud doesn't support upgrades across multiple major versions (i.e. an upgrade from 16 is possible to 17, but not 16 to 18). The package can be upgraded by explicitly declaring the service-option `services.nextcloud.package`.
10m 33s
nix-store-2.36.0pre: FAILED: [code=1] libnixstore.so.2.36.0.p/meson-generated_nixstore-unity0.cpp.o g++ -Ilibnixstore.so.2.36.0.p -I. -I.. -Iinclude -I../inclu …
nix-store-2.36.0pre:
FAILED: [code=1] libnixstore.so.2.36.0.p/meson-generated_nixstore-unity0.cpp.o 
g++ -Ilibnixstore.so.2.36.0.p -I. -I.. -Iinclude -I../include -I../linux/build -Ilinux/include -I../linux/include -I../unix/build -Iunix/include -I../unix/include -I/nix/store/9qkab5ic665a2g3idxk04dazfb4kd74g-nix-util-2.36.0pre-dev/include -I/nix/store/2ybid2fqf6nfqrwcgizv9qvvckyp6axh-libarchive-3.8.9-dev/include -I/nix/store/0dz9bi5rv50d46w8xykwdxrj4ssy6pnp-nlohmann_json-3.12.0/include -I/nix/store/aph5dkajglxjn9642bp0h3x7cwzijr52-curl-8.22.0-dev/include -I/nix/store/q2yrf8yhmj405nv9qbbraxr8wlz7n5kv-libseccomp-2.6.1-dev/include -I/nix/store/xrcjl59yi7zswbv0vzm8cmvw4vplsbgj-sqlite-3.53.3-dev/include -I/nix/store/2zgasbvd9mzmj145mxsmnzxiy7rnz…
In file included from libnixstore.so.2.36.0.p/nixstore-unity0.cpp:6:
/build/source/src/libstore/build/derivation-building-goal.cc: In member function 'nix::Goal::Co<std::variant<std::variant<nix::BuildResult::Success, nix::BuildError>, nix::DerivationBuildingGoal::NeedsSlot> > nix::DerivationBuildingGoal::buildLocally(LocalBuildCapability, const nix::StorePathSet&, std::map<std::__cxx11::basic_string<char>, nix::InitialOutput>&, nix::DerivationOptions<nix::StorePath>&, nix::PathLocks)':
/build/source/src/libstore/build/derivation-building-goal.cc:1098:27: error: await expressions are not permitted in handlers
 1098 |                 co_return co_await buildLocally(
      |                           ^~~~~~~~
ninja: build stopped: subcommand failed.
failed checks.aarch64-darwin.darwin-evo 42s
nix-store-2.36.0pre: ../include/nix/store/sqlite.hh:173:16: warning: private field 'extendedErrNo' is not used [-Wunused-private-field] 173 | int errNo, e …
nix-store-2.36.0pre:
../include/nix/store/sqlite.hh:173:16: warning: private field 'extendedErrNo' is not used [-Wunused-private-field]
  173 |     int errNo, extendedErrNo, offset;
      |                ^
../include/nix/store/sqlite.hh:173:31: warning: private field 'offset' is not used [-Wunused-private-field]
  173 |     int errNo, extendedErrNo, offset;
      |                               ^
3 warnings and 1 error generated.
ninja: build stopped: subcommand failed.
failed checks.aarch64-darwin.home-manager-common 28s
nix-store-2.36.0pre: ../include/nix/store/sqlite.hh:173:16: warning: private field 'extendedErrNo' is not used [-Wunused-private-field] 173 | int errNo, e …
nix-store-2.36.0pre:
../include/nix/store/sqlite.hh:173:16: warning: private field 'extendedErrNo' is not used [-Wunused-private-field]
  173 |     int errNo, extendedErrNo, offset;
      |                ^
../include/nix/store/sqlite.hh:173:31: warning: private field 'offset' is not used [-Wunused-private-field]
  173 |     int errNo, extendedErrNo, offset;
      |                               ^
3 warnings and 1 error generated.
ninja: build stopped: subcommand failed.
failed checks.aarch64-darwin.home-manager-macos 57s
tuicr-0.27.0: patching file src/config/mod.rs Hunk #1 FAILED at 134. Hunk #2 succeeded at 264 with fuzz 2 (offset 56 lines). Hunk #3 FAILED at 454. Hunk #4 succ …
tuicr-0.27.0:
patching file src/config/mod.rs
Hunk #1 FAILED at 134.
Hunk #2 succeeded at 264 with fuzz 2 (offset 56 lines).
Hunk #3 FAILED at 454.
Hunk #4 succeeded at 1280 (offset 162 lines).
2 out of 4 hunks FAILED -- saving rejects to file src/config/mod.rs.rej
patching file src/main.rs
Hunk #1 succeeded at 400 (offset 15 lines).

nix-store-2.36.0pre:
../include/nix/store/sqlite.hh:173:16: warning: private field 'extendedErrNo' is not used [-Wunused-private-field]
  173 |     int errNo, extendedErrNo, offset;
      |                ^
../include/nix/store/sqlite.hh:173:31: warning: private field 'offset' is not used [-Wunused-private-field]
  173 |     int errNo, extendedErrNo, offset;
      |                               ^
3 warnings and 1 error generated.
ninja: build stopped: subcommand failed.
failed checks.aarch64-darwin.home-manager-utm-vm 1m 13s
tuicr-0.27.0: patching file src/config/mod.rs Hunk #1 FAILED at 134. Hunk #2 succeeded at 264 with fuzz 2 (offset 56 lines). Hunk #3 FAILED at 454. Hunk #4 succ …
tuicr-0.27.0:
patching file src/config/mod.rs
Hunk #1 FAILED at 134.
Hunk #2 succeeded at 264 with fuzz 2 (offset 56 lines).
Hunk #3 FAILED at 454.
Hunk #4 succeeded at 1280 (offset 162 lines).
2 out of 4 hunks FAILED -- saving rejects to file src/config/mod.rs.rej
patching file src/main.rs
Hunk #1 succeeded at 400 (offset 15 lines).

nix-store-2.36.0pre:
../include/nix/store/sqlite.hh:173:16: warning: private field 'extendedErrNo' is not used [-Wunused-private-field]
  173 |     int errNo, extendedErrNo, offset;
      |                ^
../include/nix/store/sqlite.hh:173:31: warning: private field 'offset' is not used [-Wunused-private-field]
  173 |     int errNo, extendedErrNo, offset;
      |                               ^
3 warnings and 1 error generated.
ninja: build stopped: subcommand failed.
failed checks.aarch64-linux.home-manager-common 7m 44s
nix-store-2.36.0pre: FAILED: [code=1] libnixstore.so.2.36.0.p/meson-generated_nixstore-unity0.cpp.o g++ -Ilibnixstore.so.2.36.0.p -I. -I.. -Iinclude -I../inclu …
nix-store-2.36.0pre:
FAILED: [code=1] libnixstore.so.2.36.0.p/meson-generated_nixstore-unity0.cpp.o 
g++ -Ilibnixstore.so.2.36.0.p -I. -I.. -Iinclude -I../include -I../linux/build -Ilinux/include -I../linux/include -I../unix/build -Iunix/include -I../unix/include -I/nix/store/dm1hddnph8h122y12ix0i3a1ah1is93f-nix-util-2.36.0pre-dev/include -I/nix/store/vyh87fnmi02f9fmfb9isyh88fcwqwbx2-libarchive-3.8.9-dev/include -I/nix/store/n2wqh700746f46rkcx78ig3wrz34znky-nlohmann_json-3.12.0/include -I/nix/store/l54xxyh3havpk0qwr0pdz4cdn0vrhjv3-curl-8.22.0-dev/include -I/nix/store/psmxcw2g7rilz53xa189fxzl7y1i485k-libseccomp-2.6.1-dev/include -I/nix/store/74r7ps7mmjw10fl23xsgcp7ss09jrkjr-sqlite-3.53.3-dev/include -I/nix/store/067660n0flakidqdninb6l8r6xmi7…
In file included from libnixstore.so.2.36.0.p/nixstore-unity0.cpp:6:
/build/source/src/libstore/build/derivation-building-goal.cc: In member function 'nix::Goal::Co<std::variant<std::variant<nix::BuildResult::Success, nix::BuildError>, nix::DerivationBuildingGoal::NeedsSlot> > nix::DerivationBuildingGoal::buildLocally(LocalBuildCapability, const nix::StorePathSet&, std::map<std::__cxx11::basic_string<char>, nix::InitialOutput>&, nix::DerivationOptions<nix::StorePath>&, nix::PathLocks)':
/build/source/src/libstore/build/derivation-building-goal.cc:1098:27: error: await expressions are not permitted in handlers
 1098 |                 co_return co_await buildLocally(
      |                           ^~~~~~~~
ninja: build stopped: subcommand failed.
failed checks.aarch64-linux.home-manager-utm-vm 6m 19s
tuicr-0.27.0: patching file src/config/mod.rs Hunk #1 FAILED at 134. Hunk #2 succeeded at 264 with fuzz 2 (offset 56 lines). Hunk #3 FAILED at 454. Hunk #4 succ …
tuicr-0.27.0:
patching file src/config/mod.rs
Hunk #1 FAILED at 134.
Hunk #2 succeeded at 264 with fuzz 2 (offset 56 lines).
Hunk #3 FAILED at 454.
Hunk #4 succeeded at 1280 (offset 162 lines).
2 out of 4 hunks FAILED -- saving rejects to file src/config/mod.rs.rej
patching file src/main.rs
Hunk #1 succeeded at 400 (offset 15 lines).

nix-store-2.36.0pre:
FAILED: [code=1] libnixstore.so.2.36.0.p/meson-generated_nixstore-unity0.cpp.o 
g++ -Ilibnixstore.so.2.36.0.p -I. -I.. -Iinclude -I../include -I../linux/build -Ilinux/include -I../linux/include -I../unix/build -Iunix/include -I../unix/include -I/nix/store/dm1hddnph8h122y12ix0i3a1ah1is93f-nix-util-2.36.0pre-dev/include -I/nix/store/vyh87fnmi02f9fmfb9isyh88fcwqwbx2-libarchive-3.8.9-dev/include -I/nix/store/n2wqh700746f46rkcx78ig3wrz34znky-nlohmann_json-3.12.0/include -I/nix/store/l54xxyh3havpk0qwr0pdz4cdn0vrhjv3-curl-8.22.0-dev/include -I/nix/store/psmxcw2g7rilz53xa189fxzl7y1i485k-libseccomp-2.6.1-dev/include -I/nix/store/74r7ps7mmjw10fl23xsgcp7ss09jrkjr-sqlite-3.53.3-dev/include -I/nix/store/067660n0flakidqdninb6l8r6xmi7…
In file included from libnixstore.so.2.36.0.p/nixstore-unity0.cpp:6:
/build/source/src/libstore/build/derivation-building-goal.cc: In member function 'nix::Goal::Co<std::variant<std::variant<nix::BuildResult::Success, nix::BuildError>, nix::DerivationBuildingGoal::NeedsSlot> > nix::DerivationBuildingGoal::buildLocally(LocalBuildCapability, const nix::StorePathSet&, std::map<std::__cxx11::basic_string<char>, nix::InitialOutput>&, nix::DerivationOptions<nix::StorePath>&, nix::PathLocks)':
/build/source/src/libstore/build/derivation-building-goal.cc:1098:27: error: await expressions are not permitted in handlers
 1098 |                 co_return co_await buildLocally(
      |                           ^~~~~~~~
ninja: build stopped: subcommand failed.
failed checks.aarch64-linux.nixos-blob64 8m 15s
nix-store-2.36.0pre: FAILED: [code=1] libnixstore.so.2.36.0.p/meson-generated_nixstore-unity0.cpp.o g++ -Ilibnixstore.so.2.36.0.p -I. -I.. -Iinclude -I../inclu …
nix-store-2.36.0pre:
FAILED: [code=1] libnixstore.so.2.36.0.p/meson-generated_nixstore-unity0.cpp.o 
g++ -Ilibnixstore.so.2.36.0.p -I. -I.. -Iinclude -I../include -I../linux/build -Ilinux/include -I../linux/include -I../unix/build -Iunix/include -I../unix/include -I/nix/store/dm1hddnph8h122y12ix0i3a1ah1is93f-nix-util-2.36.0pre-dev/include -I/nix/store/vyh87fnmi02f9fmfb9isyh88fcwqwbx2-libarchive-3.8.9-dev/include -I/nix/store/n2wqh700746f46rkcx78ig3wrz34znky-nlohmann_json-3.12.0/include -I/nix/store/l54xxyh3havpk0qwr0pdz4cdn0vrhjv3-curl-8.22.0-dev/include -I/nix/store/psmxcw2g7rilz53xa189fxzl7y1i485k-libseccomp-2.6.1-dev/include -I/nix/store/74r7ps7mmjw10fl23xsgcp7ss09jrkjr-sqlite-3.53.3-dev/include -I/nix/store/067660n0flakidqdninb6l8r6xmi7…
In file included from libnixstore.so.2.36.0.p/nixstore-unity0.cpp:6:
/build/source/src/libstore/build/derivation-building-goal.cc: In member function 'nix::Goal::Co<std::variant<std::variant<nix::BuildResult::Success, nix::BuildError>, nix::DerivationBuildingGoal::NeedsSlot> > nix::DerivationBuildingGoal::buildLocally(LocalBuildCapability, const nix::StorePathSet&, std::map<std::__cxx11::basic_string<char>, nix::InitialOutput>&, nix::DerivationOptions<nix::StorePath>&, nix::PathLocks)':
/build/source/src/libstore/build/derivation-building-goal.cc:1098:27: error: await expressions are not permitted in handlers
 1098 |                 co_return co_await buildLocally(
      |                           ^~~~~~~~
ninja: build stopped: subcommand failed.
failed checks.x86_64-linux.home-manager-bernie 7m 13s
nix-store-2.36.0pre: FAILED: [code=1] libnixstore.so.2.36.0.p/meson-generated_nixstore-unity0.cpp.o g++ -Ilibnixstore.so.2.36.0.p -I. -I.. -Iinclude -I../inclu …
nix-store-2.36.0pre:
FAILED: [code=1] libnixstore.so.2.36.0.p/meson-generated_nixstore-unity0.cpp.o 
g++ -Ilibnixstore.so.2.36.0.p -I. -I.. -Iinclude -I../include -I../linux/build -Ilinux/include -I../linux/include -I../unix/build -Iunix/include -I../unix/include -I/nix/store/9qkab5ic665a2g3idxk04dazfb4kd74g-nix-util-2.36.0pre-dev/include -I/nix/store/2ybid2fqf6nfqrwcgizv9qvvckyp6axh-libarchive-3.8.9-dev/include -I/nix/store/0dz9bi5rv50d46w8xykwdxrj4ssy6pnp-nlohmann_json-3.12.0/include -I/nix/store/aph5dkajglxjn9642bp0h3x7cwzijr52-curl-8.22.0-dev/include -I/nix/store/q2yrf8yhmj405nv9qbbraxr8wlz7n5kv-libseccomp-2.6.1-dev/include -I/nix/store/xrcjl59yi7zswbv0vzm8cmvw4vplsbgj-sqlite-3.53.3-dev/include -I/nix/store/2zgasbvd9mzmj145mxsmnzxiy7rnz…
In file included from libnixstore.so.2.36.0.p/nixstore-unity0.cpp:6:
/build/source/src/libstore/build/derivation-building-goal.cc: In member function 'nix::Goal::Co<std::variant<std::variant<nix::BuildResult::Success, nix::BuildError>, nix::DerivationBuildingGoal::NeedsSlot> > nix::DerivationBuildingGoal::buildLocally(LocalBuildCapability, const nix::StorePathSet&, std::map<std::__cxx11::basic_string<char>, nix::InitialOutput>&, nix::DerivationOptions<nix::StorePath>&, nix::PathLocks)':
/build/source/src/libstore/build/derivation-building-goal.cc:1098:27: error: await expressions are not permitted in handlers
 1098 |                 co_return co_await buildLocally(
      |                           ^~~~~~~~
ninja: build stopped: subcommand failed.
failed checks.x86_64-linux.home-manager-coder 1m 49s
tuicr-0.27.0: patching file src/config/mod.rs Hunk #1 FAILED at 134. Hunk #2 succeeded at 264 with fuzz 2 (offset 56 lines). Hunk #3 FAILED at 454. Hunk #4 succ …
tuicr-0.27.0:
patching file src/config/mod.rs
Hunk #1 FAILED at 134.
Hunk #2 succeeded at 264 with fuzz 2 (offset 56 lines).
Hunk #3 FAILED at 454.
Hunk #4 succeeded at 1280 (offset 162 lines).
2 out of 4 hunks FAILED -- saving rejects to file src/config/mod.rs.rej
patching file src/main.rs
Hunk #1 succeeded at 400 (offset 15 lines).

nix-store-2.36.0pre:
FAILED: [code=1] libnixstore.so.2.36.0.p/meson-generated_nixstore-unity0.cpp.o 
g++ -Ilibnixstore.so.2.36.0.p -I. -I.. -Iinclude -I../include -I../linux/build -Ilinux/include -I../linux/include -I../unix/build -Iunix/include -I../unix/include -I/nix/store/9qkab5ic665a2g3idxk04dazfb4kd74g-nix-util-2.36.0pre-dev/include -I/nix/store/2ybid2fqf6nfqrwcgizv9qvvckyp6axh-libarchive-3.8.9-dev/include -I/nix/store/0dz9bi5rv50d46w8xykwdxrj4ssy6pnp-nlohmann_json-3.12.0/include -I/nix/store/aph5dkajglxjn9642bp0h3x7cwzijr52-curl-8.22.0-dev/include -I/nix/store/q2yrf8yhmj405nv9qbbraxr8wlz7n5kv-libseccomp-2.6.1-dev/include -I/nix/store/xrcjl59yi7zswbv0vzm8cmvw4vplsbgj-sqlite-3.53.3-dev/include -I/nix/store/2zgasbvd9mzmj145mxsmnzxiy7rnz…
In file included from libnixstore.so.2.36.0.p/nixstore-unity0.cpp:6:
/build/source/src/libstore/build/derivation-building-goal.cc: In member function 'nix::Goal::Co<std::variant<std::variant<nix::BuildResult::Success, nix::BuildError>, nix::DerivationBuildingGoal::NeedsSlot> > nix::DerivationBuildingGoal::buildLocally(LocalBuildCapability, const nix::StorePathSet&, std::map<std::__cxx11::basic_string<char>, nix::InitialOutput>&, nix::DerivationOptions<nix::StorePath>&, nix::PathLocks)':
/build/source/src/libstore/build/derivation-building-goal.cc:1098:27: error: await expressions are not permitted in handlers
 1098 |                 co_return co_await buildLocally(
      |                           ^~~~~~~~
ninja: build stopped: subcommand failed.
failed checks.x86_64-linux.home-manager-common 6m 38s
nix-store-2.36.0pre: FAILED: [code=1] libnixstore.so.2.36.0.p/meson-generated_nixstore-unity0.cpp.o g++ -Ilibnixstore.so.2.36.0.p -I. -I.. -Iinclude -I../inclu …
nix-store-2.36.0pre:
FAILED: [code=1] libnixstore.so.2.36.0.p/meson-generated_nixstore-unity0.cpp.o 
g++ -Ilibnixstore.so.2.36.0.p -I. -I.. -Iinclude -I../include -I../linux/build -Ilinux/include -I../linux/include -I../unix/build -Iunix/include -I../unix/include -I/nix/store/9qkab5ic665a2g3idxk04dazfb4kd74g-nix-util-2.36.0pre-dev/include -I/nix/store/2ybid2fqf6nfqrwcgizv9qvvckyp6axh-libarchive-3.8.9-dev/include -I/nix/store/0dz9bi5rv50d46w8xykwdxrj4ssy6pnp-nlohmann_json-3.12.0/include -I/nix/store/aph5dkajglxjn9642bp0h3x7cwzijr52-curl-8.22.0-dev/include -I/nix/store/q2yrf8yhmj405nv9qbbraxr8wlz7n5kv-libseccomp-2.6.1-dev/include -I/nix/store/xrcjl59yi7zswbv0vzm8cmvw4vplsbgj-sqlite-3.53.3-dev/include -I/nix/store/2zgasbvd9mzmj145mxsmnzxiy7rnz…
In file included from libnixstore.so.2.36.0.p/nixstore-unity0.cpp:6:
/build/source/src/libstore/build/derivation-building-goal.cc: In member function 'nix::Goal::Co<std::variant<std::variant<nix::BuildResult::Success, nix::BuildError>, nix::DerivationBuildingGoal::NeedsSlot> > nix::DerivationBuildingGoal::buildLocally(LocalBuildCapability, const nix::StorePathSet&, std::map<std::__cxx11::basic_string<char>, nix::InitialOutput>&, nix::DerivationOptions<nix::StorePath>&, nix::PathLocks)':
/build/source/src/libstore/build/derivation-building-goal.cc:1098:27: error: await expressions are not permitted in handlers
 1098 |                 co_return co_await buildLocally(
      |                           ^~~~~~~~
ninja: build stopped: subcommand failed.
failed checks.x86_64-linux.home-manager-desktop 9m 22s
tuicr-0.27.0: patching file src/config/mod.rs Hunk #1 FAILED at 134. Hunk #2 succeeded at 264 with fuzz 2 (offset 56 lines). Hunk #3 FAILED at 454. Hunk #4 succ …
tuicr-0.27.0:
patching file src/config/mod.rs
Hunk #1 FAILED at 134.
Hunk #2 succeeded at 264 with fuzz 2 (offset 56 lines).
Hunk #3 FAILED at 454.
Hunk #4 succeeded at 1280 (offset 162 lines).
2 out of 4 hunks FAILED -- saving rejects to file src/config/mod.rs.rej
patching file src/main.rs
Hunk #1 succeeded at 400 (offset 15 lines).

nix-store-2.36.0pre:
FAILED: [code=1] libnixstore.so.2.36.0.p/meson-generated_nixstore-unity0.cpp.o 
g++ -Ilibnixstore.so.2.36.0.p -I. -I.. -Iinclude -I../include -I../linux/build -Ilinux/include -I../linux/include -I../unix/build -Iunix/include -I../unix/include -I/nix/store/9qkab5ic665a2g3idxk04dazfb4kd74g-nix-util-2.36.0pre-dev/include -I/nix/store/2ybid2fqf6nfqrwcgizv9qvvckyp6axh-libarchive-3.8.9-dev/include -I/nix/store/0dz9bi5rv50d46w8xykwdxrj4ssy6pnp-nlohmann_json-3.12.0/include -I/nix/store/aph5dkajglxjn9642bp0h3x7cwzijr52-curl-8.22.0-dev/include -I/nix/store/q2yrf8yhmj405nv9qbbraxr8wlz7n5kv-libseccomp-2.6.1-dev/include -I/nix/store/xrcjl59yi7zswbv0vzm8cmvw4vplsbgj-sqlite-3.53.3-dev/include -I/nix/store/2zgasbvd9mzmj145mxsmnzxiy7rnz…
In file included from libnixstore.so.2.36.0.p/nixstore-unity0.cpp:6:
/build/source/src/libstore/build/derivation-building-goal.cc: In member function 'nix::Goal::Co<std::variant<std::variant<nix::BuildResult::Success, nix::BuildError>, nix::DerivationBuildingGoal::NeedsSlot> > nix::DerivationBuildingGoal::buildLocally(LocalBuildCapability, const nix::StorePathSet&, std::map<std::__cxx11::basic_string<char>, nix::InitialOutput>&, nix::DerivationOptions<nix::StorePath>&, nix::PathLocks)':
/build/source/src/libstore/build/derivation-building-goal.cc:1098:27: error: await expressions are not permitted in handlers
 1098 |                 co_return co_await buildLocally(
      |                           ^~~~~~~~
ninja: build stopped: subcommand failed.
failed checks.x86_64-linux.home-manager-eve 6m 1s
tuicr-0.27.0: patching file src/config/mod.rs Hunk #1 FAILED at 134. Hunk #2 succeeded at 264 with fuzz 2 (offset 56 lines). Hunk #3 FAILED at 454. Hunk #4 succ …
tuicr-0.27.0:
patching file src/config/mod.rs
Hunk #1 FAILED at 134.
Hunk #2 succeeded at 264 with fuzz 2 (offset 56 lines).
Hunk #3 FAILED at 454.
Hunk #4 succeeded at 1280 (offset 162 lines).
2 out of 4 hunks FAILED -- saving rejects to file src/config/mod.rs.rej
patching file src/main.rs
Hunk #1 succeeded at 400 (offset 15 lines).

nix-store-2.36.0pre:
FAILED: [code=1] libnixstore.so.2.36.0.p/meson-generated_nixstore-unity0.cpp.o 
g++ -Ilibnixstore.so.2.36.0.p -I. -I.. -Iinclude -I../include -I../linux/build -Ilinux/include -I../linux/include -I../unix/build -Iunix/include -I../unix/include -I/nix/store/9qkab5ic665a2g3idxk04dazfb4kd74g-nix-util-2.36.0pre-dev/include -I/nix/store/2ybid2fqf6nfqrwcgizv9qvvckyp6axh-libarchive-3.8.9-dev/include -I/nix/store/0dz9bi5rv50d46w8xykwdxrj4ssy6pnp-nlohmann_json-3.12.0/include -I/nix/store/aph5dkajglxjn9642bp0h3x7cwzijr52-curl-8.22.0-dev/include -I/nix/store/q2yrf8yhmj405nv9qbbraxr8wlz7n5kv-libseccomp-2.6.1-dev/include -I/nix/store/xrcjl59yi7zswbv0vzm8cmvw4vplsbgj-sqlite-3.53.3-dev/include -I/nix/store/2zgasbvd9mzmj145mxsmnzxiy7rnz…
In file included from libnixstore.so.2.36.0.p/nixstore-unity0.cpp:6:
/build/source/src/libstore/build/derivation-building-goal.cc: In member function 'nix::Goal::Co<std::variant<std::variant<nix::BuildResult::Success, nix::BuildError>, nix::DerivationBuildingGoal::NeedsSlot> > nix::DerivationBuildingGoal::buildLocally(LocalBuildCapability, const nix::StorePathSet&, std::map<std::__cxx11::basic_string<char>, nix::InitialOutput>&, nix::DerivationOptions<nix::StorePath>&, nix::PathLocks)':
/build/source/src/libstore/build/derivation-building-goal.cc:1098:27: error: await expressions are not permitted in handlers
 1098 |                 co_return co_await buildLocally(
      |                           ^~~~~~~~
ninja: build stopped: subcommand failed.
failed checks.x86_64-linux.home-manager-mic92 2m 22s
nix-store-2.36.0pre: FAILED: [code=1] libnixstore.so.2.36.0.p/meson-generated_nixstore-unity0.cpp.o g++ -Ilibnixstore.so.2.36.0.p -I. -I.. -Iinclude -I../inclu …
nix-store-2.36.0pre:
FAILED: [code=1] libnixstore.so.2.36.0.p/meson-generated_nixstore-unity0.cpp.o 
g++ -Ilibnixstore.so.2.36.0.p -I. -I.. -Iinclude -I../include -I../linux/build -Ilinux/include -I../linux/include -I../unix/build -Iunix/include -I../unix/include -I/nix/store/9qkab5ic665a2g3idxk04dazfb4kd74g-nix-util-2.36.0pre-dev/include -I/nix/store/2ybid2fqf6nfqrwcgizv9qvvckyp6axh-libarchive-3.8.9-dev/include -I/nix/store/0dz9bi5rv50d46w8xykwdxrj4ssy6pnp-nlohmann_json-3.12.0/include -I/nix/store/aph5dkajglxjn9642bp0h3x7cwzijr52-curl-8.22.0-dev/include -I/nix/store/q2yrf8yhmj405nv9qbbraxr8wlz7n5kv-libseccomp-2.6.1-dev/include -I/nix/store/xrcjl59yi7zswbv0vzm8cmvw4vplsbgj-sqlite-3.53.3-dev/include -I/nix/store/2zgasbvd9mzmj145mxsmnzxiy7rnz…
In file included from libnixstore.so.2.36.0.p/nixstore-unity0.cpp:6:
/build/source/src/libstore/build/derivation-building-goal.cc: In member function 'nix::Goal::Co<std::variant<std::variant<nix::BuildResult::Success, nix::BuildError>, nix::DerivationBuildingGoal::NeedsSlot> > nix::DerivationBuildingGoal::buildLocally(LocalBuildCapability, const nix::StorePathSet&, std::map<std::__cxx11::basic_string<char>, nix::InitialOutput>&, nix::DerivationOptions<nix::StorePath>&, nix::PathLocks)':
/build/source/src/libstore/build/derivation-building-goal.cc:1098:27: error: await expressions are not permitted in handlers
 1098 |                 co_return co_await buildLocally(
      |                           ^~~~~~~~
ninja: build stopped: subcommand failed.
failed checks.x86_64-linux.home-manager-utm-vm 2m 42s
tuicr-0.27.0: patching file src/config/mod.rs Hunk #1 FAILED at 134. Hunk #2 succeeded at 264 with fuzz 2 (offset 56 lines). Hunk #3 FAILED at 454. Hunk #4 succ …
tuicr-0.27.0:
patching file src/config/mod.rs
Hunk #1 FAILED at 134.
Hunk #2 succeeded at 264 with fuzz 2 (offset 56 lines).
Hunk #3 FAILED at 454.
Hunk #4 succeeded at 1280 (offset 162 lines).
2 out of 4 hunks FAILED -- saving rejects to file src/config/mod.rs.rej
patching file src/main.rs
Hunk #1 succeeded at 400 (offset 15 lines).

nix-store-2.36.0pre:
FAILED: [code=1] libnixstore.so.2.36.0.p/meson-generated_nixstore-unity0.cpp.o 
g++ -Ilibnixstore.so.2.36.0.p -I. -I.. -Iinclude -I../include -I../linux/build -Ilinux/include -I../linux/include -I../unix/build -Iunix/include -I../unix/include -I/nix/store/9qkab5ic665a2g3idxk04dazfb4kd74g-nix-util-2.36.0pre-dev/include -I/nix/store/2ybid2fqf6nfqrwcgizv9qvvckyp6axh-libarchive-3.8.9-dev/include -I/nix/store/0dz9bi5rv50d46w8xykwdxrj4ssy6pnp-nlohmann_json-3.12.0/include -I/nix/store/aph5dkajglxjn9642bp0h3x7cwzijr52-curl-8.22.0-dev/include -I/nix/store/q2yrf8yhmj405nv9qbbraxr8wlz7n5kv-libseccomp-2.6.1-dev/include -I/nix/store/xrcjl59yi7zswbv0vzm8cmvw4vplsbgj-sqlite-3.53.3-dev/include -I/nix/store/2zgasbvd9mzmj145mxsmnzxiy7rnz…
In file included from libnixstore.so.2.36.0.p/nixstore-unity0.cpp:6:
/build/source/src/libstore/build/derivation-building-goal.cc: In member function 'nix::Goal::Co<std::variant<std::variant<nix::BuildResult::Success, nix::BuildError>, nix::DerivationBuildingGoal::NeedsSlot> > nix::DerivationBuildingGoal::buildLocally(LocalBuildCapability, const nix::StorePathSet&, std::map<std::__cxx11::basic_string<char>, nix::InitialOutput>&, nix::DerivationOptions<nix::StorePath>&, nix::PathLocks)':
/build/source/src/libstore/build/derivation-building-goal.cc:1098:27: error: await expressions are not permitted in handlers
 1098 |                 co_return co_await buildLocally(
      |                           ^~~~~~~~
ninja: build stopped: subcommand failed.
failed checks.x86_64-linux.nixos-bernie 3m 10s
nix-store-2.36.0pre: FAILED: [code=1] libnixstore.so.2.36.0.p/meson-generated_nixstore-unity0.cpp.o g++ -Ilibnixstore.so.2.36.0.p -I. -I.. -Iinclude -I../inclu …
nix-store-2.36.0pre:
FAILED: [code=1] libnixstore.so.2.36.0.p/meson-generated_nixstore-unity0.cpp.o 
g++ -Ilibnixstore.so.2.36.0.p -I. -I.. -Iinclude -I../include -I../linux/build -Ilinux/include -I../linux/include -I../unix/build -Iunix/include -I../unix/include -I/nix/store/9qkab5ic665a2g3idxk04dazfb4kd74g-nix-util-2.36.0pre-dev/include -I/nix/store/2ybid2fqf6nfqrwcgizv9qvvckyp6axh-libarchive-3.8.9-dev/include -I/nix/store/0dz9bi5rv50d46w8xykwdxrj4ssy6pnp-nlohmann_json-3.12.0/include -I/nix/store/aph5dkajglxjn9642bp0h3x7cwzijr52-curl-8.22.0-dev/include -I/nix/store/q2yrf8yhmj405nv9qbbraxr8wlz7n5kv-libseccomp-2.6.1-dev/include -I/nix/store/xrcjl59yi7zswbv0vzm8cmvw4vplsbgj-sqlite-3.53.3-dev/include -I/nix/store/2zgasbvd9mzmj145mxsmnzxiy7rnz…
In file included from libnixstore.so.2.36.0.p/nixstore-unity0.cpp:6:
/build/source/src/libstore/build/derivation-building-goal.cc: In member function 'nix::Goal::Co<std::variant<std::variant<nix::BuildResult::Success, nix::BuildError>, nix::DerivationBuildingGoal::NeedsSlot> > nix::DerivationBuildingGoal::buildLocally(LocalBuildCapability, const nix::StorePathSet&, std::map<std::__cxx11::basic_string<char>, nix::InitialOutput>&, nix::DerivationOptions<nix::StorePath>&, nix::PathLocks)':
/build/source/src/libstore/build/derivation-building-goal.cc:1098:27: error: await expressions are not permitted in handlers
 1098 |                 co_return co_await buildLocally(
      |                           ^~~~~~~~
ninja: build stopped: subcommand failed.
failed checks.x86_64-linux.nixos-dorits-laptop 9m 52s
nix-store-2.36.0pre: tribuchet: submitting build: code: 'The system is not in a state required for the operation's execution', message: "an output path is part …
nix-store-2.36.0pre:
tribuchet: submitting build: code: 'The system is not in a state required for the operation's execution', message: "an output path is part of a different in-flight build"
failed checks.x86_64-linux.nixos-eva 55s
nix-store-2.36.0pre: FAILED: [code=1] libnixstore.so.2.36.0.p/meson-generated_nixstore-unity0.cpp.o g++ -Ilibnixstore.so.2.36.0.p -I. -I.. -Iinclude -I../inclu …
nix-store-2.36.0pre:
FAILED: [code=1] libnixstore.so.2.36.0.p/meson-generated_nixstore-unity0.cpp.o 
g++ -Ilibnixstore.so.2.36.0.p -I. -I.. -Iinclude -I../include -I../linux/build -Ilinux/include -I../linux/include -I../unix/build -Iunix/include -I../unix/include -I/nix/store/dm1hddnph8h122y12ix0i3a1ah1is93f-nix-util-2.36.0pre-dev/include -I/nix/store/vyh87fnmi02f9fmfb9isyh88fcwqwbx2-libarchive-3.8.9-dev/include -I/nix/store/n2wqh700746f46rkcx78ig3wrz34znky-nlohmann_json-3.12.0/include -I/nix/store/l54xxyh3havpk0qwr0pdz4cdn0vrhjv3-curl-8.22.0-dev/include -I/nix/store/psmxcw2g7rilz53xa189fxzl7y1i485k-libseccomp-2.6.1-dev/include -I/nix/store/74r7ps7mmjw10fl23xsgcp7ss09jrkjr-sqlite-3.53.3-dev/include -I/nix/store/067660n0flakidqdninb6l8r6xmi7…
In file included from libnixstore.so.2.36.0.p/nixstore-unity0.cpp:6:
/build/source/src/libstore/build/derivation-building-goal.cc: In member function 'nix::Goal::Co<std::variant<std::variant<nix::BuildResult::Success, nix::BuildError>, nix::DerivationBuildingGoal::NeedsSlot> > nix::DerivationBuildingGoal::buildLocally(LocalBuildCapability, const nix::StorePathSet&, std::map<std::__cxx11::basic_string<char>, nix::InitialOutput>&, nix::DerivationOptions<nix::StorePath>&, nix::PathLocks)':
/build/source/src/libstore/build/derivation-building-goal.cc:1098:27: error: await expressions are not permitted in handlers
 1098 |                 co_return co_await buildLocally(
      |                           ^~~~~~~~
ninja: build stopped: subcommand failed.
failed checks.x86_64-linux.nixos-jacquardmachine 4m 45s
nix-store-2.36.0pre: FAILED: [code=1] libnixstore.so.2.36.0.p/meson-generated_nixstore-unity0.cpp.o g++ -Ilibnixstore.so.2.36.0.p -I. -I.. -Iinclude -I../inclu …
nix-store-2.36.0pre:
FAILED: [code=1] libnixstore.so.2.36.0.p/meson-generated_nixstore-unity0.cpp.o 
g++ -Ilibnixstore.so.2.36.0.p -I. -I.. -Iinclude -I../include -I../linux/build -Ilinux/include -I../linux/include -I../unix/build -Iunix/include -I../unix/include -I/nix/store/9qkab5ic665a2g3idxk04dazfb4kd74g-nix-util-2.36.0pre-dev/include -I/nix/store/2ybid2fqf6nfqrwcgizv9qvvckyp6axh-libarchive-3.8.9-dev/include -I/nix/store/0dz9bi5rv50d46w8xykwdxrj4ssy6pnp-nlohmann_json-3.12.0/include -I/nix/store/aph5dkajglxjn9642bp0h3x7cwzijr52-curl-8.22.0-dev/include -I/nix/store/q2yrf8yhmj405nv9qbbraxr8wlz7n5kv-libseccomp-2.6.1-dev/include -I/nix/store/xrcjl59yi7zswbv0vzm8cmvw4vplsbgj-sqlite-3.53.3-dev/include -I/nix/store/2zgasbvd9mzmj145mxsmnzxiy7rnz…
In file included from libnixstore.so.2.36.0.p/nixstore-unity0.cpp:6:
/build/source/src/libstore/build/derivation-building-goal.cc: In member function 'nix::Goal::Co<std::variant<std::variant<nix::BuildResult::Success, nix::BuildError>, nix::DerivationBuildingGoal::NeedsSlot> > nix::DerivationBuildingGoal::buildLocally(LocalBuildCapability, const nix::StorePathSet&, std::map<std::__cxx11::basic_string<char>, nix::InitialOutput>&, nix::DerivationOptions<nix::StorePath>&, nix::PathLocks)':
/build/source/src/libstore/build/derivation-building-goal.cc:1098:27: error: await expressions are not permitted in handlers
 1098 |                 co_return co_await buildLocally(
      |                           ^~~~~~~~
ninja: build stopped: subcommand failed.
failed checks.x86_64-linux.nixos-matchbox 8m 47s
nix-store-2.36.0pre: FAILED: [code=1] libnixstore.so.2.36.0.p/meson-generated_nixstore-unity0.cpp.o g++ -Ilibnixstore.so.2.36.0.p -I. -I.. -Iinclude -I../inclu …
nix-store-2.36.0pre:
FAILED: [code=1] libnixstore.so.2.36.0.p/meson-generated_nixstore-unity0.cpp.o 
g++ -Ilibnixstore.so.2.36.0.p -I. -I.. -Iinclude -I../include -I../linux/build -Ilinux/include -I../linux/include -I../unix/build -Iunix/include -I../unix/include -I/nix/store/9qkab5ic665a2g3idxk04dazfb4kd74g-nix-util-2.36.0pre-dev/include -I/nix/store/2ybid2fqf6nfqrwcgizv9qvvckyp6axh-libarchive-3.8.9-dev/include -I/nix/store/0dz9bi5rv50d46w8xykwdxrj4ssy6pnp-nlohmann_json-3.12.0/include -I/nix/store/aph5dkajglxjn9642bp0h3x7cwzijr52-curl-8.22.0-dev/include -I/nix/store/q2yrf8yhmj405nv9qbbraxr8wlz7n5kv-libseccomp-2.6.1-dev/include -I/nix/store/xrcjl59yi7zswbv0vzm8cmvw4vplsbgj-sqlite-3.53.3-dev/include -I/nix/store/2zgasbvd9mzmj145mxsmnzxiy7rnz…
In file included from libnixstore.so.2.36.0.p/nixstore-unity0.cpp:6:
/build/source/src/libstore/build/derivation-building-goal.cc: In member function 'nix::Goal::Co<std::variant<std::variant<nix::BuildResult::Success, nix::BuildError>, nix::DerivationBuildingGoal::NeedsSlot> > nix::DerivationBuildingGoal::buildLocally(LocalBuildCapability, const nix::StorePathSet&, std::map<std::__cxx11::basic_string<char>, nix::InitialOutput>&, nix::DerivationOptions<nix::StorePath>&, nix::PathLocks)':
/build/source/src/libstore/build/derivation-building-goal.cc:1098:27: error: await expressions are not permitted in handlers
 1098 |                 co_return co_await buildLocally(
      |                           ^~~~~~~~
ninja: build stopped: subcommand failed.
failed checks.x86_64-linux.nixos-turingmachine 8m 4s
nix-store-2.36.0pre: FAILED: [code=1] libnixstore.so.2.36.0.p/meson-generated_nixstore-unity0.cpp.o g++ -Ilibnixstore.so.2.36.0.p -I. -I.. -Iinclude -I../inclu …
nix-store-2.36.0pre:
FAILED: [code=1] libnixstore.so.2.36.0.p/meson-generated_nixstore-unity0.cpp.o 
g++ -Ilibnixstore.so.2.36.0.p -I. -I.. -Iinclude -I../include -I../linux/build -Ilinux/include -I../linux/include -I../unix/build -Iunix/include -I../unix/include -I/nix/store/9qkab5ic665a2g3idxk04dazfb4kd74g-nix-util-2.36.0pre-dev/include -I/nix/store/2ybid2fqf6nfqrwcgizv9qvvckyp6axh-libarchive-3.8.9-dev/include -I/nix/store/0dz9bi5rv50d46w8xykwdxrj4ssy6pnp-nlohmann_json-3.12.0/include -I/nix/store/aph5dkajglxjn9642bp0h3x7cwzijr52-curl-8.22.0-dev/include -I/nix/store/q2yrf8yhmj405nv9qbbraxr8wlz7n5kv-libseccomp-2.6.1-dev/include -I/nix/store/xrcjl59yi7zswbv0vzm8cmvw4vplsbgj-sqlite-3.53.3-dev/include -I/nix/store/2zgasbvd9mzmj145mxsmnzxiy7rnz…
In file included from libnixstore.so.2.36.0.p/nixstore-unity0.cpp:6:
/build/source/src/libstore/build/derivation-building-goal.cc: In member function 'nix::Goal::Co<std::variant<std::variant<nix::BuildResult::Success, nix::BuildError>, nix::DerivationBuildingGoal::NeedsSlot> > nix::DerivationBuildingGoal::buildLocally(LocalBuildCapability, const nix::StorePathSet&, std::map<std::__cxx11::basic_string<char>, nix::InitialOutput>&, nix::DerivationOptions<nix::StorePath>&, nix::PathLocks)':
/build/source/src/libstore/build/derivation-building-goal.cc:1098:27: error: await expressions are not permitted in handlers
 1098 |                 co_return co_await buildLocally(
      |                           ^~~~~~~~
ninja: build stopped: subcommand failed.
7 succeeded
succeeded attributes
status attribute duration
loading…
237 already built
skipped attributes
status attribute duration
loading…