Mic92/dotfiles build #813 failed ← #812 #814 →
eval warnings
1 kind
· 1 occurrence
- warn A legacy Nextcloud install (from before NixOS 26.11) may be installed. ×1
7 failed
| status | attribute | duration |
|---|---|---|
checks.aarch64-darwin.home-manager-macos
|
5m 51s | |
tuicr-0.27.0: patching file src/config/mod.rs Hunk #1 FAILED at 134. Hunk #2 succeeded at 264 with fuzz 2 (offset 56 lines). Hunk #3 FAILED at 454. Hunk #4 succ …tuicr-0.27.0: patching file src/config/mod.rs Hunk #1 FAILED at 134. Hunk #2 succeeded at 264 with fuzz 2 (offset 56 lines). Hunk #3 FAILED at 454. Hunk #4 succeeded at 1280 (offset 162 lines). 2 out of 4 hunks FAILED -- saving rejects to file src/config/mod.rs.rej patching file src/main.rs Hunk #1 succeeded at 400 (offset 15 lines). |
||
checks.aarch64-darwin.home-manager-utm-vm
|
5m 51s | |
tuicr-0.27.0: patching file src/config/mod.rs Hunk #1 FAILED at 134. Hunk #2 succeeded at 264 with fuzz 2 (offset 56 lines). Hunk #3 FAILED at 454. Hunk #4 succ …tuicr-0.27.0: patching file src/config/mod.rs Hunk #1 FAILED at 134. Hunk #2 succeeded at 264 with fuzz 2 (offset 56 lines). Hunk #3 FAILED at 454. Hunk #4 succeeded at 1280 (offset 162 lines). 2 out of 4 hunks FAILED -- saving rejects to file src/config/mod.rs.rej patching file src/main.rs Hunk #1 succeeded at 400 (offset 15 lines). |
||
checks.aarch64-linux.home-manager-utm-vm
|
6m 31s | |
tuicr-0.27.0: patching file src/config/mod.rs Hunk #1 FAILED at 134. Hunk #2 succeeded at 264 with fuzz 2 (offset 56 lines). Hunk #3 FAILED at 454. Hunk #4 succ …tuicr-0.27.0: patching file src/config/mod.rs Hunk #1 FAILED at 134. Hunk #2 succeeded at 264 with fuzz 2 (offset 56 lines). Hunk #3 FAILED at 454. Hunk #4 succeeded at 1280 (offset 162 lines). 2 out of 4 hunks FAILED -- saving rejects to file src/config/mod.rs.rej patching file src/main.rs Hunk #1 succeeded at 400 (offset 15 lines). |
||
checks.x86_64-linux.home-manager-coder
|
4m 15s | |
tuicr-0.27.0: patching file src/config/mod.rs Hunk #1 FAILED at 134. Hunk #2 succeeded at 264 with fuzz 2 (offset 56 lines). Hunk #3 FAILED at 454. Hunk #4 succ …tuicr-0.27.0: patching file src/config/mod.rs Hunk #1 FAILED at 134. Hunk #2 succeeded at 264 with fuzz 2 (offset 56 lines). Hunk #3 FAILED at 454. Hunk #4 succeeded at 1280 (offset 162 lines). 2 out of 4 hunks FAILED -- saving rejects to file src/config/mod.rs.rej patching file src/main.rs Hunk #1 succeeded at 400 (offset 15 lines). |
||
checks.x86_64-linux.home-manager-desktop
|
3m 56s | |
tuicr-0.27.0: patching file src/config/mod.rs Hunk #1 FAILED at 134. Hunk #2 succeeded at 264 with fuzz 2 (offset 56 lines). Hunk #3 FAILED at 454. Hunk #4 succ …tuicr-0.27.0: patching file src/config/mod.rs Hunk #1 FAILED at 134. Hunk #2 succeeded at 264 with fuzz 2 (offset 56 lines). Hunk #3 FAILED at 454. Hunk #4 succeeded at 1280 (offset 162 lines). 2 out of 4 hunks FAILED -- saving rejects to file src/config/mod.rs.rej patching file src/main.rs Hunk #1 succeeded at 400 (offset 15 lines). |
||
checks.x86_64-linux.home-manager-eve
|
3m 56s | |
tuicr-0.27.0: patching file src/config/mod.rs Hunk #1 FAILED at 134. Hunk #2 succeeded at 264 with fuzz 2 (offset 56 lines). Hunk #3 FAILED at 454. Hunk #4 succ …tuicr-0.27.0: patching file src/config/mod.rs Hunk #1 FAILED at 134. Hunk #2 succeeded at 264 with fuzz 2 (offset 56 lines). Hunk #3 FAILED at 454. Hunk #4 succeeded at 1280 (offset 162 lines). 2 out of 4 hunks FAILED -- saving rejects to file src/config/mod.rs.rej patching file src/main.rs Hunk #1 succeeded at 400 (offset 15 lines). |
||
checks.x86_64-linux.home-manager-utm-vm
|
3m 56s | |
tuicr-0.27.0: patching file src/config/mod.rs Hunk #1 FAILED at 134. Hunk #2 succeeded at 264 with fuzz 2 (offset 56 lines). Hunk #3 FAILED at 454. Hunk #4 succ …tuicr-0.27.0: patching file src/config/mod.rs Hunk #1 FAILED at 134. Hunk #2 succeeded at 264 with fuzz 2 (offset 56 lines). Hunk #3 FAILED at 454. Hunk #4 succeeded at 1280 (offset 162 lines). 2 out of 4 hunks FAILED -- saving rejects to file src/config/mod.rs.rej patching file src/main.rs Hunk #1 succeeded at 400 (offset 15 lines). |
||
23 succeeded ⚠ 1
235 already built
| status | attribute | duration |
|---|---|---|
| loading… | ||