setup
checks.x86_64-linux.nixos-bernie
· build #831
· raw
1these 39 derivations will be built:2 /nix/store/xgcnv7j8ki8anbc80g2971a2p8iaxsxk-etc-os-release.drv3 /nix/store/00fpykfxa4fsqj65k84p4ibr928923zv-shutdown-ramfs-contents.json.drv4 /nix/store/2amrkbqcg7m31005q20i6zsizg0z166v-issue.drv5 /nix/store/4zg0i709j3vka99fdb6wpd20852jg5pj-python3.14-pyopenjtalk-plus-0.4.1-post9.drv6 /nix/store/8fh8qaqzyvpswv4p143pdjivd3zkngnl-piper-tts-1.8.0.drv7 /nix/store/a84vhzfxbjv31i0bqc3ixhz07b7ynnbg-calibre-9.16.0.drv8 /nix/store/g1bxdcj9jddjz70zvc3kfizbdys9v0n6-nixos-version.drv9 /nix/store/wh6ihmsnchbldi1g6qyw919gxxqr1k88-zfstools-0.1.0.drv10 /nix/store/lr6bqppfdznnb0sjyww2b9vmqxw6aqg9-system-path.drv11 /nix/store/2f5jciwnvc9lvzplbv8y4gllh0k8smcv-X-Restart-Triggers-polkit.drv12 /nix/store/86l17h48cad3zzx7aaannln2j1z46cjk-dbus-1.drv13 /nix/store/fmb6yb58sa3c9c4ai0bcy0kgwvg8xnd7-X-Restart-Triggers-dbus-broker.drv14 /nix/store/2nhklyrfmxl5pwn72iwxfb3svzw4qks4-unit-dbus-broker.service.drv15 /nix/store/cgl03j89hkqa26n17mgjmql4b6504rav-linux-7.2.11-modules.drv16 /nix/store/4jqbnvp40rqjpqazp9g4wzwd3svdsr96-linux-7.2.11-modules-shrunk.drv17 /nix/store/4qi0ajvsfy4nqg3cbmfpgn5xrchbsvi6-unit-generate-shutdown-ramfs.service.drv18 /nix/store/4vrihyb6niiph5h72wmbxhmhv0a7ghzl-unit-zfs-snapshot-daily.service.drv19 /nix/store/5k8n89cacanqnba5kij8zazfviarwdwr-unit-accounts-daemon.service.drv20 /nix/store/61braz9l403y9bahs31wvwjk2426cdsb-unit-zfs-snapshot-frequent.service.drv21 /nix/store/m9m171av88mnr1vw5j8vyac1bwqbg4j2-initrd-linux-7.2.11.drv22 /nix/store/gvhpczlknfzlq9sw7ymsv59ji5a7k57y-boot.json.drv23 /nix/store/h5avnal53mxrf7v7mbp7rd24kqqg8car-flake-inputs.prom.drv24 /nix/store/df7zzhdhdas20ny1i3216idlmpb1qwf2-config.toml.drv25 /nix/store/8q29vryypzqss6h1wgxy77vai9c5r1db-unit-telegraf.service.drv26 /nix/store/b42d3c1qax4h21mkqyn9p0y1ha6n619h-unit-polkit.service.drv27 /nix/store/h6i8lycrdrhyisp2l7yrv021dy0k0wdl-unit-zfs-snapshot-hourly.service.drv28 /nix/store/v52bcid3qkycjp04cmbp8dr191r4q50q-unit-dbus-broker.service.drv29 /nix/store/wq7k0c4n829bbfql9jasp4lgnlj0rkhc-unit-zfs-snapshot-monthly.service.drv30 /nix/store/xgpdlavxszr0zdpkwh34q9pkw29lfwhr-unit-zfs-snapshot-weekly.service.drv31 /nix/store/ccv7wvaiwcdmyys52910gp9v83il1z70-system-units.drv32 /nix/store/fa02w3vrvbqap4chkakfpcw1xdchj6rh-set-environment.drv33 /nix/store/g8r9z4ai5kd2r3lqqgkws109bii5zb9m-etc-profile.drv34 /nix/store/jmx3dj37wnpf9fqp7i9hk1nl0crbs0jc-etc-zshenv.drv35 /nix/store/qxqyvdr3flh7xc0n3fmn9dbxggrzicvk-user-units.drv36 /nix/store/ryr9jv9di6y60sw64m1lxpyb1i9vmv9m-etc-nix-registry.json.drv37 /nix/store/zzrw790h7njyamwa6vx4yyhp4nx3jqyg-etc-pam-environment.drv38 /nix/store/rb1r1xdavrji23lnljd9w01wfrskdmgw-etc.drv39 /nix/store/pw556z1fc4jc177vmiflckrfl51xfbym-activate.drv40 /nix/store/6ynz5fb7lydl3n5vsfdjhvb0whm4idgs-nixos-system-bernie-26.11.20261021.8307f67.drv41error: Cannot build '/nix/store/wh6ihmsnchbldi1g6qyw919gxxqr1k88-zfstools-0.1.0.drv'.42 Reason: builder failed with exit code 1.43 Output paths:44 /nix/store/538n2yn9jqs7mf1zb3v2y84x9f1h6mxw-zfstools-0.1.045 /nix/store/88q6d4rh0hj7393009jk18ynac13k351-zfstools-0.1.0-dist46 Last 25 log lines:47 > checking for references to /build/ in /nix/store/88q6d4rh0hj7393009jk18ynac13k351-zfstools-0.1.0-dist...48 > patching script interpreter paths in /nix/store/88q6d4rh0hj7393009jk18ynac13k351-zfstools-0.1.0-dist49 > shrinking RPATHs of ELF executables and libraries in /nix/store/538n2yn9jqs7mf1zb3v2y84x9f1h6mxw-zfstools-0.1.050 > checking for references to /build/ in /nix/store/538n2yn9jqs7mf1zb3v2y84x9f1h6mxw-zfstools-0.1.0...51 > patching script interpreter paths in /nix/store/538n2yn9jqs7mf1zb3v2y84x9f1h6mxw-zfstools-0.1.052 > stripping (with command strip and flags -S -p) in /nix/store/538n2yn9jqs7mf1zb3v2y84x9f1h6mxw-zfstools-0.1.0/lib /nix/store/538n2yn9jqs7mf1zb3v2y84x9f1h6mxw-zfstools-0.1.0/bin53 > Rewriting #!/nix/store/xahxrjs30p3mw0a42bqg9ikgkikskw8m-python3-3.14.8/bin/python3.14 to #!/nix/store/xahxrjs30p3mw0a42bqg9ikgkikskw8m-python3-3.14.854 > wrapping `/nix/store/538n2yn9jqs7mf1zb3v2y84x9f1h6mxw-zfstools-0.1.0/bin/zfs-auto-snapshot'...55 >56 > Builder called die: makeWrapper doesn't understand the arg --prefix PATH : /nix/store/c6f15r3p750qk6w4qy7vpk7w3m82sh3g-zfs-user-2.4.4/bin57 > Backtrace:58 > 197 makeShellWrapper /nix/store/wnxl2v5a9rm80kixrg45k99d0s78zqsv-make-shell-wrapper-hook/nix-support/setup-hook59 > 236 wrapProgramShell /nix/store/wnxl2v5a9rm80kixrg45k99d0s78zqsv-make-shell-wrapper-hook/nix-support/setup-hook60 > 224 wrapProgram /nix/store/wnxl2v5a9rm80kixrg45k99d0s78zqsv-make-shell-wrapper-hook/nix-support/setup-hook61 > 117 wrapPythonProgramsIn /nix/store/mw0ig85pzph4iz82jq9jgrxcan8sgbsv-wrap-python-hook/nix-support/setup-hook62 > 4 wrapPythonPrograms /nix/store/mw0ig85pzph4iz82jq9jgrxcan8sgbsv-wrap-python-hook/nix-support/setup-hook63 > 264 _callImplicitHook /nix/store/an9g93vg5b02j74y38zfajswa0f10p2z-stdenv-linux/setup64 > 281 _eval /nix/store/an9g93vg5b02j74y38zfajswa0f10p2z-stdenv-linux/setup65 > 220 runHook /nix/store/an9g93vg5b02j74y38zfajswa0f10p2z-stdenv-linux/setup66 > 1666 fixupPhase /nix/store/an9g93vg5b02j74y38zfajswa0f10p2z-stdenv-linux/setup67 > 1771 runPhase /nix/store/an9g93vg5b02j74y38zfajswa0f10p2z-stdenv-linux/setup68 > 1826 genericBuild /nix/store/an9g93vg5b02j74y38zfajswa0f10p2z-stdenv-linux/setup69 > 1 source /nix/store/shkw4qm9qcw5sc5n1k5jznc83ny02r39-default-builder.sh70 > 3 main /nix/store/l622p70vy8k5sh7y5wizi5f2mic6ynpg-source-stdenv.sh71 >72 For full logs, run:73 nix log /nix/store/wh6ihmsnchbldi1g6qyw919gxxqr1k88-zfstools-0.1.0.drv74error: Cannot build '/nix/store/4vrihyb6niiph5h72wmbxhmhv0a7ghzl-unit-zfs-snapshot-daily.service.drv'.75 Reason: 1 dependency failed.76 Output paths:77 /nix/store/cckaigkzsjp919d3blshnj8psir9392b-unit-zfs-snapshot-daily.service78error: Cannot build '/nix/store/61braz9l403y9bahs31wvwjk2426cdsb-unit-zfs-snapshot-frequent.service.drv'.79 Reason: 1 dependency failed.80 Output paths:81 /nix/store/z2hr2pjcvbb98n3m1smdvnzwgwgl988x-unit-zfs-snapshot-frequent.service82error: Cannot build '/nix/store/h6i8lycrdrhyisp2l7yrv021dy0k0wdl-unit-zfs-snapshot-hourly.service.drv'.83 Reason: 1 dependency failed.84 Output paths:85 /nix/store/iiz76966m4i4kvycxcpf18d5vy9np844-unit-zfs-snapshot-hourly.service86error: Cannot build '/nix/store/wq7k0c4n829bbfql9jasp4lgnlj0rkhc-unit-zfs-snapshot-monthly.service.drv'.87 Reason: 1 dependency failed.88 Output paths:89 /nix/store/iq0xwha2p4c56xy9sbmyp7yfx9xndr78-unit-zfs-snapshot-monthly.service90error: Cannot build '/nix/store/xgpdlavxszr0zdpkwh34q9pkw29lfwhr-unit-zfs-snapshot-weekly.service.drv'.91 Reason: 1 dependency failed.92 Output paths:93 /nix/store/b94h0xbp7rjisrca4cbxfz7k1iglb0qy-unit-zfs-snapshot-weekly.service94error: Cannot build '/nix/store/cgl03j89hkqa26n17mgjmql4b6504rav-linux-7.2.11-modules.drv'.95 Reason: builder failed with exit code 123.96 Output paths:97 /nix/store/xiyfyqw4clkyyyipxhkbjbzmbrw3nwj8-linux-7.2.11-modules98 Last 6 log lines:99 > tribuchet: building on jamie100 > structuredAttrs is enabled101 > created 346 symlinks in user environment102 > structuredAttrs is enabled103 > kernel version is 7.2.11104 > cat: updates/scap.ko.cer: No such file or directory105 For full logs, run:106 nix log /nix/store/cgl03j89hkqa26n17mgjmql4b6504rav-linux-7.2.11-modules.drv107error: Cannot build '/nix/store/4jqbnvp40rqjpqazp9g4wzwd3svdsr96-linux-7.2.11-modules-shrunk.drv'.108 Reason: 1 dependency failed.109 Output paths:110 /nix/store/c5l0nxy8x1klsqnsjq3wnd9ks5nv0bq6-linux-7.2.11-modules-shrunk111error: Cannot build '/nix/store/m9m171av88mnr1vw5j8vyac1bwqbg4j2-initrd-linux-7.2.11.drv'.112 Reason: 1 dependency failed.113 Output paths:114 /nix/store/1r15mc2n9409ybhq8hz8zvp325nf9zs7-initrd-linux-7.2.11115error: Cannot build '/nix/store/gvhpczlknfzlq9sw7ymsv59ji5a7k57y-boot.json.drv'.116 Reason: 1 dependency failed.117 Output paths:118 /nix/store/whlxb7bprm1bs914hjdfn8qzpbxvy2c1-boot.json119error: Cannot build '/nix/store/4zg0i709j3vka99fdb6wpd20852jg5pj-python3.14-pyopenjtalk-plus-0.4.1-post9.drv'.120 Reason: builder failed with exit code 1.121 Output paths:122 /nix/store/7qr3f23hknkp4kxzhvp842ykg4dlfygl-python3.14-pyopenjtalk-plus-0.4.1-post9123 /nix/store/fcdf4wgm3p968p96id6z4l0v8hlb0wp5-python3.14-pyopenjtalk-plus-0.4.1-post9-dist124 Last 25 log lines:125 > ........................................................................ [ 92%]126 > ........................................................................ [ 97%]127 > ................................... [ 99%]128 > tests/test_user_dictionary.py ............. [100%]129 >130 > =================================== FAILURES ===================================131 > _______ test_run_njd_from_mecab_invalid_input_should_not_break_next_call _______132 >133 > def test_run_njd_from_mecab_invalid_input_should_not_break_next_call():134 > valid_mecab_features = pyopenjtalk.run_mecab("こんにちは")135 > invalid_mecab_features = copy.deepcopy(valid_mecab_features)136 > invalid_mecab_features[0] = 123 # type: ignore[assignment]137 >138 > > with pytest.raises(TypeError, match="must be str"):139 > ^^^^^^^^^^^^^^^^^^^^^^^^^^^^^^^^^^^^^^^^^^^^^140 > E AssertionError: Regex pattern did not match.141 > E Expected regex: 'must be str'142 > E Actual message: 'Expected str, got int'143 >144 > tests/test_frontend.py:775: AssertionError145 > =========================== short test summary info ============================146 > FAILED tests/test_frontend.py::test_run_njd_from_mecab_invalid_input_should_not_break_next_call147 > ================= 1 failed, 1678 passed, 16 skipped in 10.89s ==================148 >149 > done!150 For full logs, run:151 nix log /nix/store/4zg0i709j3vka99fdb6wpd20852jg5pj-python3.14-pyopenjtalk-plus-0.4.1-post9.drv152error: Cannot build '/nix/store/8fh8qaqzyvpswv4p143pdjivd3zkngnl-piper-tts-1.8.0.drv'.153 Reason: 1 dependency failed.154 Output paths:155 /nix/store/30a66w5l3xfy1cqbs8arv3l8r3rr4381-piper-tts-1.8.0156 /nix/store/c2v8k5j1dylzs21l8f5cw5ifsb044mm1-piper-tts-1.8.0-dist157error: Cannot build '/nix/store/a84vhzfxbjv31i0bqc3ixhz07b7ynnbg-calibre-9.16.0.drv'.158 Reason: 1 dependency failed.159 Output paths:160 /nix/store/69gw43na5wqgk5sygn3pkxagg863dmf2-calibre-9.16.0161error: Cannot build '/nix/store/lr6bqppfdznnb0sjyww2b9vmqxw6aqg9-system-path.drv'.162 Reason: 2 dependencies failed.163 Output paths:164 /nix/store/z7y5swr3jvp5mncm4gbab6nrvhz41kz0-system-path165error: Cannot build '/nix/store/2f5jciwnvc9lvzplbv8y4gllh0k8smcv-X-Restart-Triggers-polkit.drv'.166 Reason: 1 dependency failed.167 Output paths:168 /nix/store/4xkbs3k5qgqr2qkbr32pi62ifihcdm0h-X-Restart-Triggers-polkit169error: Cannot build '/nix/store/86l17h48cad3zzx7aaannln2j1z46cjk-dbus-1.drv'.170 Reason: 1 dependency failed.171 Output paths:172 /nix/store/3v55x3dx1wz3d69s5j6ll7v8zhlr5q9z-dbus-1173error: Cannot build '/nix/store/5k8n89cacanqnba5kij8zazfviarwdwr-unit-accounts-daemon.service.drv'.174 Reason: 1 dependency failed.175 Output paths:176 /nix/store/hbb0ncy5r5f0w7szbylzw0q2hdkci5pw-unit-accounts-daemon.service177error: Cannot build '/nix/store/fmb6yb58sa3c9c4ai0bcy0kgwvg8xnd7-X-Restart-Triggers-dbus-broker.drv'.178 Reason: 1 dependency failed.179 Output paths:180 /nix/store/qq27qr5jqlj609nifvpvjz4wwgbbjp6y-X-Restart-Triggers-dbus-broker181error: Cannot build '/nix/store/b42d3c1qax4h21mkqyn9p0y1ha6n619h-unit-polkit.service.drv'.182 Reason: 1 dependency failed.183 Output paths:184 /nix/store/kgsabfmmh7rj8k23qmjhv5hdw9xrchyx-unit-polkit.service185error: Cannot build '/nix/store/2nhklyrfmxl5pwn72iwxfb3svzw4qks4-unit-dbus-broker.service.drv'.186 Reason: 1 dependency failed.187 Output paths:188 /nix/store/fs1q6zgl9rff1gkh1vy5h0n7qnb68jp7-unit-dbus-broker.service189error: Cannot build '/nix/store/v52bcid3qkycjp04cmbp8dr191r4q50q-unit-dbus-broker.service.drv'.190 Reason: 1 dependency failed.191 Output paths:192 /nix/store/n8870mwzgclhblpxhv604qz63njzjjkg-unit-dbus-broker.service193error: Cannot build '/nix/store/ccv7wvaiwcdmyys52910gp9v83il1z70-system-units.drv'.194 Reason: 8 dependencies failed.195 Output paths:196 /nix/store/bnkpqm4pf7bsrr5rqsndlbl5alg5adrr-system-units197error: Cannot build '/nix/store/qxqyvdr3flh7xc0n3fmn9dbxggrzicvk-user-units.drv'.198 Reason: 1 dependency failed.199 Output paths:200 /nix/store/h0mb6hyq8wp0sr8r7xvc3jjfs3882qaq-user-units201error: Cannot build '/nix/store/rb1r1xdavrji23lnljd9w01wfrskdmgw-etc.drv'.202 Reason: 4 dependencies failed.203 Output paths:204 /nix/store/mmfxylsw1zfgipbq8lmaqb69hakcn0fv-etc205error: Cannot build '/nix/store/pw556z1fc4jc177vmiflckrfl51xfbym-activate.drv'.206 Reason: 1 dependency failed.207 Output paths:208 /nix/store/plk84sbl39rqsjwbabgfl1qpz1jajngf-activate209error: Cannot build '/nix/store/6ynz5fb7lydl3n5vsfdjhvb0whm4idgs-nixos-system-bernie-26.11.20261021.8307f67.drv'.210 Reason: 6 dependencies failed.211 Output paths:212 /nix/store/2xnrpzp167srnflc1sbkyldl9m582i3r-nixos-system-bernie-26.11.20261021.8307f67