nixbot

builds

failed onnxruntime-1.27.1 checks.x86_64-linux.home-manager-coder · build #837 · raw

1tribuchet: building on jamie2structuredAttrs is enabled3Sourcing python-catch-conflicts-hook.sh4Using checkPhaseThreadLimitHook
unpackPhase
5unpacking source archive /nix/store/3bgfas08hsxbyqgljj2n514fcwcwgaf0-source6source root is source7separate-debug-info: recording checksum of source files for debug support...
patchPhase
8applying patch /nix/store/hy7lyvr2sbwwy15vb2p6smz7fyh14687-musl-cstdint.patch9patching file include/onnxruntime/core/framework/tensor_shape.h10patching file onnxruntime/test/perftest/strings_helper.h11applying patch /nix/store/dwza8g7791laflhk6g1kjwgqhsz8clkd-remove-MATH_NO_EXCEPT-macro.patch12patching file onnxruntime/test/providers/cpu/math/element_wise_ops_test.cc13Hunk #1 succeeded at 3968 (offset 171 lines).14Hunk #2 succeeded at 3986 (offset 171 lines).15Hunk #3 succeeded at 4000 (offset 171 lines).
configurePhase
16cmake flags: -DCMAKE_FIND_USE_SYSTEM_PACKAGE_REGISTRY=OFF -DCMAKE_FIND_USE_PACKAGE_REGISTRY=OFF -DCMAKE_EXPORT_NO_PACKAGE_REGISTRY=ON -DCMAKE_BUILD_TYPE=Release -DCMAKE_INSTALL_LOCALEDIR=/nix/store/sasv616d39l3jad1pk8qq9kn1dvbcbp6-onnxruntime-1.27.1/share/locale -DCMAKE_INSTALL_LIBEXECDIR=/nix/store/sasv616d39l3jad1pk8qq9kn1dvbcbp6-onnxruntime-1.27.1/libexec -DCMAKE_INSTALL_LIBDIR=/nix/store/sasv616d39l3jad1pk8qq9kn1dvbcbp6-onnxruntime-1.27.1/lib -DCMAKE_INSTALL_DOCDIR=/nix/store/sasv616d39l3jad1pk8qq9kn1dvbcbp6-onnxruntime-1.27.1/share/doc/onnxruntime -DCMAKE_INSTALL_INFODIR=/nix/store/sasv616d39l3jad1pk8qq9kn1dvbcbp6-onnxruntime-1.27.1/share/info -DCMAKE_INSTALL_MANDIR=/nix/store/sasv616d39l3jad1pk8qq9kn1dvbcbp6-onnxruntime-1.27.1/share/man -DCMAKE_INSTALL_INCLUDEDIR=/nix/store/8p5288p9d78pm0m7nhrbp8qjikmg0lsc-onnxruntime-1.27.1-dev/include -DCMAKE_INSTALL_SBINDIR=/nix/store/sasv616d39l3jad1pk8qq9kn1dvbcbp6-onnxruntime-1.27.1/sbin -DCMAKE_INSTALL_BINDIR=/nix/store/sasv616d39l3jad1pk8qq9kn1dvbcbp6-onnxruntime-1.27.1/bin -DCMAKE_INSTALL_NAME_DIR=/nix/store/sasv616d39l3jad1pk8qq9kn1dvbcbp6-onnxruntime-1.27.1/lib -DCMAKE_STRIP=/nix/store/r5ri78axx1qggkjq3vawywlzglg70b5w-gcc-wrapper-16.2.0/bin/strip -DCMAKE_RANLIB=/nix/store/r5ri78axx1qggkjq3vawywlzglg70b5w-gcc-wrapper-16.2.0/bin/ranlib -DCMAKE_AR=/nix/store/r5ri78axx1qggkjq3vawywlzglg70b5w-gcc-wrapper-16.2.0/bin/ar -DCMAKE_C_COMPILER=gcc -DCMAKE_CXX_COMPILER=g++ -DCMAKE_INSTALL_PREFIX=/nix/store/sasv616d39l3jad1pk8qq9kn1dvbcbp6-onnxruntime-1.27.1 --compile-no-warning-as-error -DABSL_ENABLE_INSTALL:BOOL=TRUE -DFETCHCONTENT_FULLY_DISCONNECTED:BOOL=TRUE -DFETCHCONTENT_QUIET:BOOL=FALSE -DFETCHCONTENT_SOURCE_DIR_ABSEIL_CPP:STRING=/nix/store/xfqnd1mhbii0bard2zmxx9pvfjizxhcr-source -DFETCHCONTENT_SOURCE_DIR_DLPACK:STRING=/nix/store/n9ylaq80s7fhi25i89rqrv5ngbiz0bdg-dlpack-src -DFETCHCONTENT_SOURCE_DIR_FLATBUFFERS:STRING=/nix/store/v6bf8zbm7xiv0a3bg27n62kg64j7ql98-source -DFETCHCONTENT_SOURCE_DIR_MP11:STRING=/nix/store/2sbbyvyq7q4p4sjvdl861d3g8m78aljr-mp11-src -DFETCHCONTENT_SOURCE_DIR_ONNX:STRING=/nix/store/54yzskzwmapls2awvih149wyzci717gw-onnx-src -DFETCHCONTENT_SOURCE_DIR_RE2:STRING=/nix/store/py2j3i67pywazyqfaya1m0wg9qbv3k3m-source -DFETCHCONTENT_SOURCE_DIR_SAFEINT:STRING=/nix/store/f13w7sivmfnpdhbcdjl83ibvyz4ihh2p-safeint-src -DFETCHCONTENT_TRY_FIND_PACKAGE_MODE:STRING=ALWAYS -DONNX_CUSTOM_PROTOC_EXECUTABLE:STRING=/nix/store/hjz0cvp9c6vi3mpsnhrnh2qjyhwb1db0-protobuf-36.2/bin/protoc -Donnxruntime_BUILD_SHARED_LIB:BOOL=TRUE -Donnxruntime_BUILD_UNIT_TESTS:BOOL=TRUE -Donnxruntime_USE_FULL_PROTOBUF:BOOL=FALSE -Donnxruntime_USE_CUDA:BOOL=FALSE -Donnxruntime_USE_NCCL:BOOL=FALSE -Donnxruntime_USE_MIGRAPHX:BOOL=FALSE -Donnxruntime_USE_COREML:BOOL=FALSE -Donnxruntime_ENABLE_LTO:BOOL=TRUE -DCMAKE_CXX_FLAGS:STRING=-D_GLIBCXX_USE_OLD_GENERATE_CANONICAL -Donnxruntime_USE_OPENVINO:BOOL=TRUE -Donnxruntime_USE_OPENVINO_AUTO:STRING=NPU\,GPU\,CPU -Donnxruntime_USE_OPENVINO_GPU:BOOL=TRUE -Donnxruntime_USE_OPENVINO_CPU:BOOL=TRUE -Donnxruntime_USE_OPENVINO_NPU:BOOL=TRUE -DOpenVINO_DIR:STRING=/nix/store/kq0d9if8dv85lhr2rm0hziqmlxbp1adb-openvino-2026.4.0-dev/runtime/cmake -Donnxruntime_DISABLE_RTTI:BOOL=FALSE -Donnxruntime_ENABLE_PYTHON:BOOL=TRUE -DPYBIND11_PYTHONLIBS_OVERWRITE=OFF -DPYTHON_EXECUTABLE=/nix/store/xahxrjs30p3mw0a42bqg9ikgkikskw8m-python3-3.14.8/bin/python3.14 -DPYTHON_INCLUDE_DIR=/nix/store/xahxrjs30p3mw0a42bqg9ikgkikskw8m-python3-3.14.8/include/python3.14 -DPYTHON_SITE_PACKAGES=/nix/store/xahxrjs30p3mw0a42bqg9ikgkikskw8m-python3-3.14.8/lib/python3.14/site-packages -DPROTOC_EXE=/nix/store/hjz0cvp9c6vi3mpsnhrnh2qjyhwb1db0-protobuf-36.2/bin/protoc -DProtobuf_PROTOC_EXE=/nix/store/hjz0cvp9c6vi3mpsnhrnh2qjyhwb1db0-protobuf-36.2/bin/protoc -DProtobuf_PROTOC_EXECUTABLE=/nix/store/hjz0cvp9c6vi3mpsnhrnh2qjyhwb1db0-protobuf-36.2/bin/protoc17Ignoring COMPILE_WARNING_AS_ERROR target property and CMAKE_COMPILE_WARNING_AS_ERROR variable.18CMake Warning (deprecated) at CMakeLists.txt:9 (cmake_policy):19 The OLD behavior for policy CMP0104 will be removed from a future version20 of CMake.2122 The cmake-policies(7) manual explains that the OLD behaviors of all23 policies are deprecated and that a policy should be set to OLD only under24 specific short-term circumstances. Projects should be ported to the NEW25 behavior and not rely on setting a policy to OLD.26This warning is for project developers. Use -Wno-author or -Wno-deprecated27to suppress it.2829-- The C compiler identification is GNU 16.2.030-- The CXX compiler identification is GNU 16.2.031-- The ASM compiler identification is GNU32-- Found assembler: /nix/store/r5ri78axx1qggkjq3vawywlzglg70b5w-gcc-wrapper-16.2.0/bin/gcc33-- Detecting C compiler ABI info34-- Detecting C compiler ABI info - done35-- Check for working C compiler: /nix/store/r5ri78axx1qggkjq3vawywlzglg70b5w-gcc-wrapper-16.2.0/bin/gcc - skipped36-- Detecting C compile features37-- Detecting C compile features - done38-- Detecting CXX compiler ABI info39-- Detecting CXX compiler ABI info - done40-- Check for working CXX compiler: /nix/store/r5ri78axx1qggkjq3vawywlzglg70b5w-gcc-wrapper-16.2.0/bin/g++ - skipped41-- Detecting CXX compile features42-- Detecting CXX compile features - done43-- Setting CMAKE_C_STANDARD to 9944-- Setting CMAKE_CXX_STANDARD to 2045-- onnxruntime_target_platform = x86_6446-- Performing Test COMPILER_SUPPORT_MF16C47-- Performing Test COMPILER_SUPPORT_MF16C - Success48-- Performing Test COMPILER_SUPPORT_FMA49-- Performing Test COMPILER_SUPPORT_FMA - Success50-- Performing Test COMPILER_SUPPORT_AVX51-- Performing Test COMPILER_SUPPORT_AVX - Success52-- Performing Test onnxruntime_HAVE_BUILTIN_ATOMICS53-- Performing Test onnxruntime_HAVE_BUILTIN_ATOMICS - Success54-- Performing Test CMAKE_HAVE_LIBC_PTHREAD55-- Performing Test CMAKE_HAVE_LIBC_PTHREAD - Success56-- Found Threads: TRUE57-- Performing Test Iconv_IS_BUILT_IN58-- Performing Test Iconv_IS_BUILT_IN - Success59-- Found Iconv: built in to C library60-- Found Patch: /nix/store/d5jz315vxbphknfawsrjs192ci9bc6df-patch-2.8/bin/patch61Patch found: /nix/store/d5jz315vxbphknfawsrjs192ci9bc6df-patch-2.8/bin/patch62-- Found Python: /nix/store/xahxrjs30p3mw0a42bqg9ikgkikskw8m-python3-3.14.8/bin/python3.14 (found suitable version "3.14.8", minimum required is "3.10") found components: Interpreter Development.Module NumPy63Numpy version: 2.5.364-- Loading Dependencies URLs ...65-- Loading Dependencies ...66-- Fetch abseil_cpp from https://github.com/abseil/abseil-cpp/archive/refs/tags/20250814.0.zip67-- Performing Test ABSL_INTERNAL_AT_LEAST_CXX1768-- Performing Test ABSL_INTERNAL_AT_LEAST_CXX17 - Success69-- Performing Test ABSL_INTERNAL_AT_LEAST_CXX2070-- Performing Test ABSL_INTERNAL_AT_LEAST_CXX20 - Success71-- Abseil source dir:/nix/store/xfqnd1mhbii0bard2zmxx9pvfjizxhcr-source72-- Fetch re2 from https://github.com/google/re2/archive/refs/tags/2024-07-02.zip73-- Fetch googletest from https://github.com/google/googletest/archive/refs/tags/v1.17.0.zip74-- Fetch Protobuf from https://github.com/protocolbuffers/protobuf/archive/refs/tags/v21.12.zip75-- Found ZLIB: /nix/store/ji36842higmp6b06hbbpmzbd59g1c07c-zlib-1.3.2/lib/libz.so (found version "1.3.2")76-- Using protobuf from find_package(or vcpkg). Protobuf version: 36.2.077-- Fetch date from https://github.com/HowardHinnant/date/archive/refs/tags/v3.0.1.zip78-- Fetch mp11 from https://github.com/boostorg/mp11/archive/refs/tags/boost-1.82.0.zip79CMake Warning (author) at /nix/store/rlpcs1h48m058z811xxkn5672v77p5qj-cmake-4.4.4/share/cmake-4.4/Modules/FetchContent.cmake:1968 (message):80 Calling FetchContent_Populate(mp11) is deprecated, call81 FetchContent_MakeAvailable(mp11) instead. Policy CMP0169 can be set to OLD82 to allow FetchContent_Populate(mp11) to be called directly for now, but the83 ability to call it with declared details will be removed completely in a84 future version.85Call Stack (most recent call first):86 external/onnxruntime_external_deps.cmake:295 (FetchContent_Populate)87 CMakeLists.txt:591 (include)88This warning is for project developers. Use -Wno-author to suppress it.8990-- Fetch nlohmann_json from https://github.com/nlohmann/json/archive/refs/tags/v3.11.3.zip91-- Applying sysfs fallback patch for cpuinfo on Linux92-- Fetch pytorch_cpuinfo from https://github.com/pytorch/cpuinfo/archive/403d652dca4c1046e8145950b1c0997a9f748b57.zip93-- Aliasing cpuinfo::cpuinfo to cpuinfo94-- Fetch GSL from https://github.com/microsoft/GSL/archive/refs/tags/v4.2.1.zip95-- Fetch safeint from https://github.com/dcleblanc/SafeInt/archive/refs/tags/3.0.28.zip96CMake Warning (author) at /nix/store/rlpcs1h48m058z811xxkn5672v77p5qj-cmake-4.4.4/share/cmake-4.4/Modules/FetchContent.cmake:1968 (message):97 Calling FetchContent_Populate(safeint) is deprecated, call98 FetchContent_MakeAvailable(safeint) instead. Policy CMP0169 can be set to99 OLD to allow FetchContent_Populate(safeint) to be called directly for now,100 but the ability to call it with declared details will be removed completely101 in a future version.102Call Stack (most recent call first):103 external/onnxruntime_external_deps.cmake:440 (FetchContent_Populate)104 CMakeLists.txt:591 (include)105This warning is for project developers. Use -Wno-author to suppress it.106107-- Fetch flatbuffers from https://github.com/google/flatbuffers/archive/refs/tags/v23.5.26.zip108-- Proceeding with version: 23.5.26.0109-- Looking for strtof_l110-- Looking for strtof_l - found111-- Looking for strtoull_l112-- Looking for strtoull_l - found113-- Looking for realpath114-- Looking for realpath - found115-- CMAKE_CXX_FLAGS: -D_GLIBCXX_USE_OLD_GENERATE_CANONICAL -ffunction-sections -fdata-sections116-- Fetch pybind11_project from https://github.com/pybind/pybind11/archive/refs/tags/v3.0.2.zip117-- Found pybind11: /nix/store/aaiyjhv7zpx9k9x1357dkls4hnj9cxbg-python3.14-pybind11-3.1.0/include (found version "")118Setting pybind11_lib119-- Fetch onnx from https://github.com/onnx/onnx/archive/refs/tags/v1.21.0.zip120-- Found Python3: /nix/store/xahxrjs30p3mw0a42bqg9ikgkikskw8m-python3-3.14.8/bin/python3.14 (found version "3.14.8") found components: Interpreter121-- Found Python: /nix/store/xahxrjs30p3mw0a42bqg9ikgkikskw8m-python3-3.14.8/bin/python3.14 (found version "3.14.8") found components: Interpreter122-- Using custom protoc executable123-- ONNX_PROTOC_EXECUTABLE: /nix/store/hjz0cvp9c6vi3mpsnhrnh2qjyhwb1db0-protobuf-36.2/bin/protoc124Generated: /build/source/build/_deps/onnx-build/onnx/onnx-ml.proto125Generated: /build/source/build/_deps/onnx-build/onnx/onnx-operators-ml.proto126Generated: /build/source/build/_deps/onnx-build/onnx/onnx-data.proto127-- 128-- ******** Summary ********129-- CMake version : 4.4.4130-- CMake command : /nix/store/rlpcs1h48m058z811xxkn5672v77p5qj-cmake-4.4.4/bin/cmake131-- System : Linux132-- C++ compiler : /nix/store/r5ri78axx1qggkjq3vawywlzglg70b5w-gcc-wrapper-16.2.0/bin/g++133-- C++ compiler version : 16.2.0134-- Build type : Release135-- CMAKE_INSTALL_PREFIX : /nix/store/sasv616d39l3jad1pk8qq9kn1dvbcbp6-onnxruntime-1.27.1136-- CMAKE_MODULE_PATH : /build/source/cmake/external;/nix/store/54yzskzwmapls2awvih149wyzci717gw-onnx-src/cmake/external137-- 138-- ONNX version : 1.21.0139-- ONNX NAMESPACE : onnx140-- ONNX_USE_LITE_PROTO : ON141-- ONNX_USE_PROTOBUF_SHARED_LIBS : OFF142-- ONNX_DISABLE_EXCEPTIONS : OFF143-- ONNX_DISABLE_STATIC_REGISTRATION : OFF144-- ONNX_WERROR : OFF145-- ONNX_HARDENING : OFF146-- ONNX_BUILD_TESTS : OFF147-- ONNX_USE_UNITY_BUILD : OFF148-- BUILD_SHARED_LIBS : OFF149-- 150-- onnx compile options : -Wall;-Wextra;-Wno-stringop-overflow151-- onnx_proto compile options : -Wall;-Wextra;-Wno-stringop-overflow152-- onnx compile definitions : ONNX_NAMESPACE=onnx;ONNX_ML=1;ONNX_USE_LITE_PROTO=1153-- onnx_proto compile definitions : ONNX_NAMESPACE=onnx;ONNX_ML=1;ONNX_USE_LITE_PROTO=1154-- onnx link libraries : protobuf::libprotobuf-lite155-- onnx_proto link libraries : protobuf::libprotobuf-lite156-- 157-- Protobuf version : 36.2.0158-- Protobuf compiler : /nix/store/hjz0cvp9c6vi3mpsnhrnh2qjyhwb1db0-protobuf-36.2/bin/protoc159-- ONNX_BUILD_PYTHON : OFF160-- Fetch Eigen3 from https://github.com/eigen-mirror/eigen/archive/1d8b82b0740839c0de7f1242a3585e3390ff5f33/eigen-1d8b82b0740839c0de7f1242a3585e3390ff5f33.zip161-- dlpack is enabled.162-- Fetch dlpack from https://github.com/dmlc/dlpack/archive/5c210da409e7f1e51ddf445134a4376fdbd70d7d.zip163-- C++11 support has been enabled by default.164-- Finished fetching external dependencies165-- Performing Test HAS_AMBIGUOUS_REVERSED_OPERATOR166-- Performing Test HAS_AMBIGUOUS_REVERSED_OPERATOR - Failed167-- Performing Test HAS_INTERFERENCE_SIZE168-- Performing Test HAS_INTERFERENCE_SIZE - Success169-- Performing Test HAS_ARRAY_BOUNDS170-- Performing Test HAS_ARRAY_BOUNDS - Success171-- Performing Test HAS_BITWISE_INSTEAD_OF_LOGICAL172-- Performing Test HAS_BITWISE_INSTEAD_OF_LOGICAL - Failed173-- Performing Test HAS_CAST_FUNCTION_TYPE174-- Performing Test HAS_CAST_FUNCTION_TYPE - Success175-- Performing Test HAS_CATCH_VALUE176-- Performing Test HAS_CATCH_VALUE - Success177-- Performing Test HAS_CLASS_MEMACCESS178-- Performing Test HAS_CLASS_MEMACCESS - Success179-- Performing Test HAS_CHARACTER_CONVERSION180-- Performing Test HAS_CHARACTER_CONVERSION - Failed181-- Performing Test HAS_NO_ERROR_CHARACTER_CONVERSION182-- Performing Test HAS_NO_ERROR_CHARACTER_CONVERSION - Failed183-- Performing Test HAS_DANGLING_REFERENCE184-- Performing Test HAS_DANGLING_REFERENCE - Success185-- Performing Test HAS_DEPRECATED_ANON_ENUM_ENUM_CONVERSION186-- Performing Test HAS_DEPRECATED_ANON_ENUM_ENUM_CONVERSION - Failed187-- Performing Test HAS_DEPRECATED_BUILTINS188-- Performing Test HAS_DEPRECATED_BUILTINS - Failed189-- Performing Test HAS_DEPRECATED_COPY190-- Performing Test HAS_DEPRECATED_COPY - Success191-- Performing Test HAS_DEPRECATED_DECLARATIONS192-- Performing Test HAS_DEPRECATED_DECLARATIONS - Success193-- Performing Test HAS_DEPRECATED_LITERAL_OPERATOR194-- Performing Test HAS_DEPRECATED_LITERAL_OPERATOR - Success195-- Performing Test HAS_DEPRECATED_THIS_CAPTURE196-- Performing Test HAS_DEPRECATED_THIS_CAPTURE - Failed197-- Performing Test HAS_ENUM_CONSTEXPR_CONVERSION198-- Performing Test HAS_ENUM_CONSTEXPR_CONVERSION - Failed199-- Performing Test HAS_FORMAT_TRUNCATION200-- Performing Test HAS_FORMAT_TRUNCATION - Success201-- Performing Test HAS_IGNORED_ATTRIBUTES202-- Performing Test HAS_IGNORED_ATTRIBUTES - Success203-- Performing Test HAS_MAYBE_UNINITIALIZED204-- Performing Test HAS_MAYBE_UNINITIALIZED - Success205-- Performing Test HAS_MISSING_BRACES206-- Performing Test HAS_MISSING_BRACES - Success207-- Performing Test HAS_NONNULL_COMPARE208-- Performing Test HAS_NONNULL_COMPARE - Success209-- Performing Test HAS_PARENTHESES210-- Performing Test HAS_PARENTHESES - Success211-- Performing Test HAS_SHORTEN_64_TO_32212-- Performing Test HAS_SHORTEN_64_TO_32 - Failed213-- Performing Test HAS_STRICT_ALIASING214-- Performing Test HAS_STRICT_ALIASING - Success215-- Performing Test HAS_STRINGOP_OVERFLOW216-- Performing Test HAS_STRINGOP_OVERFLOW - Success217-- Performing Test HAS_TAUTOLOGICAL_POINTER_COMPARE218-- Performing Test HAS_TAUTOLOGICAL_POINTER_COMPARE - Failed219-- Performing Test HAS_UNDEFINED_VAR_TEMPLATE220-- Performing Test HAS_UNDEFINED_VAR_TEMPLATE - Failed221-- Performing Test HAS_UNUSED_BUT_SET_PARAMETER222-- Performing Test HAS_UNUSED_BUT_SET_PARAMETER - Success223-- Performing Test HAS_UNUSED_BUT_SET_VARIABLE224-- Performing Test HAS_UNUSED_BUT_SET_VARIABLE - Success225-- Performing Test HAS_UNUSED_VARIABLE226-- Performing Test HAS_UNUSED_VARIABLE - Success227-- Performing Test HAS_USELESS_CAST228-- Performing Test HAS_USELESS_CAST - Success229-- Looking for reallocarray230-- Looking for reallocarray - found231-- Could NOT find Git (missing: GIT_EXECUTABLE) 232-- Looking for clock_gettime in rt233-- Looking for clock_gettime in rt - found234-- Python Build is enabled235-- CMAKE_CXX_COMPILER_ID: GNU236-- CMAKE_CXX_COMPILER_VERSION: 16.2.0237-- Using -mavx2 -mfma -mavxvnni flags238-- Performing Test LINKER_SUPPORT_RPATH239-- Performing Test LINKER_SUPPORT_RPATH - Success240-- Python_EXECUTABLE: /nix/store/xahxrjs30p3mw0a42bqg9ikgkikskw8m-python3-3.14.8/bin/python3.14241-- Configuring done (12.3s)242-- Generating done (0.7s)243CMake Warning (unused-cli):244 Manually-specified variables were not used by the project:245246 CMAKE_EXPORT_NO_PACKAGE_REGISTRY247 FETCHCONTENT_FULLY_DISCONNECTED248 FETCHCONTENT_QUIET249 PROTOC_EXE250 PYBIND11_PYTHONLIBS_OVERWRITE251 PYTHON_EXECUTABLE252 PYTHON_INCLUDE_DIR253 PYTHON_SITE_PACKAGES254 Protobuf_PROTOC_EXE255 Protobuf_PROTOC_EXECUTABLE256257258-- Build files have been written to: /build/source/build
buildPhase
259build flags: -j24 SHELL=/nix/store/nnm9gdr70ihc6zc9298mzz8jpcgaciql-bash-5.3p20/bin/bash260Ignoring COMPILE_WARNING_AS_ERROR target property and CMAKE_COMPILE_WARNING_AS_ERROR variable.261[ 0%] Building CXX object _deps/abseil_cpp-build/absl/base/CMakeFiles/spinlock_wait.dir/internal/spinlock_wait.cc.o262[ 0%] Building CXX object _deps/abseil_cpp-build/absl/debugging/CMakeFiles/utf8_for_code_point.dir/internal/utf8_for_code_point.cc.o263[ 0%] Building CXX object _deps/abseil_cpp-build/absl/base/CMakeFiles/log_severity.dir/log_severity.cc.o264[ 0%] Building CXX object _deps/abseil_cpp-build/absl/base/CMakeFiles/hardening.dir/internal/hardening.cc.o265[ 0%] Building CXX object _deps/abseil_cpp-build/absl/debugging/CMakeFiles/leak_check.dir/leak_check.cc.o266[ 0%] Building CXX object _deps/flatbuffers-build/CMakeFiles/flatbuffers.dir/src/idl_parser.cpp.o267[ 0%] Building CXX object _deps/abseil_cpp-build/absl/base/CMakeFiles/strerror.dir/internal/strerror.cc.o268[ 1%] Building CXX object _deps/abseil_cpp-build/absl/time/CMakeFiles/civil_time.dir/internal/cctz/src/civil_time_detail.cc.o269[ 1%] Building CXX object _deps/abseil_cpp-build/absl/time/CMakeFiles/time_zone.dir/internal/cctz/src/time_zone_fixed.cc.o270[ 1%] Building CXX object _deps/abseil_cpp-build/absl/types/CMakeFiles/source_location.dir/source_location.cc.o271[ 1%] Building CXX object _deps/abseil_cpp-build/absl/profiling/CMakeFiles/exponential_biased.dir/internal/exponential_biased.cc.o272[ 1%] Building CXX object _deps/abseil_cpp-build/absl/flags/CMakeFiles/flags_commandlineflag_internal.dir/internal/commandlineflag.cc.o273[ 1%] Building CXX object _deps/flatbuffers-build/CMakeFiles/flatc.dir/src/idl_parser.cpp.o274[ 2%] Building CXX object _deps/abseil_cpp-build/absl/log/CMakeFiles/log_internal_nullguard.dir/internal/nullguard.cc.o275[ 2%] Building CXX object CMakeFiles/custom_op_library.dir/build/source/onnxruntime/test/testdata/custom_op_library/cpu/cpu_ops.cc.o276[ 2%] Building CXX object CMakeFiles/custom_op_invalid_library.dir/build/source/onnxruntime/test/testdata/custom_op_invalid_library/custom_op_library.cc.o277[ 2%] Building CXX object _deps/abseil_cpp-build/absl/random/CMakeFiles/random_internal_platform.dir/internal/randen_round_keys.cc.o278[ 3%] Generating onnxruntime.lds, generated_source.c279[ 3%] Building CXX object CMakeFiles/onnxruntime_mocked_allocator.dir/build/source/onnxruntime/test/util/test_allocator.cc.o280[ 3%] Building CXX object CMakeFiles/onnxruntime_providers_shared.dir/build/source/onnxruntime/core/providers/shared/common.cc.o281[ 3%] Building CXX object CMakeFiles/custom_op_get_const_input_test_library.dir/build/source/onnxruntime/test/testdata/custom_op_get_const_input_test_library/custom_op.cc.o282[ 3%] Building CXX object CMakeFiles/custom_op_local_function.dir/build/source/onnxruntime/test/testdata/custom_op_local_function/custom_op_local_function.cc.o283[ 3%] Building CXX object CMakeFiles/custom_op_openvino_wrapper_library.dir/build/source/onnxruntime/test/testdata/custom_op_openvino_wrapper_library/custom_op_lib.cc.o284[ 3%] Building CXX object CMakeFiles/onnxruntime_mlas.dir/build/source/onnxruntime/core/mlas/lib/platform.cpp.o285[ 3%] Linking CXX shared library libonnxruntime_providers_shared.so286[ 3%] Linking CXX static library libabsl_leak_check.a287[ 3%] Linking CXX static library libabsl_utf8_for_code_point.a288[ 3%] Linking CXX static library libabsl_random_internal_platform.a289Generating symbol file for ['cpu', 'openvino']290VERSION:1.27.1291[ 4%] Linking CXX static library libabsl_source_location.a292[ 4%] Built target leak_check293[ 4%] Built target utf8_for_code_point294[ 4%] Linking CXX static library libabsl_flags_commandlineflag_internal.a295[ 4%] Built target onnxruntime_generate_def296[ 4%] Built target random_internal_platform297[ 4%] Building CXX object CMakeFiles/custom_op_openvino_wrapper_library.dir/build/source/onnxruntime/test/testdata/custom_op_openvino_wrapper_library/openvino_wrapper.cc.o298[ 4%] Building CXX object CMakeFiles/custom_op_library.dir/build/source/onnxruntime/test/testdata/custom_op_library/custom_op_library.cc.o299[ 4%] Building CXX object CMakeFiles/onnxruntime_mlas.dir/build/source/onnxruntime/core/mlas/lib/threading.cpp.o300[ 4%] Building CXX object CMakeFiles/onnxruntime_mlas.dir/build/source/onnxruntime/core/mlas/lib/sgemm.cpp.o301[ 4%] Built target source_location302[ 5%] Linking CXX shared module libcustom_op_invalid_library.so303[ 5%] Building CXX object CMakeFiles/onnxruntime_mlas.dir/build/source/onnxruntime/core/mlas/lib/halfgemm.cpp.o304[ 5%] Linking CXX static library libabsl_log_internal_nullguard.a305[ 5%] Built target flags_commandlineflag_internal306[ 5%] Building CXX object CMakeFiles/onnxruntime_mlas.dir/build/source/onnxruntime/core/mlas/lib/qgemm.cpp.o307[ 5%] Built target log_internal_nullguard308[ 5%] Linking CXX static library libabsl_hardening.a309[ 5%] Linking CXX static library libabsl_spinlock_wait.a310[ 5%] Building CXX object CMakeFiles/onnxruntime_mlas.dir/build/source/onnxruntime/core/mlas/lib/qdwconv.cpp.o311[ 5%] Built target hardening312[ 5%] Built target spinlock_wait313[ 5%] Building CXX object CMakeFiles/onnxruntime_mlas.dir/build/source/onnxruntime/core/mlas/lib/convolve.cpp.o314[ 6%] Building CXX object CMakeFiles/onnxruntime_mlas.dir/build/source/onnxruntime/core/mlas/lib/sconv_nchw_depthwise_multiplier_greater_than_1.cpp.o315[ 6%] Built target onnxruntime_providers_shared316[ 6%] Building CXX object CMakeFiles/onnxruntime_mlas.dir/build/source/onnxruntime/core/mlas/lib/convsym.cpp.o317[ 6%] Built target custom_op_invalid_library318[ 6%] Building CXX object CMakeFiles/custom_op_local_function.dir/build/source/onnxruntime/test/testdata/custom_op_local_function/dummy_gemm.cc.o319[ 6%] Linking CXX static library libabsl_exponential_biased.a320[ 6%] Linking CXX static library libabsl_strerror.a321[ 6%] Built target exponential_biased322[ 6%] Building CXX object CMakeFiles/onnxruntime_mlas.dir/build/source/onnxruntime/core/mlas/lib/pooling.cpp.o323[ 6%] Built target strerror324[ 6%] Linking CXX static library libabsl_log_severity.a325[ 6%] Building CXX object CMakeFiles/onnxruntime_mlas.dir/build/source/onnxruntime/core/mlas/lib/transpose.cpp.o326[ 6%] Built target log_severity327[ 6%] Building CXX object CMakeFiles/onnxruntime_mlas.dir/build/source/onnxruntime/core/mlas/lib/reorder.cpp.o328[ 6%] Linking CXX static library libabsl_civil_time.a329[ 6%] Built target civil_time330[ 6%] Building CXX object _deps/abseil_cpp-build/absl/time/CMakeFiles/time_zone.dir/internal/cctz/src/time_zone_format.cc.o331[ 6%] Building CXX object _deps/abseil_cpp-build/absl/random/CMakeFiles/random_internal_randen_hwaes_impl.dir/internal/randen_hwaes.cc.o332[ 6%] Linking CXX static library libabsl_random_internal_randen_hwaes_impl.a333[ 6%] Built target random_internal_randen_hwaes_impl334[ 6%] Building CXX object _deps/abseil_cpp-build/absl/time/CMakeFiles/time_zone.dir/internal/cctz/src/time_zone_if.cc.o335[ 6%] Building CXX object _deps/flatbuffers-build/CMakeFiles/flatbuffers.dir/src/idl_gen_text.cpp.o336[ 6%] Building CXX object _deps/flatbuffers-build/CMakeFiles/flatbuffers.dir/src/reflection.cpp.o337[ 6%] Linking CXX shared module libcustom_op_local_function.so338[ 6%] Building CXX object CMakeFiles/custom_op_get_const_input_test_library.dir/build/source/onnxruntime/test/testdata/custom_op_get_const_input_test_library/custom_op_lib.cc.o339[ 7%] Linking CXX static library libonnxruntime_mocked_allocator.a340[ 7%] Built target onnxruntime_mocked_allocator341[ 7%] Building CXX object _deps/flatbuffers-build/CMakeFiles/flatbuffers.dir/src/util.cpp.o342[ 7%] Building CXX object _deps/abseil_cpp-build/absl/random/CMakeFiles/random_internal_randen_slow.dir/internal/randen_slow.cc.o343[ 7%] Building CXX object _deps/abseil_cpp-build/absl/random/CMakeFiles/random_internal_randen_hwaes.dir/internal/randen_detect.cc.o344[ 7%] Building CXX object CMakeFiles/onnxruntime_mlas.dir/build/source/onnxruntime/core/mlas/lib/snchwc.cpp.o345[ 7%] Building CXX object _deps/abseil_cpp-build/absl/base/CMakeFiles/raw_logging_internal.dir/internal/raw_logging.cc.o346[ 7%] Building CXX object _deps/abseil_cpp-build/absl/time/CMakeFiles/time_zone.dir/internal/cctz/src/time_zone_impl.cc.o347[ 7%] Building CXX object _deps/abseil_cpp-build/absl/time/CMakeFiles/time_zone.dir/internal/cctz/src/time_zone_info.cc.o348[ 7%] Building CXX object _deps/abseil_cpp-build/absl/time/CMakeFiles/time_zone.dir/internal/cctz/src/time_zone_libc.cc.o349[ 7%] Linking CXX static library libabsl_random_internal_randen_hwaes.a350[ 7%] Built target random_internal_randen_hwaes351[ 7%] Building CXX object _deps/abseil_cpp-build/absl/time/CMakeFiles/time_zone.dir/internal/cctz/src/time_zone_lookup.cc.o352[ 7%] Building CXX object CMakeFiles/onnxruntime_mlas.dir/build/source/onnxruntime/core/mlas/lib/activate.cpp.o353[ 7%] Building CXX object _deps/abseil_cpp-build/absl/time/CMakeFiles/time_zone.dir/internal/cctz/src/time_zone_posix.cc.o354[ 7%] Building CXX object _deps/abseil_cpp-build/absl/time/CMakeFiles/time_zone.dir/internal/cctz/src/zone_info_source.cc.o355[ 7%] Built target custom_op_local_function356[ 7%] Building CXX object _deps/flatbuffers-build/CMakeFiles/flatc.dir/src/idl_gen_text.cpp.o357[ 7%] Building CXX object _deps/flatbuffers-build/CMakeFiles/flatc.dir/src/reflection.cpp.o358[ 7%] Building CXX object _deps/flatbuffers-build/CMakeFiles/flatc.dir/src/util.cpp.o359[ 7%] Building CXX object _deps/flatbuffers-build/CMakeFiles/flatc.dir/src/idl_gen_binary.cpp.o360[ 7%] Building CXX object _deps/flatbuffers-build/CMakeFiles/flatc.dir/src/idl_gen_cpp.cpp.o361[ 7%] Linking CXX static library libabsl_raw_logging_internal.a362[ 7%] Built target raw_logging_internal363[ 7%] Building CXX object _deps/flatbuffers-build/CMakeFiles/flatc.dir/src/idl_gen_csharp.cpp.o364[ 7%] Building CXX object _deps/flatbuffers-build/CMakeFiles/flatc.dir/src/idl_gen_dart.cpp.o365[ 7%] Linking CXX static library libabsl_random_internal_randen_slow.a366[ 7%] Built target random_internal_randen_slow367[ 7%] Building CXX object CMakeFiles/onnxruntime_mlas.dir/build/source/onnxruntime/core/mlas/lib/logistic.cpp.o368[ 7%] Building CXX object _deps/flatbuffers-build/CMakeFiles/flatc.dir/src/idl_gen_kotlin.cpp.o369[ 7%] Building CXX object _deps/flatbuffers-build/CMakeFiles/flatc.dir/src/idl_gen_go.cpp.o370[ 7%] Building CXX object _deps/flatbuffers-build/CMakeFiles/flatc.dir/src/idl_gen_java.cpp.o371[ 7%] Building CXX object _deps/flatbuffers-build/CMakeFiles/flatc.dir/src/idl_gen_ts.cpp.o372[ 7%] Building CXX object CMakeFiles/onnxruntime_mlas.dir/build/source/onnxruntime/core/mlas/lib/tanh.cpp.o373[ 7%] Building CXX object CMakeFiles/onnxruntime_mlas.dir/build/source/onnxruntime/core/mlas/lib/eltwise.cpp.o374[ 7%] Linking CXX shared module libcustom_op_get_const_input_test_library.so375[ 7%] Building CXX object CMakeFiles/onnxruntime_mlas.dir/build/source/onnxruntime/core/mlas/lib/erf.cpp.o376[ 7%] Linking CXX shared module libcustom_op_openvino_wrapper_library.so377[ 7%] Building CXX object CMakeFiles/onnxruntime_mlas.dir/build/source/onnxruntime/core/mlas/lib/silu.cpp.o378[ 7%] Built target custom_op_get_const_input_test_library379[ 7%] Building CXX object _deps/flatbuffers-build/CMakeFiles/flatc.dir/src/idl_gen_php.cpp.o380[ 7%] Linking CXX static library libabsl_time_zone.a381[ 7%] Built target time_zone382[ 7%] Building CXX object CMakeFiles/onnxruntime_mlas.dir/build/source/onnxruntime/core/mlas/lib/gelu.cpp.o383[ 7%] Building CXX object _deps/abseil_cpp-build/absl/base/CMakeFiles/base.dir/casts.cc.o384[ 7%] Building CXX object _deps/abseil_cpp-build/absl/base/CMakeFiles/throw_delegate.dir/throw_delegate.cc.o385[ 7%] Building CXX object _deps/abseil_cpp-build/absl/debugging/CMakeFiles/debugging_internal.dir/internal/address_is_readable.cc.o386[ 7%] Building CXX object _deps/abseil_cpp-build/absl/strings/CMakeFiles/cordz_functions.dir/internal/cordz_functions.cc.o387[ 7%] Building CXX object _deps/abseil_cpp-build/absl/random/CMakeFiles/random_seed_gen_exception.dir/seed_gen_exception.cc.o388[ 7%] Linking CXX shared library libcustom_op_library.so389[ 7%] Building CXX object _deps/abseil_cpp-build/absl/debugging/CMakeFiles/debugging_internal.dir/internal/elf_mem_image.cc.o390[ 7%] Building CXX object _deps/abseil_cpp-build/absl/debugging/CMakeFiles/debugging_internal.dir/internal/vdso_support.cc.o391[ 7%] Building CXX object _deps/abseil_cpp-build/absl/base/CMakeFiles/base.dir/internal/cycleclock.cc.o392[ 7%] Linking CXX static library libabsl_throw_delegate.a393[ 7%] Built target custom_op_openvino_wrapper_library394[ 7%] Built target throw_delegate395[ 7%] Building CXX object _deps/flatbuffers-build/CMakeFiles/flatc.dir/src/idl_gen_python.cpp.o396[ 8%] Building CXX object _deps/flatbuffers-build/CMakeFiles/flatc.dir/src/idl_gen_lobster.cpp.o397[ 8%] Building CXX object _deps/abseil_cpp-build/absl/random/CMakeFiles/random_internal_randen.dir/internal/randen.cc.o398[ 8%] Linking CXX static library libabsl_random_internal_randen.a399[ 8%] Linking CXX static library libabsl_random_seed_gen_exception.a400[ 8%] Built target random_internal_randen401[ 8%] Built target random_seed_gen_exception402[ 8%] Building CXX object _deps/abseil_cpp-build/absl/base/CMakeFiles/base.dir/internal/spinlock.cc.o403[ 8%] Building CXX object _deps/abseil_cpp-build/absl/base/CMakeFiles/base.dir/internal/sysinfo.cc.o404[ 8%] Linking CXX static library libabsl_cordz_functions.a405[ 8%] Built target cordz_functions406[ 8%] Building CXX object CMakeFiles/onnxruntime_mlas.dir/build/source/onnxruntime/core/mlas/lib/compute.cpp.o407[ 8%] Building CXX object CMakeFiles/onnxruntime_mlas.dir/build/source/onnxruntime/core/mlas/lib/dequantize.cpp.o408[ 8%] Building CXX object CMakeFiles/onnxruntime_mlas.dir/build/source/onnxruntime/core/mlas/lib/quantize.cpp.o409[ 8%] Linking CXX static library libabsl_debugging_internal.a410[ 8%] Built target debugging_internal411[ 8%] Building CXX object _deps/abseil_cpp-build/absl/base/CMakeFiles/base.dir/internal/thread_identity.cc.o412[ 8%] Building CXX object _deps/abseil_cpp-build/absl/base/CMakeFiles/base.dir/internal/unscaledcycleclock.cc.o413[ 9%] Building CXX object CMakeFiles/onnxruntime_mlas.dir/build/source/onnxruntime/core/mlas/lib/qgemm_kernel_default.cpp.o414[ 9%] Building CXX object _deps/flatbuffers-build/CMakeFiles/flatc.dir/src/idl_gen_rust.cpp.o415[ 9%] Building CXX object _deps/flatbuffers-build/CMakeFiles/flatc.dir/src/idl_gen_fbs.cpp.o416[ 9%] Building CXX object _deps/flatbuffers-build/CMakeFiles/flatc.dir/src/idl_gen_grpc.cpp.o417[ 9%] Building CXX object _deps/flatbuffers-build/CMakeFiles/flatc.dir/src/idl_gen_json_schema.cpp.o418[ 9%] Building CXX object CMakeFiles/onnxruntime_mlas.dir/build/source/onnxruntime/core/mlas/lib/qladd.cpp.o419[ 9%] Building CXX object CMakeFiles/onnxruntime_mlas.dir/build/source/onnxruntime/core/mlas/lib/qlmul.cpp.o420[ 10%] Linking CXX static library libflatbuffers.a421[ 10%] Building CXX object _deps/flatbuffers-build/CMakeFiles/flatc.dir/src/idl_gen_swift.cpp.o422[ 10%] Building CXX object _deps/flatbuffers-build/CMakeFiles/flatc.dir/src/file_name_saving_file_manager.cpp.o423[ 10%] Building CXX object CMakeFiles/onnxruntime_mlas.dir/build/source/onnxruntime/core/mlas/lib/qpostprocessor.cpp.o424[ 10%] Building CXX object CMakeFiles/onnxruntime_mlas.dir/build/source/onnxruntime/core/mlas/lib/qlgavgpool.cpp.o425[ 10%] Building CXX object CMakeFiles/onnxruntime_mlas.dir/build/source/onnxruntime/core/mlas/lib/qdwconv_kernelsize.cpp.o426[ 10%] Building CXX object CMakeFiles/onnxruntime_mlas.dir/build/source/onnxruntime/core/mlas/lib/qnbitgemm.cpp.o427[ 10%] Built target flatbuffers428[ 10%] Building CXX object _deps/flatbuffers-build/CMakeFiles/flatc.dir/src/file_binary_writer.cpp.o429[ 10%] Building CXX object CMakeFiles/onnxruntime_mlas.dir/build/source/onnxruntime/core/mlas/lib/qlutgemm.cpp.o430[ 10%] Linking CXX static library libabsl_base.a431[ 10%] Building CXX object CMakeFiles/onnxruntime_mlas.dir/build/source/onnxruntime/core/mlas/lib/flashattn.cpp.o432[ 10%] Built target base433[ 10%] Building CXX object CMakeFiles/onnxruntime_mlas.dir/build/source/onnxruntime/core/mlas/lib/flashattn_qkv.cpp.o434[ 10%] Building CXX object CMakeFiles/onnxruntime_mlas.dir/build/source/onnxruntime/core/mlas/lib/qkv_quant.cpp.o435[ 10%] Building CXX object CMakeFiles/onnxruntime_mlas.dir/build/source/onnxruntime/core/mlas/lib/cast.cpp.o436[ 10%] Building CXX object CMakeFiles/onnxruntime_mlas.dir/build/source/onnxruntime/core/mlas/lib/layernorm.cpp.o437[ 10%] Building CXX object CMakeFiles/onnxruntime_mlas.dir/build/source/onnxruntime/core/mlas/lib/rotary_embedding.cpp.o438[ 10%] Building CXX object _deps/flatbuffers-build/CMakeFiles/flatc.dir/src/file_writer.cpp.o439[ 10%] Building CXX object _deps/flatbuffers-build/CMakeFiles/flatc.dir/src/flatc.cpp.o440[ 10%] Building CXX object _deps/flatbuffers-build/CMakeFiles/flatc.dir/src/flatc_main.cpp.o441[ 10%] Building CXX object _deps/flatbuffers-build/CMakeFiles/flatc.dir/src/binary_annotator.cpp.o442[ 10%] Built target custom_op_library443[ 10%] Building CXX object CMakeFiles/onnxruntime_mlas.dir/build/source/onnxruntime/core/mlas/lib/saturation_check.cpp.o444[ 10%] Building CXX object CMakeFiles/onnxruntime_mlas.dir/build/source/onnxruntime/core/mlas/lib/q4_dq.cpp.o445[ 11%] Building CXX object CMakeFiles/onnxruntime_mlas.dir/build/source/onnxruntime/core/mlas/lib/q4gemm.cpp.o446[ 11%] Building CXX object CMakeFiles/onnxruntime_mlas.dir/build/source/onnxruntime/core/mlas/lib/activate_fp16.cpp.o447[ 11%] Building CXX object CMakeFiles/onnxruntime_mlas.dir/build/source/onnxruntime/core/mlas/lib/dwconv.cpp.o448[ 11%] Building CXX object _deps/flatbuffers-build/CMakeFiles/flatc.dir/src/annotated_binary_text_gen.cpp.o449[ 11%] Building CXX object _deps/abseil_cpp-build/absl/base/CMakeFiles/base_cpu_detect.dir/internal/cpu_detect.cc.o450[ 11%] Building CXX object _deps/abseil_cpp-build/absl/base/CMakeFiles/malloc_internal.dir/internal/low_level_alloc.cc.o451[ 11%] Building CXX object _deps/abseil_cpp-build/absl/base/CMakeFiles/tracing_internal.dir/internal/tracing.cc.o452[ 11%] Building CXX object _deps/flatbuffers-build/CMakeFiles/flatc.dir/src/bfbs_gen_lua.cpp.o453[ 11%] Linking CXX static library libabsl_tracing_internal.a454[ 11%] Building CXX object CMakeFiles/onnxruntime_mlas.dir/build/source/onnxruntime/core/mlas/lib/dgemm.cpp.o455[ 11%] Built target tracing_internal456[ 11%] Building CXX object CMakeFiles/onnxruntime_mlas.dir/build/source/onnxruntime/core/mlas/lib/pooling_fp16.cpp.o457[ 11%] Building CXX object _deps/abseil_cpp-build/absl/debugging/CMakeFiles/decode_rust_punycode.dir/internal/decode_rust_punycode.cc.o458[ 11%] Building CXX object _deps/abseil_cpp-build/absl/numeric/CMakeFiles/int128.dir/int128.cc.o459[ 11%] Linking CXX static library libabsl_base_cpu_detect.a460[ 11%] Building CXX object _deps/abseil_cpp-build/absl/strings/CMakeFiles/strings_internal.dir/internal/ostringstream.cc.o461[ 11%] Built target base_cpu_detect462[ 11%] Building CXX object _deps/abseil_cpp-build/absl/strings/CMakeFiles/strings_internal.dir/internal/utf8.cc.o463[ 11%] Building CXX object _deps/flatbuffers-build/CMakeFiles/flatc.dir/src/bfbs_gen_nim.cpp.o464[ 11%] Building CXX object _deps/abseil_cpp-build/absl/hash/CMakeFiles/city.dir/internal/city.cc.o465[ 11%] Building CXX object _deps/abseil_cpp-build/absl/log/CMakeFiles/log_internal_conditions.dir/internal/conditions.cc.o466[ 11%] Building CXX object _deps/abseil_cpp-build/absl/strings/CMakeFiles/strings_internal.dir/internal/escaping.cc.o467[ 11%] Linking CXX static library libabsl_malloc_internal.a468[ 11%] Built target malloc_internal469[ 11%] Linking CXX static library libabsl_log_internal_conditions.a470[ 11%] Building CXX object CMakeFiles/onnxruntime_mlas.dir/build/source/onnxruntime/core/mlas/lib/qgemm_kernel_avx2.cpp.o471[ 11%] Building CXX object CMakeFiles/onnxruntime_mlas.dir/build/source/onnxruntime/core/mlas/lib/qgemm_kernel_sse.cpp.o472[ 11%] Built target log_internal_conditions473[ 11%] Building ASM object CMakeFiles/onnxruntime_mlas.dir/build/source/onnxruntime/core/mlas/lib/x86_64/DgemmKernelSse2.S.o474[ 11%] Building ASM object CMakeFiles/onnxruntime_mlas.dir/build/source/onnxruntime/core/mlas/lib/x86_64/SgemmKernelSse2.S.o475[ 11%] Building CXX object _deps/flatbuffers-build/CMakeFiles/flatc.dir/src/code_generators.cpp.o476[ 11%] Building CXX object _deps/abseil_cpp-build/absl/crc/CMakeFiles/crc_internal.dir/internal/crc.cc.o477[ 11%] Linking CXX static library libabsl_decode_rust_punycode.a478[ 11%] Built target decode_rust_punycode479[ 11%] Building CXX object _deps/abseil_cpp-build/absl/debugging/CMakeFiles/stacktrace.dir/stacktrace.cc.o480[ 11%] Building ASM object CMakeFiles/onnxruntime_mlas.dir/build/source/onnxruntime/core/mlas/lib/x86_64/SgemmTransposePackB16x4Sse2.S.o481[ 11%] Building CXX object _deps/abseil_cpp-build/absl/synchronization/CMakeFiles/graphcycles_internal.dir/internal/graphcycles.cc.o482[ 11%] Building CXX object _deps/abseil_cpp-build/absl/debugging/CMakeFiles/demangle_rust.dir/internal/demangle_rust.cc.o483[ 11%] Linking CXX static library libabsl_city.a484[ 11%] Linking CXX static library libabsl_int128.a485[ 11%] Built target city486[ 11%] Building CXX object _deps/abseil_cpp-build/absl/crc/CMakeFiles/crc_internal.dir/internal/crc_x86_arm_combined.cc.o487[ 11%] Linking CXX static library libabsl_demangle_rust.a488[ 11%] Built target int128489[ 11%] Building ASM object CMakeFiles/onnxruntime_mlas.dir/build/source/onnxruntime/core/mlas/lib/x86_64/SconvKernelSse2.S.o490[ 11%] Built target demangle_rust491[ 11%] Building ASM object CMakeFiles/onnxruntime_mlas.dir/build/source/onnxruntime/core/mlas/lib/x86_64/SpoolKernelSse2.S.o492[ 11%] Building ASM object CMakeFiles/onnxruntime_mlas.dir/build/source/onnxruntime/core/mlas/lib/x86_64/cvtfp16a.S.o493[ 11%] Building ASM object CMakeFiles/onnxruntime_mlas.dir/build/source/onnxruntime/core/mlas/lib/x86_64/DgemmKernelAvx.S.o494[ 11%] Building ASM object CMakeFiles/onnxruntime_mlas.dir/build/source/onnxruntime/core/mlas/lib/x86_64/SgemmKernelAvx.S.o495[ 12%] Building ASM object CMakeFiles/onnxruntime_mlas.dir/build/source/onnxruntime/core/mlas/lib/x86_64/SgemmKernelM1Avx.S.o496[ 13%] Building CXX object _deps/abseil_cpp-build/absl/debugging/CMakeFiles/demangle_internal.dir/internal/demangle.cc.o497[ 13%] Building ASM object CMakeFiles/onnxruntime_mlas.dir/build/source/onnxruntime/core/mlas/lib/x86_64/SgemmKernelM1TransposeBAvx.S.o498[ 13%] Building ASM object CMakeFiles/onnxruntime_mlas.dir/build/source/onnxruntime/core/mlas/lib/x86_64/SgemmTransposePackB16x4Avx.S.o499[ 13%] Building ASM object CMakeFiles/onnxruntime_mlas.dir/build/source/onnxruntime/core/mlas/lib/x86_64/SconvKernelAvx.S.o500[ 13%] Building ASM object CMakeFiles/onnxruntime_mlas.dir/build/source/onnxruntime/core/mlas/lib/x86_64/SpoolKernelAvx.S.o501[ 13%] Linking CXX static library libabsl_stacktrace.a502[ 13%] Building ASM object CMakeFiles/onnxruntime_mlas.dir/build/source/onnxruntime/core/mlas/lib/x86_64/SoftmaxKernelAvx.S.o503[ 13%] Building CXX object CMakeFiles/onnxruntime_mlas.dir/build/source/onnxruntime/core/mlas/lib/intrinsics/avx/min_max_elements.cpp.o504[ 13%] Building ASM object CMakeFiles/onnxruntime_mlas.dir/build/source/onnxruntime/core/mlas/lib/x86_64/QgemmU8S8KernelAvx2.S.o505[ 13%] Building ASM object CMakeFiles/onnxruntime_mlas.dir/build/source/onnxruntime/core/mlas/lib/x86_64/QgemvU8S8KernelAvx2.S.o506[ 14%] Building CXX object _deps/flatbuffers-build/CMakeFiles/flatc.dir/grpc/src/compiler/cpp_generator.cc.o507[ 14%] Built target stacktrace508[ 14%] Building ASM object CMakeFiles/onnxruntime_mlas.dir/build/source/onnxruntime/core/mlas/lib/x86_64/QgemmU8U8KernelAvx2.S.o509[ 14%] Building CXX object _deps/flatbuffers-build/CMakeFiles/flatc.dir/grpc/src/compiler/go_generator.cc.o510[ 14%] Building CXX object _deps/flatbuffers-build/CMakeFiles/flatc.dir/grpc/src/compiler/java_generator.cc.o511[ 14%] Building CXX object _deps/flatbuffers-build/CMakeFiles/flatc.dir/grpc/src/compiler/python_generator.cc.o512[ 14%] Building CXX object _deps/flatbuffers-build/CMakeFiles/flatc.dir/grpc/src/compiler/swift_generator.cc.o513[ 14%] Linking CXX static library libabsl_strings_internal.a514[ 14%] Built target strings_internal515[ 14%] Building ASM object CMakeFiles/onnxruntime_mlas.dir/build/source/onnxruntime/core/mlas/lib/x86_64/QgemvU8S8KernelAvxVnni.S.o516[ 14%] Building CXX object _deps/flatbuffers-build/CMakeFiles/flatc.dir/grpc/src/compiler/ts_generator.cc.o517[ 14%] Building ASM object CMakeFiles/onnxruntime_mlas.dir/build/source/onnxruntime/core/mlas/lib/x86_64/QgemmU8X8KernelAvx2.S.o518[ 14%] Building ASM object CMakeFiles/onnxruntime_mlas.dir/build/source/onnxruntime/core/mlas/lib/x86_64/ConvSymKernelAvx2.S.o519[ 14%] Building CXX object _deps/abseil_cpp-build/absl/strings/CMakeFiles/strings.dir/ascii.cc.o520[ 14%] Building CXX object _deps/abseil_cpp-build/absl/strings/CMakeFiles/strings.dir/charconv.cc.o521[ 14%] Building CXX object _deps/abseil_cpp-build/absl/strings/CMakeFiles/strings.dir/escaping.cc.o522[ 14%] Building CXX object _deps/abseil_cpp-build/absl/strings/CMakeFiles/strings.dir/internal/charconv_bigint.cc.o523[ 14%] Linking CXX static library libabsl_crc_internal.a524[ 14%] Linking CXX static library libabsl_demangle_internal.a525[ 14%] Built target crc_internal526[ 14%] Linking CXX static library libabsl_graphcycles_internal.a527[ 14%] Building CXX object _deps/abseil_cpp-build/absl/strings/CMakeFiles/strings.dir/internal/charconv_parse.cc.o528[ 14%] Built target demangle_internal529[ 14%] Building CXX object _deps/abseil_cpp-build/absl/strings/CMakeFiles/strings.dir/internal/damerau_levenshtein_distance.cc.o530[ 14%] Building CXX object _deps/abseil_cpp-build/absl/strings/CMakeFiles/strings.dir/internal/memutil.cc.o531[ 14%] Built target graphcycles_internal532[ 14%] Building ASM object CMakeFiles/onnxruntime_mlas.dir/build/source/onnxruntime/core/mlas/lib/x86_64/DgemmKernelFma3.S.o533[ 14%] Building CXX object _deps/abseil_cpp-build/absl/strings/CMakeFiles/strings.dir/internal/stringify_sink.cc.o534[ 14%] Building CXX object _deps/abseil_cpp-build/absl/strings/CMakeFiles/strings.dir/match.cc.o535[ 14%] Building CXX object _deps/abseil_cpp-build/absl/strings/CMakeFiles/strings.dir/numbers.cc.o536[ 14%] Building ASM object CMakeFiles/onnxruntime_mlas.dir/build/source/onnxruntime/core/mlas/lib/x86_64/SgemmKernelFma3.S.o537[ 14%] Building ASM object CMakeFiles/onnxruntime_mlas.dir/build/source/onnxruntime/core/mlas/lib/x86_64/SconvKernelFma3.S.o538[ 15%] Building ASM object CMakeFiles/onnxruntime_mlas.dir/build/source/onnxruntime/core/mlas/lib/x86_64/TransKernelFma3.S.o539[ 16%] Building CXX object _deps/abseil_cpp-build/absl/strings/CMakeFiles/strings.dir/str_cat.cc.o540[ 16%] Building CXX object _deps/abseil_cpp-build/absl/strings/CMakeFiles/strings.dir/str_replace.cc.o541[ 16%] Building CXX object _deps/abseil_cpp-build/absl/strings/CMakeFiles/strings.dir/str_split.cc.o542[ 16%] Building CXX object _deps/abseil_cpp-build/absl/strings/CMakeFiles/strings.dir/substitute.cc.o543[ 16%] Building ASM object CMakeFiles/onnxruntime_mlas.dir/build/source/onnxruntime/core/mlas/lib/x86_64/LogisticKernelFma3.S.o544[ 16%] Building ASM object CMakeFiles/onnxruntime_mlas.dir/build/source/onnxruntime/core/mlas/lib/x86_64/TanhKernelFma3.S.o545[ 16%] Building ASM object CMakeFiles/onnxruntime_mlas.dir/build/source/onnxruntime/core/mlas/lib/x86_64/ErfKernelFma3.S.o546[ 16%] Building CXX object CMakeFiles/onnxruntime_mlas.dir/build/source/onnxruntime/core/mlas/lib/intrinsics/avx2/qladd_avx2.cpp.o547[ 16%] Building CXX object CMakeFiles/onnxruntime_mlas.dir/build/source/onnxruntime/core/mlas/lib/intrinsics/avx2/qdwconv_avx2.cpp.o548[ 16%] Building CXX object CMakeFiles/onnxruntime_mlas.dir/build/source/onnxruntime/core/mlas/lib/intrinsics/avx2/saturation_check_avx2.cpp.o549[ 16%] Building CXX object CMakeFiles/onnxruntime_mlas.dir/build/source/onnxruntime/core/mlas/lib/sqnbitgemm_kernel_avx2.cpp.o550[ 16%] Building CXX object CMakeFiles/onnxruntime_mlas.dir/build/source/onnxruntime/core/mlas/lib/sqnbitgemm_lut_kernel_avx2.cpp.o551[ 16%] Building CXX object CMakeFiles/onnxruntime_mlas.dir/build/source/onnxruntime/core/mlas/lib/rotary_embedding_kernel_avx2.cpp.o552[ 16%] Building CXX object CMakeFiles/onnxruntime_mlas.dir/build/source/onnxruntime/core/mlas/lib/qkv_quant_kernel_avx2.cpp.o553[ 16%] Building ASM object CMakeFiles/onnxruntime_mlas.dir/build/source/onnxruntime/core/mlas/lib/x86_64/cvtfp16Avx.S.o554[ 16%] Building ASM object CMakeFiles/onnxruntime_mlas.dir/build/source/onnxruntime/core/mlas/lib/x86_64/DgemmKernelAvx512F.S.o555[ 16%] Building ASM object CMakeFiles/onnxruntime_mlas.dir/build/source/onnxruntime/core/mlas/lib/x86_64/SgemmKernelAvx512F.S.o556[ 16%] Building ASM object CMakeFiles/onnxruntime_mlas.dir/build/source/onnxruntime/core/mlas/lib/x86_64/SconvKernelAvx512F.S.o557[ 16%] Building ASM object CMakeFiles/onnxruntime_mlas.dir/build/source/onnxruntime/core/mlas/lib/x86_64/SoftmaxKernelAvx512F.S.o558[ 17%] Building ASM object CMakeFiles/onnxruntime_mlas.dir/build/source/onnxruntime/core/mlas/lib/x86_64/SpoolKernelAvx512F.S.o559[ 17%] Building ASM object CMakeFiles/onnxruntime_mlas.dir/build/source/onnxruntime/core/mlas/lib/x86_64/TransKernelAvx512F.S.o560[ 17%] Building CXX object CMakeFiles/onnxruntime_mlas.dir/build/source/onnxruntime/core/mlas/lib/intrinsics/avx512/gelu_avx512f.cpp.o561[ 17%] Building CXX object CMakeFiles/onnxruntime_mlas.dir/build/source/onnxruntime/core/mlas/lib/intrinsics/avx512/silu_avx512f.cpp.o562[ 17%] Building CXX object CMakeFiles/onnxruntime_mlas.dir/build/source/onnxruntime/core/mlas/lib/intrinsics/avx512/quantize_avx512f.cpp.o563[ 17%] Building CXX object CMakeFiles/onnxruntime_mlas.dir/build/source/onnxruntime/core/mlas/lib/intrinsics/avx512/sconv_nchw_depthwise_multiplier_greater_than_1_avx512f.cpp.o564[ 17%] Building ASM object CMakeFiles/onnxruntime_mlas.dir/build/source/onnxruntime/core/mlas/lib/x86_64/QgemvU8S8KernelAvx512Core.S.o565[ 17%] Building ASM object CMakeFiles/onnxruntime_mlas.dir/build/source/onnxruntime/core/mlas/lib/x86_64/QgemvU8S8KernelAvx512Vnni.S.o566[ 17%] Building ASM object CMakeFiles/onnxruntime_mlas.dir/build/source/onnxruntime/core/mlas/lib/x86_64/QgemmU8X8KernelAvx512Core.S.o567[ 17%] Building ASM object CMakeFiles/onnxruntime_mlas.dir/build/source/onnxruntime/core/mlas/lib/x86_64/ConvSymKernelAvx512Core.S.o568[ 17%] Building CXX object CMakeFiles/onnxruntime_mlas.dir/build/source/onnxruntime/core/mlas/lib/sqnbitgemm_kernel_avx512.cpp.o569[ 17%] Building CXX object CMakeFiles/onnxruntime_mlas.dir/build/source/onnxruntime/core/mlas/lib/sqnbitgemm_kernel_avx512vnni.cpp.o570[ 17%] Building CXX object CMakeFiles/onnxruntime_mlas.dir/build/source/onnxruntime/core/mlas/lib/qkv_quant_kernel_avx512vnni.cpp.o571[ 17%] Building CXX object CMakeFiles/onnxruntime_mlas.dir/build/source/onnxruntime/core/mlas/lib/q4gemm_avx512.cpp.o572[ 17%] Building ASM object CMakeFiles/onnxruntime_mlas.dir/build/source/onnxruntime/core/mlas/lib/x86_64/QgemmU8S8KernelAmxCommon.S.o573[ 17%] Building CXX object CMakeFiles/onnxruntime_mlas.dir/build/source/onnxruntime/core/mlas/lib/qgemm_kernel_amx.cpp.o574[ 17%] Linking CXX executable flatc575[ 18%] Building ASM object CMakeFiles/onnxruntime_mlas.dir/build/source/onnxruntime/core/mlas/lib/x86_64/QgemmU8S8KernelAmx.S.o576[ 18%] Linking CXX static library libabsl_strings.a577[ 18%] Built target strings578[ 18%] Building CXX object _deps/abseil_cpp-build/absl/hash/CMakeFiles/hash.dir/internal/hash.cc.o579[ 18%] Building CXX object _deps/abseil_cpp-build/absl/debugging/CMakeFiles/symbolize.dir/symbolize.cc.o580[ 18%] Building CXX object _deps/abseil_cpp-build/absl/time/CMakeFiles/time.dir/civil_time.cc.o581[ 18%] Building CXX object _deps/abseil_cpp-build/absl/strings/CMakeFiles/str_format_internal.dir/internal/str_format/arg.cc.o582[ 18%] Building CXX object _deps/abseil_cpp-build/absl/log/CMakeFiles/log_internal_proto.dir/internal/proto.cc.o583[ 18%] Building CXX object _deps/abseil_cpp-build/absl/flags/CMakeFiles/flags_commandlineflag.dir/commandlineflag.cc.o584[ 18%] Building CXX object _deps/abseil_cpp-build/absl/strings/CMakeFiles/str_format_internal.dir/internal/str_format/bind.cc.o585[ 18%] Linking CXX static library libabsl_flags_commandlineflag.a586[ 18%] Built target flags_commandlineflag587[ 18%] Building CXX object _deps/abseil_cpp-build/absl/log/CMakeFiles/log_internal_fnmatch.dir/internal/fnmatch.cc.o588[ 18%] Linking CXX static library libabsl_log_internal_proto.a589[ 18%] Built target log_internal_proto590[ 18%] Building CXX object _deps/abseil_cpp-build/absl/random/CMakeFiles/random_distributions.dir/discrete_distribution.cc.o591[ 18%] Building CXX object _deps/abseil_cpp-build/absl/random/CMakeFiles/random_distributions.dir/gaussian_distribution.cc.o592[ 18%] Building CXX object _deps/abseil_cpp-build/absl/strings/CMakeFiles/str_format_internal.dir/internal/str_format/extension.cc.o593[ 18%] Linking CXX static library libabsl_log_internal_fnmatch.a594[ 18%] Linking CXX static library libabsl_symbolize.a595[ 18%] Built target log_internal_fnmatch596[ 18%] Built target symbolize597[ 19%] Building CXX object _deps/abseil_cpp-build/absl/strings/CMakeFiles/str_format_internal.dir/internal/str_format/float_conversion.cc.o598[ 19%] Building CXX object _deps/abseil_cpp-build/absl/time/CMakeFiles/time.dir/clock.cc.o599[ 19%] Building CXX object _deps/abseil_cpp-build/absl/strings/CMakeFiles/str_format_internal.dir/internal/str_format/output.cc.o600[ 19%] Building CXX object _deps/abseil_cpp-build/absl/strings/CMakeFiles/str_format_internal.dir/internal/str_format/parser.cc.o601[ 19%] Linking CXX static library libabsl_hash.a602[ 19%] Building CXX object _deps/abseil_cpp-build/absl/time/CMakeFiles/time.dir/duration.cc.o603[ 19%] Building CXX object _deps/abseil_cpp-build/absl/time/CMakeFiles/time.dir/format.cc.o604[ 19%] Building CXX object _deps/abseil_cpp-build/absl/time/CMakeFiles/time.dir/time.cc.o605[ 19%] Built target hash606[ 19%] Building CXX object _deps/abseil_cpp-build/absl/random/CMakeFiles/random_internal_seed_material.dir/internal/seed_material.cc.o607[ 19%] Building CXX object _deps/abseil_cpp-build/absl/debugging/CMakeFiles/examine_stack.dir/internal/examine_stack.cc.o608[ 19%] Building CXX object _deps/abseil_cpp-build/absl/flags/CMakeFiles/flags_private_handle_accessor.dir/internal/private_handle_accessor.cc.o609[ 19%] Building CXX object _deps/abseil_cpp-build/absl/log/CMakeFiles/log_internal_structured_proto.dir/internal/structured_proto.cc.o610[ 19%] Linking CXX static library libabsl_random_distributions.a611[ 19%] Built target random_distributions612[ 19%] Linking CXX static library libabsl_flags_private_handle_accessor.a613[ 19%] Linking CXX static library libabsl_examine_stack.a614[ 19%] Built target flags_private_handle_accessor615[ 19%] Built target examine_stack616[ 19%] Linking CXX static library libabsl_log_internal_structured_proto.a617[ 19%] Built target log_internal_structured_proto618[ 19%] Linking CXX static library libabsl_random_internal_seed_material.a619[ 19%] Built target random_internal_seed_material620[ 19%] Linking CXX static library libabsl_str_format_internal.a621[ 19%] Built target str_format_internal622[ 19%] Linking CXX static library libabsl_time.a623[ 19%] Built target time624[ 19%] Linking CXX static library libonnxruntime_mlas.a625[ 19%] Built target onnxruntime_mlas626[ 19%] Building CXX object _deps/abseil_cpp-build/absl/crc/CMakeFiles/crc32c.dir/crc32c.cc.o627[ 19%] Building CXX object _deps/abseil_cpp-build/absl/crc/CMakeFiles/crc32c.dir/internal/crc_memcpy_fallback.cc.o628[ 19%] Building CXX object _deps/abseil_cpp-build/absl/flags/CMakeFiles/flags_marshalling.dir/marshalling.cc.o629[ 19%] Building CXX object _deps/abseil_cpp-build/absl/log/CMakeFiles/log_internal_globals.dir/internal/globals.cc.o630[ 19%] Building CXX object _deps/abseil_cpp-build/absl/log/CMakeFiles/log_entry.dir/log_entry.cc.o631[ 19%] Building CXX object _deps/abseil_cpp-build/absl/synchronization/CMakeFiles/kernel_timeout_internal.dir/internal/kernel_timeout.cc.o632[ 19%] Building CXX object _deps/abseil_cpp-build/absl/crc/CMakeFiles/crc32c.dir/internal/crc_memcpy_x86_arm_combined.cc.o633[ 19%] Building CXX object _deps/abseil_cpp-build/absl/crc/CMakeFiles/crc32c.dir/internal/crc_non_temporal_memcpy.cc.o634[ 19%] Linking CXX static library libabsl_kernel_timeout_internal.a635[ 19%] Linking CXX static library libabsl_log_internal_globals.a636[ 19%] Built target kernel_timeout_internal637[ 19%] Built target log_internal_globals638[ 19%] Linking CXX static library libabsl_flags_marshalling.a639[ 19%] Built target flags_marshalling640[ 19%] Building CXX object _deps/abseil_cpp-build/absl/synchronization/CMakeFiles/synchronization.dir/barrier.cc.o641[ 19%] Building CXX object _deps/abseil_cpp-build/absl/log/CMakeFiles/log_internal_format.dir/internal/log_format.cc.o642[ 19%] Linking CXX static library libabsl_log_entry.a643[ 19%] Building CXX object _deps/abseil_cpp-build/absl/synchronization/CMakeFiles/synchronization.dir/blocking_counter.cc.o644[ 19%] Built target log_entry645[ 19%] Building CXX object _deps/abseil_cpp-build/absl/synchronization/CMakeFiles/synchronization.dir/internal/create_thread_identity.cc.o646[ 19%] Building CXX object _deps/abseil_cpp-build/absl/synchronization/CMakeFiles/synchronization.dir/internal/futex_waiter.cc.o647[ 19%] Building CXX object _deps/abseil_cpp-build/absl/synchronization/CMakeFiles/synchronization.dir/internal/per_thread_sem.cc.o648[ 19%] Linking CXX static library libabsl_crc32c.a649[ 19%] Built target crc32c650[ 19%] Building CXX object _deps/abseil_cpp-build/absl/log/CMakeFiles/log_sink.dir/log_sink.cc.o651[ 19%] Building CXX object _deps/abseil_cpp-build/absl/crc/CMakeFiles/crc_cord_state.dir/internal/crc_cord_state.cc.o652[ 20%] Building CXX object _deps/abseil_cpp-build/absl/synchronization/CMakeFiles/synchronization.dir/internal/pthread_waiter.cc.o653[ 20%] Building CXX object _deps/abseil_cpp-build/absl/synchronization/CMakeFiles/synchronization.dir/internal/sem_waiter.cc.o654[ 20%] Building CXX object _deps/abseil_cpp-build/absl/synchronization/CMakeFiles/synchronization.dir/internal/stdcpp_waiter.cc.o655[ 20%] Building CXX object _deps/abseil_cpp-build/absl/synchronization/CMakeFiles/synchronization.dir/internal/waiter_base.cc.o656[ 20%] Building CXX object _deps/abseil_cpp-build/absl/synchronization/CMakeFiles/synchronization.dir/internal/win32_waiter.cc.o657[ 20%] Building CXX object _deps/abseil_cpp-build/absl/synchronization/CMakeFiles/synchronization.dir/notification.cc.o658[ 20%] Building CXX object _deps/abseil_cpp-build/absl/synchronization/CMakeFiles/synchronization.dir/mutex.cc.o659[ 20%] Linking CXX static library libabsl_log_internal_format.a660[ 20%] Built target log_internal_format661[ 20%] Linking CXX static library libabsl_log_sink.a662[ 20%] Built target log_sink663[ 20%] Linking CXX static library libabsl_crc_cord_state.a664[ 20%] Built target crc_cord_state665[ 20%] Building CXX object _deps/abseil_cpp-build/absl/strings/CMakeFiles/cord_internal.dir/internal/cord_internal.cc.o666[ 20%] Building CXX object _deps/abseil_cpp-build/absl/strings/CMakeFiles/cord_internal.dir/internal/cord_rep_crc.cc.o667[ 20%] Building CXX object _deps/abseil_cpp-build/absl/strings/CMakeFiles/cord_internal.dir/internal/cord_rep_btree.cc.o668[ 20%] Building CXX object _deps/abseil_cpp-build/absl/strings/CMakeFiles/cord_internal.dir/internal/cord_rep_consume.cc.o669[ 20%] Building CXX object _deps/abseil_cpp-build/absl/strings/CMakeFiles/cord_internal.dir/internal/cord_rep_btree_navigator.cc.o670[ 20%] Building CXX object _deps/abseil_cpp-build/absl/strings/CMakeFiles/cord_internal.dir/internal/cord_rep_btree_reader.cc.o671[ 20%] Linking CXX static library libabsl_synchronization.a672[ 20%] Built target synchronization673[ 20%] Building CXX object _deps/abseil_cpp-build/absl/strings/CMakeFiles/cordz_handle.dir/internal/cordz_handle.cc.o674[ 20%] Building CXX object _deps/abseil_cpp-build/absl/flags/CMakeFiles/flags_program_name.dir/internal/program_name.cc.o675[ 20%] Building CXX object _deps/abseil_cpp-build/absl/container/CMakeFiles/hashtablez_sampler.dir/internal/hashtablez_sampler_force_weak_definition.cc.o676[ 20%] Building CXX object _deps/abseil_cpp-build/absl/log/CMakeFiles/vlog_config_internal.dir/internal/vlog_config.cc.o677[ 21%] Building CXX object _deps/abseil_cpp-build/absl/random/CMakeFiles/random_internal_entropy_pool.dir/internal/entropy_pool.cc.o678[ 21%] Building CXX object _deps/abseil_cpp-build/absl/container/CMakeFiles/hashtablez_sampler.dir/internal/hashtablez_sampler.cc.o679[ 21%] Linking CXX static library libabsl_cord_internal.a680[ 21%] Built target cord_internal681[ 21%] Linking CXX static library libabsl_random_internal_entropy_pool.a682[ 21%] Built target random_internal_entropy_pool683[ 22%] Building CXX object _deps/abseil_cpp-build/absl/random/CMakeFiles/random_seed_sequences.dir/seed_sequences.cc.o684[ 22%] Linking CXX static library libabsl_flags_program_name.a685[ 22%] Linking CXX static library libabsl_hashtablez_sampler.a686[ 22%] Built target flags_program_name687[ 22%] Linking CXX static library libabsl_cordz_handle.a688[ 22%] Building CXX object _deps/abseil_cpp-build/absl/flags/CMakeFiles/flags_config.dir/usage_config.cc.o689[ 22%] Built target hashtablez_sampler690[ 22%] Built target cordz_handle691[ 22%] Building CXX object _deps/abseil_cpp-build/absl/strings/CMakeFiles/cordz_info.dir/internal/cordz_info.cc.o692[ 23%] Linking CXX static library libabsl_vlog_config_internal.a693[ 23%] Built target vlog_config_internal694[ 23%] Building CXX object _deps/abseil_cpp-build/absl/log/CMakeFiles/log_globals.dir/globals.cc.o695[ 23%] Linking CXX static library libabsl_random_seed_sequences.a696[ 23%] Built target random_seed_sequences697[ 23%] Linking CXX static library libabsl_flags_config.a698[ 23%] Built target flags_config699[ 23%] Building CXX object _deps/abseil_cpp-build/absl/flags/CMakeFiles/flags_internal.dir/internal/flag.cc.o700[ 23%] Linking CXX static library libabsl_log_globals.a701[ 23%] Built target log_globals702[ 23%] Building CXX object _deps/abseil_cpp-build/absl/log/CMakeFiles/log_internal_log_sink_set.dir/internal/log_sink_set.cc.o703[ 24%] Building CXX object _deps/abseil_cpp-build/absl/log/CMakeFiles/log_initialize.dir/initialize.cc.o704[ 24%] Built target flatc705[ 24%] Linking CXX static library libabsl_cordz_info.a706[ 24%] Built target cordz_info707[ 25%] Building CXX object _deps/abseil_cpp-build/absl/strings/CMakeFiles/cord.dir/cord.cc.o708[ 25%] Building CXX object _deps/abseil_cpp-build/absl/strings/CMakeFiles/cord.dir/cord_analysis.cc.o709[ 25%] Linking CXX static library libabsl_log_initialize.a710[ 25%] Built target log_initialize711[ 25%] Linking CXX static library libabsl_flags_internal.a712[ 25%] Linking CXX static library libabsl_log_internal_log_sink_set.a713[ 25%] Built target flags_internal714[ 25%] Built target log_internal_log_sink_set715[ 25%] Building CXX object _deps/abseil_cpp-build/absl/log/CMakeFiles/log_internal_message.dir/internal/log_message.cc.o716[ 25%] Linking CXX static library libabsl_cord.a717[ 25%] Built target cord718[ 25%] Building CXX object _deps/abseil_cpp-build/absl/status/CMakeFiles/status.dir/internal/status_internal.cc.o719[ 25%] Building CXX object _deps/abseil_cpp-build/absl/container/CMakeFiles/raw_hash_set.dir/internal/raw_hash_set.cc.o720[ 25%] Building CXX object _deps/abseil_cpp-build/absl/status/CMakeFiles/status.dir/status.cc.o721[ 25%] Building CXX object _deps/abseil_cpp-build/absl/status/CMakeFiles/status.dir/status_payload_printer.cc.o722[ 25%] Linking CXX static library libabsl_log_internal_message.a723[ 25%] Built target log_internal_message724[ 25%] Building CXX object _deps/abseil_cpp-build/absl/log/CMakeFiles/log_internal_check_op.dir/internal/check_op.cc.o725[ 25%] Building CXX object _deps/abseil_cpp-build/absl/log/CMakeFiles/die_if_null.dir/die_if_null.cc.o726[ 25%] Linking CXX static library libabsl_die_if_null.a727[ 25%] Linking CXX static library libabsl_log_internal_check_op.a728[ 25%] Built target die_if_null729[ 25%] Built target log_internal_check_op730[ 25%] Linking CXX static library libabsl_status.a731[ 25%] Built target status732[ 25%] Building CXX object _deps/abseil_cpp-build/absl/status/CMakeFiles/statusor.dir/statusor.cc.o733[ 25%] Linking CXX static library libabsl_raw_hash_set.a734[ 25%] Built target raw_hash_set735[ 25%] Building CXX object _deps/abseil_cpp-build/absl/flags/CMakeFiles/flags_reflection.dir/reflection.cc.o736[ 25%] Linking CXX static library libabsl_statusor.a737[ 25%] Built target statusor738[ 25%] Linking CXX static library libabsl_flags_reflection.a739[ 25%] Built target flags_reflection740[ 25%] Running gen_proto.py on onnx/onnx-data.in.proto741[ 25%] Running gen_proto.py on onnx/onnx.in.proto742[ 26%] Running gen_proto.py on onnx/onnx-operators.in.proto743[ 26%] Building CXX object _deps/abseil_cpp-build/absl/flags/CMakeFiles/flags_usage_internal.dir/internal/usage.cc.o744[ 26%] Building CXX object _deps/re2-build/CMakeFiles/re2.dir/re2/bitmap256.cc.o745[ 26%] Building CXX object _deps/re2-build/CMakeFiles/re2.dir/re2/dfa.cc.o746[ 26%] Building CXX object _deps/re2-build/CMakeFiles/re2.dir/re2/compile.cc.o747[ 26%] Building CXX object _deps/re2-build/CMakeFiles/re2.dir/re2/bitstate.cc.o748[ 26%] Building CXX object _deps/re2-build/CMakeFiles/re2.dir/re2/mimics_pcre.cc.o749[ 26%] Building CXX object _deps/re2-build/CMakeFiles/re2.dir/re2/filtered_re2.cc.o750[ 26%] Building CXX object _deps/re2-build/CMakeFiles/re2.dir/re2/nfa.cc.o751[ 27%] Building CXX object _deps/re2-build/CMakeFiles/re2.dir/re2/prefilter.cc.o752[ 27%] Building CXX object _deps/re2-build/CMakeFiles/re2.dir/re2/perl_groups.cc.o753[ 27%] Building CXX object _deps/re2-build/CMakeFiles/re2.dir/re2/prefilter_tree.cc.o754[ 27%] Building CXX object _deps/re2-build/CMakeFiles/re2.dir/re2/regexp.cc.o755[ 27%] Building CXX object _deps/re2-build/CMakeFiles/re2.dir/re2/prog.cc.o756[ 27%] Building CXX object _deps/re2-build/CMakeFiles/re2.dir/re2/onepass.cc.o757[ 27%] Building CXX object _deps/re2-build/CMakeFiles/re2.dir/re2/parse.cc.o758[ 27%] Building CXX object _deps/re2-build/CMakeFiles/re2.dir/re2/re2.cc.o759[ 27%] Building CXX object _deps/re2-build/CMakeFiles/re2.dir/re2/set.cc.o760[ 27%] Building CXX object _deps/re2-build/CMakeFiles/re2.dir/re2/unicode_casefold.cc.o761[ 27%] Building CXX object _deps/re2-build/CMakeFiles/re2.dir/re2/tostring.cc.o762[ 27%] Building CXX object _deps/re2-build/CMakeFiles/re2.dir/re2/unicode_groups.cc.o763[ 27%] Building CXX object _deps/re2-build/CMakeFiles/re2.dir/re2/simplify.cc.o764[ 27%] Building CXX object _deps/re2-build/CMakeFiles/re2.dir/util/rune.cc.o765Processing /nix/store/54yzskzwmapls2awvih149wyzci717gw-onnx-src/onnx/onnx-data.in.proto766Writing /build/source/build/_deps/onnx-build/onnx/onnx-data.proto767Writing /build/source/build/_deps/onnx-build/onnx/onnx-data.proto3768generating /build/source/build/_deps/onnx-build/onnx/onnx_data_pb.py769Processing /nix/store/54yzskzwmapls2awvih149wyzci717gw-onnx-src/onnx/onnx-operators.in.proto770Writing /build/source/build/_deps/onnx-build/onnx/onnx-operators-ml.proto771Writing /build/source/build/_deps/onnx-build/onnx/onnx-operators-ml.proto3772generating /build/source/build/_deps/onnx-build/onnx/onnx_operators_pb.py773[ 27%] Building CXX object _deps/re2-build/CMakeFiles/re2.dir/util/strutil.cc.o774Processing /nix/store/54yzskzwmapls2awvih149wyzci717gw-onnx-src/onnx/onnx.in.proto775Writing /build/source/build/_deps/onnx-build/onnx/onnx-ml.proto776Writing /build/source/build/_deps/onnx-build/onnx/onnx-ml.proto3777generating /build/source/build/_deps/onnx-build/onnx/onnx_pb.py778[ 27%] Running C++ protocol buffer compiler on /build/source/build/_deps/onnx-build/onnx/onnx-data.proto779[ 27%] Running C++ protocol buffer compiler on /build/source/build/_deps/onnx-build/onnx/onnx-ml.proto780[ 27%] Running C++ protocol buffer compiler on /build/source/build/_deps/onnx-build/onnx/onnx-operators-ml.proto781[ 27%] Building CXX object _deps/onnx-build/CMakeFiles/onnx_proto.dir/onnx/onnx-ml.pb.cc.o782[ 27%] Building CXX object _deps/onnx-build/CMakeFiles/onnx_proto.dir/onnx/onnx-operators-ml.pb.cc.o783[ 27%] Building CXX object _deps/onnx-build/CMakeFiles/onnx_proto.dir/onnx/onnx-data.pb.cc.o784/nix/store/py2j3i67pywazyqfaya1m0wg9qbv3k3m-source/re2/regexp.cc: In member function 'int re2::Regexp::Ref()':785/nix/store/py2j3i67pywazyqfaya1m0wg9qbv3k3m-source/re2/regexp.cc:98:32: warning: 'absl::lts_20260817::MutexLock::MutexLock(absl::lts_20260817::Mutex*)' is deprecated: Use the constructor that takes a reference instead [-Wdeprecated-declarations]786 98 | absl::MutexLock l(ref_mutex());787 | ^788In file included from /nix/store/xfqnd1mhbii0bard2zmxx9pvfjizxhcr-source/absl/strings/internal/cordz_info.h:31,789 from /nix/store/xfqnd1mhbii0bard2zmxx9pvfjizxhcr-source/absl/strings/cord.h:94,790 from /nix/store/xfqnd1mhbii0bard2zmxx9pvfjizxhcr-source/absl/container/internal/hash_function_defaults.h:59,791 from /nix/store/xfqnd1mhbii0bard2zmxx9pvfjizxhcr-source/absl/container/hash_container_defaults.h:19,792 from /nix/store/xfqnd1mhbii0bard2zmxx9pvfjizxhcr-source/absl/container/flat_hash_map.h:43,793 from /nix/store/py2j3i67pywazyqfaya1m0wg9qbv3k3m-source/re2/regexp.cc:21:794/nix/store/xfqnd1mhbii0bard2zmxx9pvfjizxhcr-source/absl/synchronization/mutex.h:635:12: note: declared here795 635 | explicit MutexLock(Mutex* absl_nonnull mu) ABSL_EXCLUSIVE_LOCK_FUNCTION(mu)796 | ^~~~~~~~~797/nix/store/py2j3i67pywazyqfaya1m0wg9qbv3k3m-source/re2/regexp.cc: In member function 're2::Regexp* re2::Regexp::Incref()':798/nix/store/py2j3i67pywazyqfaya1m0wg9qbv3k3m-source/re2/regexp.cc:111:34: warning: 'absl::lts_20260817::MutexLock::MutexLock(absl::lts_20260817::Mutex*)' is deprecated: Use the constructor that takes a reference instead [-Wdeprecated-declarations]799 111 | absl::MutexLock l(ref_mutex());800 | ^801/nix/store/xfqnd1mhbii0bard2zmxx9pvfjizxhcr-source/absl/synchronization/mutex.h:635:12: note: declared here802 635 | explicit MutexLock(Mutex* absl_nonnull mu) ABSL_EXCLUSIVE_LOCK_FUNCTION(mu)803 | ^~~~~~~~~804/nix/store/py2j3i67pywazyqfaya1m0wg9qbv3k3m-source/re2/regexp.cc: In member function 'void re2::Regexp::Decref()':805/nix/store/py2j3i67pywazyqfaya1m0wg9qbv3k3m-source/re2/regexp.cc:131:34: warning: 'absl::lts_20260817::MutexLock::MutexLock(absl::lts_20260817::Mutex*)' is deprecated: Use the constructor that takes a reference instead [-Wdeprecated-declarations]806 131 | absl::MutexLock l(ref_mutex());807 | ^808/nix/store/xfqnd1mhbii0bard2zmxx9pvfjizxhcr-source/absl/synchronization/mutex.h:635:12: note: declared here809 635 | explicit MutexLock(Mutex* absl_nonnull mu) ABSL_EXCLUSIVE_LOCK_FUNCTION(mu)810 | ^~~~~~~~~811/nix/store/py2j3i67pywazyqfaya1m0wg9qbv3k3m-source/re2/dfa.cc: In member function 're2::DFA::State* re2::DFA::RunStateOnByteUnlocked(State*, int)':812/nix/store/py2j3i67pywazyqfaya1m0wg9qbv3k3m-source/re2/dfa.cc:1018:28: warning: 'absl::lts_20260817::MutexLock::MutexLock(absl::lts_20260817::Mutex*)' is deprecated: Use the constructor that takes a reference instead [-Wdeprecated-declarations]813 1018 | absl::MutexLock l(&mutex_);814 | ^815In file included from /nix/store/xfqnd1mhbii0bard2zmxx9pvfjizxhcr-source/absl/strings/internal/cordz_info.h:31,816 from /nix/store/xfqnd1mhbii0bard2zmxx9pvfjizxhcr-source/absl/strings/cord.h:94,817 from /nix/store/xfqnd1mhbii0bard2zmxx9pvfjizxhcr-source/absl/container/internal/hash_function_defaults.h:59,818 from /nix/store/xfqnd1mhbii0bard2zmxx9pvfjizxhcr-source/absl/container/hash_container_defaults.h:19,819 from /nix/store/xfqnd1mhbii0bard2zmxx9pvfjizxhcr-source/absl/container/flat_hash_map.h:43,820 from /nix/store/py2j3i67pywazyqfaya1m0wg9qbv3k3m-source/re2/dfa.cc:39:821/nix/store/xfqnd1mhbii0bard2zmxx9pvfjizxhcr-source/absl/synchronization/mutex.h:635:12: note: declared here822 635 | explicit MutexLock(Mutex* absl_nonnull mu) ABSL_EXCLUSIVE_LOCK_FUNCTION(mu)823 | ^~~~~~~~~824/nix/store/py2j3i67pywazyqfaya1m0wg9qbv3k3m-source/re2/dfa.cc: In constructor 're2::DFA::RWLocker::RWLocker(re2::DFA::CacheMutex*)':825/nix/store/py2j3i67pywazyqfaya1m0wg9qbv3k3m-source/re2/dfa.cc:1155:18: warning: 'void absl::lts_20260817::Mutex::ReaderLock()' is deprecated [-Wdeprecated-declarations]826 1155 | mu_->ReaderLock();827 | ~~~~~~~~~~~~~~~^~828/nix/store/xfqnd1mhbii0bard2zmxx9pvfjizxhcr-source/absl/synchronization/mutex.h:269:8: note: declared here829 269 | void ReaderLock() ABSL_SHARED_LOCK_FUNCTION() { lock_shared(); }830 | ^~~~~~~~~~831/nix/store/py2j3i67pywazyqfaya1m0wg9qbv3k3m-source/re2/dfa.cc: In member function 'void re2::DFA::RWLocker::LockForWriting()':832/nix/store/py2j3i67pywazyqfaya1m0wg9qbv3k3m-source/re2/dfa.cc:1162:22: warning: 'void absl::lts_20260817::Mutex::ReaderUnlock()' is deprecated [-Wdeprecated-declarations]833 1162 | mu_->ReaderUnlock();834 | ~~~~~~~~~~~~~~~~~^~835/nix/store/xfqnd1mhbii0bard2zmxx9pvfjizxhcr-source/absl/synchronization/mutex.h:279:8: note: declared here836 279 | void ReaderUnlock() ABSL_UNLOCK_FUNCTION() { unlock_shared(); }837 | ^~~~~~~~~~~~838/nix/store/py2j3i67pywazyqfaya1m0wg9qbv3k3m-source/re2/dfa.cc:1163:20: warning: 'void absl::lts_20260817::Mutex::WriterLock()' is deprecated [-Wdeprecated-declarations]839 1163 | mu_->WriterLock();840 | ~~~~~~~~~~~~~~~^~841/nix/store/xfqnd1mhbii0bard2zmxx9pvfjizxhcr-source/absl/synchronization/mutex.h:314:8: note: declared here842 314 | void WriterLock() ABSL_EXCLUSIVE_LOCK_FUNCTION() { lock(); }843 | ^~~~~~~~~~844/nix/store/py2j3i67pywazyqfaya1m0wg9qbv3k3m-source/re2/dfa.cc: In destructor 're2::DFA::RWLocker::~RWLocker()':845/nix/store/py2j3i67pywazyqfaya1m0wg9qbv3k3m-source/re2/dfa.cc:1170:22: warning: 'void absl::lts_20260817::Mutex::ReaderUnlock()' is deprecated [-Wdeprecated-declarations]846 1170 | mu_->ReaderUnlock();847 | ~~~~~~~~~~~~~~~~~^~848/nix/store/xfqnd1mhbii0bard2zmxx9pvfjizxhcr-source/absl/synchronization/mutex.h:279:8: note: declared here849 279 | void ReaderUnlock() ABSL_UNLOCK_FUNCTION() { unlock_shared(); }850 | ^~~~~~~~~~~~851/nix/store/py2j3i67pywazyqfaya1m0wg9qbv3k3m-source/re2/dfa.cc:1172:22: warning: 'void absl::lts_20260817::Mutex::WriterUnlock()' is deprecated [-Wdeprecated-declarations]852 1172 | mu_->WriterUnlock();853 | ~~~~~~~~~~~~~~~~~^~854/nix/store/xfqnd1mhbii0bard2zmxx9pvfjizxhcr-source/absl/synchronization/mutex.h:317:8: note: declared here855 317 | void WriterUnlock() ABSL_UNLOCK_FUNCTION() { unlock(); }856 | ^~~~~~~~~~~~857/nix/store/py2j3i67pywazyqfaya1m0wg9qbv3k3m-source/re2/dfa.cc: In member function 're2::DFA::State* re2::DFA::StateSaver::Restore()':858/nix/store/py2j3i67pywazyqfaya1m0wg9qbv3k3m-source/re2/dfa.cc:1270:34: warning: 'absl::lts_20260817::MutexLock::MutexLock(absl::lts_20260817::Mutex*)' is deprecated: Use the constructor that takes a reference instead [-Wdeprecated-declarations]859 1270 | absl::MutexLock l(&dfa_->mutex_);860 | ^861/nix/store/xfqnd1mhbii0bard2zmxx9pvfjizxhcr-source/absl/synchronization/mutex.h:635:12: note: declared here862 635 | explicit MutexLock(Mutex* absl_nonnull mu) ABSL_EXCLUSIVE_LOCK_FUNCTION(mu)863 | ^~~~~~~~~864/nix/store/py2j3i67pywazyqfaya1m0wg9qbv3k3m-source/re2/dfa.cc: In member function 'bool re2::DFA::AnalyzeSearchHelper(SearchParams*, StartInfo*, uint32_t)':865/nix/store/py2j3i67pywazyqfaya1m0wg9qbv3k3m-source/re2/dfa.cc:1733:28: warning: 'absl::lts_20260817::MutexLock::MutexLock(absl::lts_20260817::Mutex*)' is deprecated: Use the constructor that takes a reference instead [-Wdeprecated-declarations]866 1733 | absl::MutexLock l(&mutex_);867 | ^868/nix/store/xfqnd1mhbii0bard2zmxx9pvfjizxhcr-source/absl/synchronization/mutex.h:635:12: note: declared here869 635 | explicit MutexLock(Mutex* absl_nonnull mu) ABSL_EXCLUSIVE_LOCK_FUNCTION(mu)870 | ^~~~~~~~~871/nix/store/py2j3i67pywazyqfaya1m0wg9qbv3k3m-source/re2/dfa.cc: In member function 'bool re2::DFA::PossibleMatchRange(std::string*, std::string*, int)':872/nix/store/py2j3i67pywazyqfaya1m0wg9qbv3k3m-source/re2/dfa.cc:2053:31: warning: 'absl::lts_20260817::MutexLock::MutexLock(absl::lts_20260817::Mutex*)' is deprecated: Use the constructor that takes a reference instead [-Wdeprecated-declarations]873 2053 | absl::MutexLock lock(&mutex_);874 | ^875/nix/store/xfqnd1mhbii0bard2zmxx9pvfjizxhcr-source/absl/synchronization/mutex.h:635:12: note: declared here876 635 | explicit MutexLock(Mutex* absl_nonnull mu) ABSL_EXCLUSIVE_LOCK_FUNCTION(mu)877 | ^~~~~~~~~878[ 27%] Linking CXX static library libabsl_flags_usage_internal.a879[ 27%] Built target flags_usage_internal880[ 27%] Building CXX object _deps/abseil_cpp-build/absl/flags/CMakeFiles/flags_usage.dir/usage.cc.o881[ 27%] Linking CXX static library libre2.a882[ 27%] Linking CXX static library libabsl_flags_usage.a883[ 27%] Built target flags_usage884[ 28%] Building CXX object _deps/abseil_cpp-build/absl/flags/CMakeFiles/flags_parse.dir/parse.cc.o885[ 28%] Built target re2886[ 28%] Linking CXX static library libonnx_proto.a887[ 28%] Built target onnx_proto888[ 28%] Running cpp protocol buffer compiler (lite) on /build/source/onnxruntime/test/proto/tml.proto889[ 28%] Building CXX object CMakeFiles/onnxruntime_flatbuffers.dir/build/source/onnxruntime/core/flatbuffers/flatbuffers_utils.cc.o890[ 28%] Building CXX object CMakeFiles/onnxruntime_common.dir/build/source/onnxruntime/core/common/cpuid_info.cc.o891[ 28%] Building CXX object CMakeFiles/onnxruntime_lora.dir/build/source/onnxruntime/lora/adapter_format_utils.cc.o892[ 28%] Building CXX object CMakeFiles/onnxruntime_common.dir/build/source/onnxruntime/core/common/cpuid_info_vendor.cc.o893[ 29%] Building CXX object CMakeFiles/onnxruntime_common.dir/build/source/onnxruntime/core/common/cpuid_uarch.cc.o894[ 29%] Building CXX object CMakeFiles/onnxruntime_util.dir/build/source/onnxruntime/core/util/math_cpu.cc.o895[ 29%] Building CXX object CMakeFiles/onnxruntime_common.dir/build/source/onnxruntime/core/common/helper.cc.o896[ 29%] Building CXX object CMakeFiles/onnxruntime_common.dir/build/source/onnxruntime/core/common/denormal.cc.o897[ 29%] Building CXX object CMakeFiles/onnxruntime_util.dir/build/source/onnxruntime/core/util/thread_utils.cc.o898[ 29%] Building CXX object _deps/onnx-build/CMakeFiles/onnx.dir/onnx/common/ir_pb_converter.cc.o899[ 30%] Building CXX object _deps/onnx-build/CMakeFiles/onnx.dir/onnx/checker.cc.o900[ 30%] Building CXX object _deps/onnx-build/CMakeFiles/onnx.dir/onnx/common/assertions.cc.o901[ 30%] Building CXX object CMakeFiles/onnxruntime_common.dir/build/source/onnxruntime/core/common/logging/logging.cc.o902[ 30%] Building CXX object CMakeFiles/onnxruntime_common.dir/build/source/onnxruntime/core/common/logging/capture.cc.o903[ 30%] Building CXX object CMakeFiles/onnxruntime_graph.dir/build/source/onnxruntime/core/graph/contrib_ops/attn_lstm_schema_defs.cc.o904[ 30%] Building CXX object _deps/onnx-build/CMakeFiles/onnx.dir/onnx/common/interned_strings.cc.o905[ 30%] Building CXX object CMakeFiles/onnxruntime_common.dir/build/source/onnxruntime/core/common/profiler.cc.o906[ 30%] Building CXX object CMakeFiles/onnxruntime_providers_openvino.dir/build/source/onnxruntime/core/providers/openvino/backend_manager.cc.o907[ 30%] Building CXX object CMakeFiles/onnxruntime_common.dir/build/source/onnxruntime/core/common/logging/sinks/ostream_sink.cc.o908[ 30%] Building CXX object CMakeFiles/onnxruntime_framework.dir/build/source/onnxruntime/core/framework/allocation_planner.cc.o909[ 30%] Building CXX object CMakeFiles/onnxruntime_test_utils.dir/build/source/onnxruntime/test/util/compare_ortvalue.cc.o910[ 30%] Building CXX object CMakeFiles/onnxruntime_optimizer.dir/build/source/onnxruntime/core/optimizer/attention_fusion.cc.o911[ 30%] Building CXX object CMakeFiles/onnx_test_data_proto.dir/tml.pb.cc.o912[ 30%] Building CXX object CMakeFiles/onnxruntime_test_utils.dir/build/source/onnxruntime/test/util/default_providers.cc.o913[ 30%] Building CXX object CMakeFiles/onnxruntime_test_utils.dir/build/source/onnxruntime/test/util/file_util.cc.o914[ 30%] Building CXX object CMakeFiles/onnxruntime_test_utils.dir/build/source/onnxruntime/test/util/scoped_env_vars.cc.o915[ 30%] Linking CXX static library libabsl_flags_parse.a916[ 30%] Built target flags_parse917[ 30%] Building CXX object CMakeFiles/onnxruntime_test_utils.dir/build/source/onnxruntime/test/util/temp_dir.cc.o918[ 30%] Building CXX object CMakeFiles/onnxruntime_test_utils.dir/build/source/onnxruntime/test/util/tensors_from_file.cc.o919[ 31%] Building CXX object CMakeFiles/onnxruntime_test_utils.dir/build/source/onnxruntime/test/util/test_allocator.cc.o920[ 31%] Building CXX object CMakeFiles/onnxruntime_test_utils.dir/build/source/onnxruntime/test/util/test_environment.cc.o921[ 31%] Building CXX object CMakeFiles/onnxruntime_providers_openvino.dir/build/source/onnxruntime/core/providers/openvino/backend_utils.cc.o922[ 31%] Building CXX object CMakeFiles/onnxruntime_providers_openvino.dir/build/source/onnxruntime/core/providers/openvino/backends/backend_factory.cc.o923[ 31%] Building CXX object CMakeFiles/onnxruntime_providers_openvino.dir/build/source/onnxruntime/core/providers/openvino/backends/basic_backend.cc.o924[ 31%] Building CXX object CMakeFiles/onnxruntime_test_utils.dir/build/source/onnxruntime/test/util/test_random_seed.cc.o925[ 32%] Building CXX object CMakeFiles/onnxruntime_common.dir/build/source/onnxruntime/core/common/profiler_common.cc.o926[ 32%] Building CXX object CMakeFiles/onnxruntime_providers_openvino.dir/build/source/onnxruntime/core/providers/openvino/onnx_ctx_model_helper.cc.o927/build/source/onnxruntime/core/flatbuffers/flatbuffers_utils.cc: In function 'onnxruntime::common::Status onnxruntime::fbs::utils::LoadTensorShapeOrtFormat(const onnxruntime::fbs::Shape&, onnx::TensorShapeProto&)':928/build/source/onnxruntime/core/flatbuffers/flatbuffers_utils.cc:203:34: warning: unused variable 'dim' [-Wunused-variable]929 203 | TensorShapeProto_Dimension dim;930 | ^~~931[ 32%] Building CXX object CMakeFiles/onnxruntime_providers_openvino.dir/build/source/onnxruntime/core/providers/openvino/openvino_execution_provider.cc.o932[ 32%] Building CXX object CMakeFiles/onnxruntime_providers_openvino.dir/build/source/onnxruntime/core/providers/openvino/openvino_parser_utils.cc.o933[ 32%] Building CXX object CMakeFiles/onnxruntime_providers_openvino.dir/build/source/onnxruntime/core/providers/openvino/openvino_provider_dllmain.cc.o934[ 32%] Building CXX object CMakeFiles/onnxruntime_common.dir/build/source/onnxruntime/core/common/semver.cc.o935[ 32%] Building CXX object CMakeFiles/onnxruntime_common.dir/build/source/onnxruntime/core/common/spin_pause.cc.o936[ 32%] Building CXX object CMakeFiles/onnxruntime_test_utils.dir/build/source/onnxruntime/test/util/test_utils.cc.o937[ 33%] Building CXX object CMakeFiles/onnxruntime_graph.dir/build/source/onnxruntime/core/graph/contrib_ops/bert_defs.cc.o938[ 33%] Linking CXX static library libonnx_test_data_proto.a939[ 33%] Built target onnx_test_data_proto940[ 33%] Building CXX object CMakeFiles/onnxruntime_graph.dir/build/source/onnxruntime/core/graph/contrib_ops/collective_defs.cc.o941[ 33%] Building CXX object CMakeFiles/onnxruntime_graph.dir/build/source/onnxruntime/core/graph/contrib_ops/contrib_defs.cc.o942[ 33%] Building CXX object CMakeFiles/onnxruntime_optimizer.dir/build/source/onnxruntime/core/optimizer/bias_dropout_fusion.cc.o943[ 33%] Linking CXX static library libonnxruntime_flatbuffers.a944[ 33%] Built target onnxruntime_flatbuffers945[ 33%] Linking CXX static library libonnxruntime_lora.a946[ 33%] Building CXX object CMakeFiles/onnxruntime_common.dir/build/source/onnxruntime/core/common/status.cc.o947[ 33%] Built target onnxruntime_lora948[ 33%] Building CXX object _deps/onnx-build/CMakeFiles/onnx.dir/onnx/common/model_helpers.cc.o949[ 33%] Building CXX object CMakeFiles/onnxruntime_framework.dir/build/source/onnxruntime/core/framework/allocator.cc.o950[ 33%] Building CXX object CMakeFiles/onnxruntime_common.dir/build/source/onnxruntime/core/common/threadpool.cc.o951[ 33%] Building CXX object CMakeFiles/onnxruntime_common.dir/build/source/onnxruntime/core/platform/check_intel.cc.o952[ 33%] Building CXX object _deps/onnx-build/CMakeFiles/onnx.dir/onnx/common/status.cc.o953[ 33%] Building CXX object CMakeFiles/onnxruntime_providers_openvino.dir/build/source/onnxruntime/core/providers/openvino/openvino_provider_factory.cc.o954/build/source/onnxruntime/core/graph/contrib_ops/bert_defs.cc: In function 'void onnxruntime::contrib::PagedAttentionTypeAndShapeInference(onnx::InferenceContext&)':955/build/source/onnxruntime/core/graph/contrib_ops/bert_defs.cc:1410:40: warning: unused variable 'output_shape' [-Wunused-variable]956 1410 | ONNX_NAMESPACE::TensorShapeProto output_shape;957 | ^~~~~~~~~~~~958[ 34%] Building CXX object CMakeFiles/onnxruntime_providers_openvino.dir/build/source/onnxruntime/core/providers/openvino/ov_allocator.cc.o959[ 34%] Building CXX object CMakeFiles/onnxruntime_providers_openvino.dir/build/source/onnxruntime/core/providers/openvino/ov_bin_manager.cc.o960/build/source/onnxruntime/core/providers/openvino/openvino_execution_provider.cc: In function 'std::vector<std::__cxx11::basic_string<char> > onnxruntime::openvino_ep::parseDevices(const std::string&, const std::vector<std::__cxx11::basic_string<char> >&)':961/build/source/onnxruntime/core/providers/openvino/openvino_execution_provider.cc:46:12: warning: variable 'dev_options_update' set but not used [-Wunused-but-set-variable=]962 46 | auto dev_options_update = dev_options.emplace(device);963 | ^~~~~~~~~~~~~~~~~~964In file included from /nix/store/2rq4fv67zqcgx3rm8a3q5yq3g2z8hrcp-eigen-3.4.1/include/eigen3/unsupported/Eigen/CXX11/Tensor:63,965 from /build/source/include/onnxruntime/core/common/eigen_common_wrapper.h:70,966 from /build/source/onnxruntime/core/common/threadpool.cc:22:967/nix/store/2rq4fv67zqcgx3rm8a3q5yq3g2z8hrcp-eigen-3.4.1/include/eigen3/unsupported/Eigen/CXX11/src/Tensor/TensorDeviceThreadPool.h: In lambda function:968/nix/store/2rq4fv67zqcgx3rm8a3q5yq3g2z8hrcp-eigen-3.4.1/include/eigen3/unsupported/Eigen/CXX11/src/Tensor/TensorDeviceThreadPool.h:210:19: warning: implicit capture of 'this' via '[=]' is deprecated in C++20 [-Wdeprecated]969 210 | handleRange = [=, &handleRange, &barrier, &f](Index firstIdx,970 | ^971/nix/store/2rq4fv67zqcgx3rm8a3q5yq3g2z8hrcp-eigen-3.4.1/include/eigen3/unsupported/Eigen/CXX11/src/Tensor/TensorDeviceThreadPool.h:210:19: note: add explicit 'this' or '*this' capture972In file included from /nix/store/2rq4fv67zqcgx3rm8a3q5yq3g2z8hrcp-eigen-3.4.1/include/eigen3/unsupported/Eigen/CXX11/Tensor:91:973/nix/store/2rq4fv67zqcgx3rm8a3q5yq3g2z8hrcp-eigen-3.4.1/include/eigen3/unsupported/Eigen/CXX11/src/Tensor/TensorContractionThreadPool.h: In lambda function:974/nix/store/2rq4fv67zqcgx3rm8a3q5yq3g2z8hrcp-eigen-3.4.1/include/eigen3/unsupported/Eigen/CXX11/src/Tensor/TensorContractionThreadPool.h:1009:13: warning: implicit capture of 'this' via '[=]' is deprecated in C++20 [-Wdeprecated]975 1009 | [=]() { kernel(m, n, k, use_thread_local); });976 | ^977/nix/store/2rq4fv67zqcgx3rm8a3q5yq3g2z8hrcp-eigen-3.4.1/include/eigen3/unsupported/Eigen/CXX11/src/Tensor/TensorContractionThreadPool.h:1009:13: note: add explicit 'this' or '*this' capture978/nix/store/2rq4fv67zqcgx3rm8a3q5yq3g2z8hrcp-eigen-3.4.1/include/eigen3/unsupported/Eigen/CXX11/src/Tensor/TensorContractionThreadPool.h: In lambda function:979/nix/store/2rq4fv67zqcgx3rm8a3q5yq3g2z8hrcp-eigen-3.4.1/include/eigen3/unsupported/Eigen/CXX11/src/Tensor/TensorContractionThreadPool.h:1063:15: warning: implicit capture of 'this' via '[=]' is deprecated in C++20 [-Wdeprecated]980 1063 | [=]() { enqueue_packing_helper(mid, end, k, rhs); });981 | ^982/nix/store/2rq4fv67zqcgx3rm8a3q5yq3g2z8hrcp-eigen-3.4.1/include/eigen3/unsupported/Eigen/CXX11/src/Tensor/TensorContractionThreadPool.h:1063:15: note: add explicit 'this' or '*this' capture983/nix/store/2rq4fv67zqcgx3rm8a3q5yq3g2z8hrcp-eigen-3.4.1/include/eigen3/unsupported/Eigen/CXX11/src/Tensor/TensorContractionThreadPool.h: In lambda function:984/nix/store/2rq4fv67zqcgx3rm8a3q5yq3g2z8hrcp-eigen-3.4.1/include/eigen3/unsupported/Eigen/CXX11/src/Tensor/TensorContractionThreadPool.h:1082:15: warning: implicit capture of 'this' via '[=]' is deprecated in C++20 [-Wdeprecated]985 1082 | [=]() { enqueue_packing_helper(start, end, k, rhs); });986 | ^987/nix/store/2rq4fv67zqcgx3rm8a3q5yq3g2z8hrcp-eigen-3.4.1/include/eigen3/unsupported/Eigen/CXX11/src/Tensor/TensorContractionThreadPool.h:1082:15: note: add explicit 'this' or '*this' capture988[ 34%] Building CXX object CMakeFiles/onnxruntime_providers_openvino.dir/build/source/onnxruntime/core/providers/openvino/ov_factory.cc.o989[ 34%] Building CXX object CMakeFiles/onnx_test_runner_common.dir/build/source/onnxruntime/test/onnx/TestCase.cc.o990[ 34%] Building CXX object _deps/onnx-build/CMakeFiles/onnx.dir/onnx/defs/attr_proto_util.cc.o991[ 34%] Building CXX object CMakeFiles/onnxruntime_optimizer.dir/build/source/onnxruntime/core/optimizer/bias_gelu_fusion.cc.o992[ 34%] Building CXX object CMakeFiles/onnxruntime_common.dir/build/source/onnxruntime/core/platform/device_discovery_common.cc.o993/build/source/onnxruntime/core/providers/openvino/openvino_execution_provider.cc: At global scope:994/build/source/onnxruntime/core/providers/openvino/openvino_execution_provider.cc:31:33: warning: 'std::vector<std::__cxx11::basic_string<char> > onnxruntime::openvino_ep::parseDevices(const std::string&, const std::vector<std::__cxx11::basic_string<char> >&)' defined but not used [-Wunused-function]995 31 | static std::vector<std::string> parseDevices(const std::string& device_string,996 | ^~~~~~~~~~~~997[ 34%] Building CXX object CMakeFiles/onnxruntime_optimizer.dir/build/source/onnxruntime/core/optimizer/bias_skip_layer_norm_fusion.cc.o998[ 34%] Building CXX object CMakeFiles/onnxruntime_optimizer.dir/build/source/onnxruntime/core/optimizer/bias_softmax_fusion.cc.o999[ 34%] Building CXX object CMakeFiles/onnxruntime_optimizer.dir/build/source/onnxruntime/core/optimizer/cast_chain_elimination.cc.o1000[ 34%] Building CXX object CMakeFiles/onnxruntime_optimizer.dir/build/source/onnxruntime/core/optimizer/cast_elimination.cc.o1001[ 34%] Building CXX object CMakeFiles/onnxruntime_optimizer.dir/build/source/onnxruntime/core/optimizer/common_subexpression_elimination.cc.o1002[ 34%] Building CXX object CMakeFiles/onnxruntime_optimizer.dir/build/source/onnxruntime/core/optimizer/compute_optimizer/shared_utils.cc.o1003[ 34%] Building CXX object CMakeFiles/onnxruntime_providers_openvino.dir/build/source/onnxruntime/core/providers/openvino/ov_interface.cc.o1004[ 34%] Building CXX object CMakeFiles/onnxruntime_providers_openvino.dir/build/source/onnxruntime/core/providers/openvino/ov_protobuf_utils.cpp.o1005[ 34%] Building CXX object CMakeFiles/onnxruntime_session.dir/build/source/onnxruntime/core/session/IOBinding.cc.o1006[ 34%] Building CXX object CMakeFiles/onnxruntime_session.dir/build/source/onnxruntime/core/session/abi_ep_types.cc.o1007[ 34%] Building CXX object CMakeFiles/onnxruntime_graph.dir/build/source/onnxruntime/core/graph/contrib_ops/diffusion_defs.cc.o1008[ 34%] Building CXX object CMakeFiles/onnxruntime_graph.dir/build/source/onnxruntime/core/graph/contrib_ops/internal_nhwc_onnx_schemas.cc.o1009[ 34%] Building CXX object CMakeFiles/onnxruntime_graph.dir/build/source/onnxruntime/core/graph/contrib_ops/nchwc_schema_defs.cc.o1010[ 34%] Building CXX object _deps/onnx-build/CMakeFiles/onnx.dir/onnx/defs/controlflow/defs.cc.o1011[ 34%] Building CXX object CMakeFiles/onnxruntime_common.dir/build/source/onnxruntime/core/platform/env.cc.o1012[ 34%] Building CXX object CMakeFiles/onnxruntime_common.dir/build/source/onnxruntime/core/platform/env_time.cc.o1013[ 34%] Building CXX object CMakeFiles/onnxruntime_framework.dir/build/source/onnxruntime/core/framework/allocator_utils.cc.o1014[ 34%] Building CXX object CMakeFiles/onnxruntime_framework.dir/build/source/onnxruntime/core/framework/bfc_arena.cc.o1015[ 34%] Building CXX object CMakeFiles/onnxruntime_common.dir/build/source/onnxruntime/core/platform/linux/device_discovery.cc.o1016[ 34%] Building CXX object CMakeFiles/onnxruntime_common.dir/build/source/onnxruntime/core/platform/logging/make_platform_default_log_sink.cc.o1017[ 34%] Building CXX object CMakeFiles/onnxruntime_graph.dir/build/source/onnxruntime/core/graph/contrib_ops/nhwc_schema_defs.cc.o1018[ 34%] Building CXX object CMakeFiles/onnxruntime_providers_openvino.dir/build/source/onnxruntime/core/providers/openvino/ov_shared_context.cc.o1019[ 34%] Building CXX object CMakeFiles/onnxruntime_providers_openvino.dir/build/source/onnxruntime/core/providers/openvino/ov_stateful_patch_utils.cc.o1020[ 34%] Building CXX object CMakeFiles/onnxruntime_graph.dir/build/source/onnxruntime/core/graph/contrib_ops/onnx_deprecated_operators.cc.o1021[ 34%] Building CXX object CMakeFiles/onnxruntime_optimizer.dir/build/source/onnxruntime/core/optimizer/compute_optimizer/upstream_gather.cc.o1022[ 34%] Building CXX object _deps/onnx-build/CMakeFiles/onnx.dir/onnx/defs/controlflow/old.cc.o1023[ 34%] Building CXX object _deps/onnx-build/CMakeFiles/onnx.dir/onnx/defs/controlflow/utils.cc.o1024[ 34%] Linking CXX static library libonnxruntime_test_utils.a1025[ 34%] Building CXX object _deps/onnx-build/CMakeFiles/onnx.dir/onnx/defs/data_type_utils.cc.o1026[ 34%] Building CXX object _deps/onnx-build/CMakeFiles/onnx.dir/onnx/defs/doc_strings.cc.o1027[ 34%] Building CXX object _deps/onnx-build/CMakeFiles/onnx.dir/onnx/defs/function.cc.o1028[ 34%] Building CXX object CMakeFiles/onnxruntime_graph.dir/build/source/onnxruntime/core/graph/contrib_ops/onnx_function_util.cc.o1029[ 34%] Built target onnxruntime_test_utils1030[ 34%] Building CXX object CMakeFiles/onnxruntime_graph.dir/build/source/onnxruntime/core/graph/contrib_ops/quantization_defs.cc.o1031[ 34%] Building CXX object CMakeFiles/onnxruntime_session.dir/build/source/onnxruntime/core/session/abi_session_options.cc.o1032[ 34%] Building CXX object CMakeFiles/onnxruntime_session.dir/build/source/onnxruntime/core/session/allocator_adapters.cc.o1033[ 34%] Building CXX object CMakeFiles/onnxruntime_session.dir/build/source/onnxruntime/core/session/compile_api.cc.o1034[ 34%] Building CXX object CMakeFiles/onnxruntime_optimizer.dir/build/source/onnxruntime/core/optimizer/compute_optimizer/upstream_gather_actors.cc.o1035[ 34%] Building CXX object CMakeFiles/onnxruntime_optimizer.dir/build/source/onnxruntime/core/optimizer/compute_optimizer/upstream_reshape.cc.o1036[ 34%] Building CXX object CMakeFiles/onnxruntime_optimizer.dir/build/source/onnxruntime/core/optimizer/compute_optimizer/upstream_reshape_actors.cc.o1037[ 34%] Building CXX object CMakeFiles/onnxruntime_providers_openvino.dir/build/source/onnxruntime/core/providers/openvino/ov_tracing.cc.o1038[ 34%] Building CXX object CMakeFiles/onnx_test_runner_common.dir/build/source/onnxruntime/test/onnx/TestCaseResult.cc.o1039[ 34%] Building CXX object CMakeFiles/onnxruntime_optimizer.dir/build/source/onnxruntime/core/optimizer/compute_optimizer/upstream_transformer_base.cc.o1040[ 34%] Building CXX object CMakeFiles/onnxruntime_optimizer.dir/build/source/onnxruntime/core/optimizer/concat_slice_elimination.cc.o1041[ 34%] Building CXX object CMakeFiles/onnxruntime_providers_openvino.dir/build/source/onnxruntime/core/providers/openvino/ov_versions/capability.cc.o1042[ 34%] Building CXX object CMakeFiles/onnxruntime_framework.dir/build/source/onnxruntime/core/framework/callback.cc.o1043[ 35%] Building CXX object CMakeFiles/onnxruntime_framework.dir/build/source/onnxruntime/core/framework/config_options.cc.o1044[ 35%] Building CXX object CMakeFiles/onnxruntime_providers_openvino.dir/build/source/onnxruntime/core/providers/openvino/ov_versions/data_ops.cc.o1045[ 35%] Building CXX object CMakeFiles/onnx_test_runner_common.dir/build/source/onnxruntime/test/onnx/TestResultStat.cc.o1046[ 35%] Building CXX object CMakeFiles/onnx_test_runner_common.dir/build/source/onnxruntime/test/onnx/callback.cc.o1047[ 35%] Building CXX object CMakeFiles/onnxruntime_common.dir/build/source/onnxruntime/core/platform/path_lib.cc.o1048[ 35%] Building CXX object CMakeFiles/onnx_test_runner_common.dir/build/source/onnxruntime/test/onnx/dataitem_request.cc.o1049[ 36%] Building CXX object CMakeFiles/onnx_test_runner_common.dir/build/source/onnxruntime/test/onnx/heap_buffer.cc.o1050[ 36%] Building CXX object CMakeFiles/onnxruntime_graph.dir/build/source/onnxruntime/core/graph/contrib_ops/range_schema_defs.cc.o1051[ 36%] Building CXX object CMakeFiles/onnxruntime_providers_openvino.dir/build/source/onnxruntime/core/providers/openvino/ov_versions/utils.cc.o1052[ 36%] Building CXX object CMakeFiles/onnxruntime_common.dir/build/source/onnxruntime/core/platform/posix/env.cc.o1053[ 36%] Building CXX object CMakeFiles/onnx_test_runner_common.dir/build/source/onnxruntime/test/onnx/onnx_model_info.cc.o1054[ 36%] Building CXX object CMakeFiles/onnx_test_runner_common.dir/build/source/onnxruntime/test/onnx/pb_helper.cc.o1055[ 36%] Building CXX object CMakeFiles/onnxruntime_framework.dir/build/source/onnxruntime/core/framework/copy.cc.o1056[ 36%] Building CXX object CMakeFiles/onnxruntime_framework.dir/build/source/onnxruntime/core/framework/customregistry.cc.o1057[ 36%] Building CXX object CMakeFiles/onnxruntime_framework.dir/build/source/onnxruntime/core/framework/data_transfer.cc.o1058[ 36%] Building CXX object CMakeFiles/onnxruntime_framework.dir/build/source/onnxruntime/core/framework/data_transfer_manager.cc.o1059[ 36%] Building CXX object CMakeFiles/onnxruntime_framework.dir/build/source/onnxruntime/core/framework/data_types.cc.o1060[ 36%] Building CXX object CMakeFiles/onnxruntime_framework.dir/build/source/onnxruntime/core/framework/debug_node_inputs_outputs_utils.cc.o1061[ 36%] Building CXX object CMakeFiles/onnxruntime_graph.dir/build/source/onnxruntime/core/graph/contrib_ops/shape_inference_functions.cc.o1062[ 36%] Building CXX object CMakeFiles/onnxruntime_graph.dir/build/source/onnxruntime/core/graph/data_propagation/add_op_data_propagation.cc.o1063[ 36%] Building CXX object _deps/onnx-build/CMakeFiles/onnx.dir/onnx/defs/generator/defs.cc.o1064[ 36%] Building CXX object CMakeFiles/onnxruntime_framework.dir/build/source/onnxruntime/core/framework/device_stream_collection.cc.o1065[ 36%] Building CXX object CMakeFiles/onnxruntime_framework.dir/build/source/onnxruntime/core/framework/empty.cc.o1066[ 36%] Building CXX object CMakeFiles/onnxruntime_session.dir/build/source/onnxruntime/core/session/custom_ops.cc.o1067[ 36%] Building CXX object CMakeFiles/onnxruntime_common.dir/build/source/onnxruntime/core/platform/posix/env_time.cc.o1068[ 36%] Building CXX object CMakeFiles/onnxruntime_providers_openvino.dir/build/source/onnxruntime/core/providers/openvino/qdq_transformations/qdq_scales_fix.cc.o1069[ 36%] Building CXX object CMakeFiles/onnxruntime_common.dir/build/source/onnxruntime/core/platform/posix/stacktrace.cc.o1070[ 36%] Building CXX object CMakeFiles/onnxruntime_common.dir/build/source/onnxruntime/core/platform/telemetry.cc.o1071[ 36%] Building CXX object CMakeFiles/onnx_test_runner_common.dir/build/source/onnxruntime/test/onnx/tensorprotoutils.cc.o1072[ 37%] Building CXX object CMakeFiles/onnxruntime_optimizer.dir/build/source/onnxruntime/core/optimizer/constant_folding.cc.o1073[ 37%] Building CXX object CMakeFiles/onnx_test_runner_common.dir/build/source/onnxruntime/test/onnx/testcase_driver.cc.o1074[ 37%] Building CXX object CMakeFiles/onnxruntime_framework.dir/build/source/onnxruntime/core/framework/endian_utils.cc.o1075[ 37%] Building CXX object CMakeFiles/onnx_test_runner_common.dir/build/source/onnxruntime/test/onnx/testcase_request.cc.o1076[ 37%] Building CXX object CMakeFiles/onnxruntime_session.dir/build/source/onnxruntime/core/session/default_cpu_allocator_c_api.cc.o1077[ 37%] Building CXX object CMakeFiles/onnxruntime_session.dir/build/source/onnxruntime/core/session/environment.cc.o1078[ 38%] Linking CXX static library libonnxruntime_common.a1079[ 38%] Building CXX object CMakeFiles/onnxruntime_providers_openvino.dir/build/source/onnxruntime/core/providers/openvino/qdq_transformations/qdq_stripping.cc.o1080[ 38%] Building CXX object CMakeFiles/onnxruntime_providers_openvino.dir/build/source/onnxruntime/core/providers/shared_library/provider_bridge_provider.cc.o1081[ 38%] Building CXX object CMakeFiles/onnxruntime_framework.dir/build/source/onnxruntime/core/framework/ep_context_options.cc.o1082[ 38%] Building CXX object CMakeFiles/onnx_test_runner_common.dir/build/source/onnxruntime/test/onnx/testenv.cc.o1083[ 38%] Built target onnxruntime_common1084[ 38%] Building CXX object CMakeFiles/onnxruntime_framework.dir/build/source/onnxruntime/core/framework/ep_context_utils.cc.o1085[ 38%] Linking CXX static library libonnxruntime_util.a1086[ 38%] Built target onnxruntime_util1087[ 38%] Building CXX object CMakeFiles/onnxruntime_framework.dir/build/source/onnxruntime/core/framework/error_code.cc.o1088[ 38%] Building CXX object _deps/onnx-build/CMakeFiles/onnx.dir/onnx/defs/generator/old.cc.o1089[ 38%] Building CXX object _deps/onnx-build/CMakeFiles/onnx.dir/onnx/defs/generator/utils.cc.o1090[ 38%] Building CXX object CMakeFiles/onnxruntime_mlas_q4dq.dir/build/source/onnxruntime/core/mlas/lib/q4_dq_cli.cpp.o1091[ 38%] Building CXX object CMakeFiles/onnxruntime_runtime_path_test_shared_library.dir/build/source/onnxruntime/test/shared_lib/runtime_path_test_shared_library/runtime_path_test_shared_library.cc.o1092[ 38%] Building CXX object CMakeFiles/onnxruntime_graph.dir/build/source/onnxruntime/core/graph/data_propagation/custom_data_propagation.cc.o1093[ 38%] Building CXX object CMakeFiles/onnxruntime_mlas_test.dir/build/source/onnxruntime/test/mlas/unittest/test_activation.cpp.o1094[ 38%] Building CXX object CMakeFiles/onnxruntime_mlas_test.dir/build/source/onnxruntime/test/mlas/unittest/test_blkq8.cpp.o1095[ 38%] Linking CXX executable onnxruntime_mlas_q4dq1096[ 38%] Building CXX object CMakeFiles/onnx_test_runner_common.dir/build/source/onnxruntime/core/framework/endian_utils.cc.o1097[ 38%] Building CXX object CMakeFiles/onnxruntime_mlas_test.dir/build/source/onnxruntime/test/mlas/unittest/test_blockq4.cpp.o1098[ 38%] Building CXX object CMakeFiles/onnxruntime_mlas_test.dir/build/source/onnxruntime/test/mlas/unittest/test_cast_fp16.cpp.o1099[ 38%] Building CXX object CMakeFiles/onnxruntime_mlas_test.dir/build/source/onnxruntime/test/mlas/unittest/test_conv2d.cpp.o1100[ 38%] Building CXX object CMakeFiles/onnxruntime_mlas_test.dir/build/source/onnxruntime/test/mlas/unittest/test_conv2d_nchwc.cpp.o1101[ 38%] Building CXX object CMakeFiles/onnxruntime_framework.dir/build/source/onnxruntime/core/framework/ex_lib_loader.cc.o1102[ 38%] Building CXX object CMakeFiles/onnxruntime_optimizer.dir/build/source/onnxruntime/core/optimizer/constant_sharing.cc.o1103[ 39%] Linking CXX shared library libonnxruntime_runtime_path_test_shared_library.so1104[ 39%] Building CXX object CMakeFiles/onnxruntime_framework.dir/build/source/onnxruntime/core/framework/execution_frame.cc.o1105[ 39%] Building CXX object CMakeFiles/onnxruntime_mlas_test.dir/build/source/onnxruntime/test/mlas/unittest/test_dequantizelinear.cpp.o1106[ 39%] Building CXX object CMakeFiles/onnxruntime_framework.dir/build/source/onnxruntime/core/framework/execution_provider.cc.o1107[ 39%] Building CXX object CMakeFiles/onnxruntime_mlas_test.dir/build/source/onnxruntime/test/mlas/unittest/test_dynamic_qgemm.cpp.o1108[ 39%] Linking CXX static library libonnx_test_runner_common.a1109[ 39%] Built target onnx_test_runner_common1110[ 39%] Building CXX object CMakeFiles/onnxruntime_session.dir/build/source/onnxruntime/core/session/inference_session.cc.o1111[ 39%] Building CXX object CMakeFiles/onnxruntime_providers_openvino.dir/build/source/onnxruntime/core/providers/shared_library/provider_ort_api_init.cc.o1112[ 39%] Building CXX object CMakeFiles/onnxruntime_mlas_test.dir/build/source/onnxruntime/test/mlas/unittest/test_eltwise.cpp.o1113[ 39%] Building CXX object CMakeFiles/onnxruntime_mlas_test.dir/build/source/onnxruntime/test/mlas/unittest/test_fgemm.cpp.o1114[ 39%] Building CXX object _deps/onnx-build/CMakeFiles/onnx.dir/onnx/defs/image/defs.cc.o1115[ 39%] Building CXX object CMakeFiles/onnxruntime_optimizer.dir/build/source/onnxruntime/core/optimizer/conv_activation_fusion.cc.o1116[ 39%] Building CXX object CMakeFiles/onnxruntime_optimizer.dir/build/source/onnxruntime/core/optimizer/conv_add_act_fusion.cc.o1117[ 39%] Building CXX object CMakeFiles/onnxruntime_optimizer.dir/build/source/onnxruntime/core/optimizer/conv_add_fusion.cc.o1118[ 40%] Building CXX object CMakeFiles/onnxruntime_framework.dir/build/source/onnxruntime/core/framework/execution_steps.cc.o1119[ 40%] Building CXX object CMakeFiles/onnxruntime_framework.dir/build/source/onnxruntime/core/framework/external_data_loader.cc.o1120[ 41%] Building CXX object _deps/onnx-build/CMakeFiles/onnx.dir/onnx/defs/logical/defs.cc.o1121[ 41%] Building CXX object CMakeFiles/onnxruntime_optimizer.dir/build/source/onnxruntime/core/optimizer/conv_bn_fusion.cc.o1122[ 41%] Building CXX object CMakeFiles/onnxruntime_optimizer.dir/build/source/onnxruntime/core/optimizer/conv_mul_fusion.cc.o1123[ 41%] Building CXX object CMakeFiles/onnxruntime_optimizer.dir/build/source/onnxruntime/core/optimizer/div_mul_fusion.cc.o1124[ 41%] Building CXX object CMakeFiles/onnxruntime_mlas_test.dir/build/source/onnxruntime/test/mlas/unittest/test_fp16_activation.cpp.o1125[ 41%] Building CXX object CMakeFiles/onnxruntime_graph.dir/build/source/onnxruntime/core/graph/data_propagation/div_op_data_propagation.cc.o1126[ 41%] Built target onnxruntime_runtime_path_test_shared_library1127[ 41%] Building CXX object CMakeFiles/onnxruntime_session.dir/build/source/onnxruntime/core/session/inference_session_utils.cc.o1128[ 41%] Building CXX object CMakeFiles/onnxruntime_optimizer.dir/build/source/onnxruntime/core/optimizer/double_qdq_pairs_remover.cc.o1129[ 41%] Building CXX object _deps/onnx-build/CMakeFiles/onnx.dir/onnx/defs/logical/old.cc.o1130[ 41%] Building CXX object _deps/onnx-build/CMakeFiles/onnx.dir/onnx/defs/math/defs.cc.o1131[ 41%] Linking CXX shared module libonnxruntime_providers_openvino.so1132/nix/store/54yzskzwmapls2awvih149wyzci717gw-onnx-src/onnx/defs/logical/defs.cc: In function 'std::function<void(onnx::OpSchema&)> onnx::BinaryLogicDocGenerator(const char*)':1133/nix/store/54yzskzwmapls2awvih149wyzci717gw-onnx-src/onnx/defs/logical/defs.cc:32:68: warning: unused parameter 'name' [-Wunused-parameter]1134 32 | std::function<void(OpSchema&)> BinaryLogicDocGenerator(const char* name) {1135 | ~~~~~~~~~~~~^~~~1136/nix/store/54yzskzwmapls2awvih149wyzci717gw-onnx-src/onnx/defs/logical/defs.cc: In function 'std::function<void(onnx::OpSchema&)> onnx::BinaryBitwiseDocGenerator(const char*)':1137/nix/store/54yzskzwmapls2awvih149wyzci717gw-onnx-src/onnx/defs/logical/defs.cc:252:77: warning: unused parameter 'name' [-Wunused-parameter]1138 252 | static std::function<void(OpSchema&)> BinaryBitwiseDocGenerator(const char* name) {1139 | ~~~~~~~~~~~~^~~~1140[ 41%] Building CXX object CMakeFiles/onnxruntime_mlas_test.dir/build/source/onnxruntime/test/mlas/unittest/test_halfgemm.cpp.o1141/build/source/build/_deps/onnx-build/onnx/onnx-ml.pb.h:2431:46: warning: type 'struct TensorProto' violates the C++ One Definition Rule [-Wodr]1142 2431 | class PROTOBUF_FUTURE_ADD_EARLY_WARN_UNUSED TensorProto final : public ::google::protobuf::MessageLite1143 | ^1144/build/source/onnxruntime/core/providers/shared_library/provider_wrappedtypes.h:242:8: note: a type with different bases is defined in another translation unit1145 242 | struct TensorProto final {1146 | ^1147/nix/store/54yzskzwmapls2awvih149wyzci717gw-onnx-src/onnx/defs/logical/old.cc: In function 'std::function<void(onnx::OpSchema&)> onnx::BinaryLogicDocGenerator_opset12(const char*)':1148/nix/store/54yzskzwmapls2awvih149wyzci717gw-onnx-src/onnx/defs/logical/old.cc:10:83: warning: unused parameter 'name' [-Wunused-parameter]1149 10 | static std::function<void(OpSchema&)> BinaryLogicDocGenerator_opset12(const char* name) {1150 | ~~~~~~~~~~~~^~~~1151/nix/store/54yzskzwmapls2awvih149wyzci717gw-onnx-src/onnx/defs/logical/old.cc: In function 'std::function<void(onnx::OpSchema&)> onnx::BinaryLogicDocGenerator_opset1(const char*)':1152/nix/store/54yzskzwmapls2awvih149wyzci717gw-onnx-src/onnx/defs/logical/old.cc:84:82: warning: unused parameter 'name' [-Wunused-parameter]1153 84 | static std::function<void(OpSchema&)> BinaryLogicDocGenerator_opset1(const char* name) {1154 | ~~~~~~~~~~~~^~~~1155/nix/store/54yzskzwmapls2awvih149wyzci717gw-onnx-src/onnx/defs/logical/old.cc: In function 'std::function<void(onnx::OpSchema&)> onnx::BinaryLogicDocGenerator_opset7(const char*)':1156/nix/store/54yzskzwmapls2awvih149wyzci717gw-onnx-src/onnx/defs/logical/old.cc:107:82: warning: unused parameter 'name' [-Wunused-parameter]1157 107 | static std::function<void(OpSchema&)> BinaryLogicDocGenerator_opset7(const char* name) {1158 | ~~~~~~~~~~~~^~~~1159[ 41%] Building CXX object _deps/onnx-build/CMakeFiles/onnx.dir/onnx/defs/math/old.cc.o1160/nix/store/54yzskzwmapls2awvih149wyzci717gw-onnx-src/onnx/defs/math/defs.cc: In function 'std::function<void(onnx::OpSchema&)> onnx::SoftmaxFamilyDocGenerator(const char*, const char*, const char*)':1161/nix/store/54yzskzwmapls2awvih149wyzci717gw-onnx-src/onnx/defs/math/defs.cc:1005:57: warning: unused parameter 'description' [-Wunused-parameter]1162 1005 | SoftmaxFamilyDocGenerator(const char* name, const char* description, const char* equation) {1163 | ~~~~~~~~~~~~^~~~~~~~~~~1164/nix/store/54yzskzwmapls2awvih149wyzci717gw-onnx-src/onnx/defs/math/defs.cc:1005:82: warning: unused parameter 'equation' [-Wunused-parameter]1165 1005 | SoftmaxFamilyDocGenerator(const char* name, const char* description, const char* equation) {1166 | ~~~~~~~~~~~~^~~~~~~~1167[ 41%] Building CXX object CMakeFiles/onnxruntime_optimizer.dir/build/source/onnxruntime/core/optimizer/dq_matmulnbits_fusion.cc.o1168[ 42%] Building CXX object CMakeFiles/onnxruntime_mlas_test.dir/build/source/onnxruntime/test/mlas/unittest/test_hgemm_neon.cpp.o1169[ 42%] Building CXX object CMakeFiles/onnxruntime_mlas_test.dir/build/source/onnxruntime/test/mlas/unittest/test_hqnbitgemm_neon.cpp.o1170[ 42%] Building CXX object _deps/onnx-build/CMakeFiles/onnx.dir/onnx/defs/math/utils.cc.o1171[ 42%] Building CXX object CMakeFiles/onnxruntime_optimizer.dir/build/source/onnxruntime/core/optimizer/dropout_elimination.cc.o1172[ 42%] Building CXX object CMakeFiles/onnxruntime_graph.dir/build/source/onnxruntime/core/graph/data_propagation/gather_op_data_propagation.cc.o1173/nix/store/54yzskzwmapls2awvih149wyzci717gw-onnx-src/onnx/defs/math/old.cc: In function 'std::function<void(onnx::OpSchema&)> onnx::SoftmaxFamilyDocGenerator_opset_11(const char*, const char*)':1174/nix/store/54yzskzwmapls2awvih149wyzci717gw-onnx-src/onnx/defs/math/old.cc:922:104: warning: unused parameter 'description' [-Wunused-parameter]1175 922 | static std::function<void(OpSchema&)> SoftmaxFamilyDocGenerator_opset_11(const char* name, const char* description) {1176 | ~~~~~~~~~~~~^~~~~~~~~~~1177[ 43%] Building CXX object CMakeFiles/onnxruntime_graph.dir/build/source/onnxruntime/core/graph/data_propagation/mul_op_data_propagation.cc.o1178/nix/store/54yzskzwmapls2awvih149wyzci717gw-onnx-src/onnx/defs/math/old.cc: In function 'std::function<void(onnx::OpSchema&)> onnx::SoftmaxFamilyDocGenerator_opset1(const char*, const char*)':1179/nix/store/54yzskzwmapls2awvih149wyzci717gw-onnx-src/onnx/defs/math/old.cc:2275:84: warning: unused parameter 'name' [-Wunused-parameter]1180 2275 | static std::function<void(OpSchema&)> SoftmaxFamilyDocGenerator_opset1(const char* name, const char* description) {1181 | ~~~~~~~~~~~~^~~~1182/nix/store/54yzskzwmapls2awvih149wyzci717gw-onnx-src/onnx/defs/math/old.cc:2275:102: warning: unused parameter 'description' [-Wunused-parameter]1183 2275 | static std::function<void(OpSchema&)> SoftmaxFamilyDocGenerator_opset1(const char* name, const char* description) {1184 | ~~~~~~~~~~~~^~~~~~~~~~~1185/nix/store/54yzskzwmapls2awvih149wyzci717gw-onnx-src/onnx/defs/math/old.cc: In function 'std::function<void(onnx::OpSchema&)> onnx::MathDocGenerator_old(const char*)':1186/nix/store/54yzskzwmapls2awvih149wyzci717gw-onnx-src/onnx/defs/math/old.cc:2363:72: warning: unused parameter 'name' [-Wunused-parameter]1187 2363 | static std::function<void(OpSchema&)> MathDocGenerator_old(const char* name) {1188 | ~~~~~~~~~~~~^~~~1189[ 43%] Building CXX object CMakeFiles/onnxruntime_optimizer.dir/build/source/onnxruntime/core/optimizer/dynamic_quantize_matmul_fusion.cc.o1190[ 43%] Building CXX object CMakeFiles/onnxruntime_optimizer.dir/build/source/onnxruntime/core/optimizer/embed_layer_norm_fusion.cc.o1191[ 43%] Building CXX object CMakeFiles/onnxruntime_optimizer.dir/build/source/onnxruntime/core/optimizer/expand_elimination.cc.o1192[ 43%] Building CXX object CMakeFiles/onnxruntime_graph.dir/build/source/onnxruntime/core/graph/data_propagation/size_op_data_propagation.cc.o1193[ 43%] Building CXX object CMakeFiles/onnxruntime_session.dir/build/source/onnxruntime/core/session/interop_api.cc.o1194[ 43%] Building CXX object CMakeFiles/onnxruntime_framework.dir/build/source/onnxruntime/core/framework/external_data_loader_manager.cc.o1195[ 43%] Building CXX object CMakeFiles/onnxruntime_mlas_test.dir/build/source/onnxruntime/test/mlas/unittest/test_layernorm.cpp.o1196[ 43%] Building CXX object _deps/onnx-build/CMakeFiles/onnx.dir/onnx/defs/nn/defs.cc.o1197[ 43%] Building CXX object CMakeFiles/onnxruntime_optimizer.dir/build/source/onnxruntime/core/optimizer/fast_gelu_fusion.cc.o1198[ 43%] Building CXX object _deps/onnx-build/CMakeFiles/onnx.dir/onnx/defs/nn/old.cc.o1199[ 43%] Building CXX object CMakeFiles/onnxruntime_session.dir/build/source/onnxruntime/core/session/lora_adapters.cc.o1200[ 43%] Building CXX object CMakeFiles/onnxruntime_framework.dir/build/source/onnxruntime/core/framework/fallback_cpu_capability.cc.o1201[ 43%] Building CXX object CMakeFiles/onnxruntime_mlas_test.dir/build/source/onnxruntime/test/mlas/unittest/test_main.cpp.o1202[ 43%] Building CXX object CMakeFiles/onnxruntime_mlas_test.dir/build/source/onnxruntime/test/mlas/unittest/test_minmax.cpp.o1203[ 43%] Building CXX object CMakeFiles/onnxruntime_mlas_test.dir/build/source/onnxruntime/test/mlas/unittest/test_pool2d.cpp.o1204[ 43%] Building CXX object _deps/onnx-build/CMakeFiles/onnx.dir/onnx/defs/nn/utils.cc.o1205/nix/store/54yzskzwmapls2awvih149wyzci717gw-onnx-src/onnx/defs/nn/defs.cc: In function 'std::function<void(onnx::OpSchema&)> onnx::PoolOpSchemaGenerator(const char*, const char*, const char*, bool, bool)':1206/nix/store/54yzskzwmapls2awvih149wyzci717gw-onnx-src/onnx/defs/nn/defs.cc:206:17: warning: unused parameter 'name' [-Wunused-parameter]1207 206 | const char* name,1208 | ~~~~~~~~~~~~^~~~1209/nix/store/54yzskzwmapls2awvih149wyzci717gw-onnx-src/onnx/defs/nn/defs.cc:207:17: warning: unused parameter 'opName' [-Wunused-parameter]1210 207 | const char* opName,1211 | ~~~~~~~~~~~~^~~~~~1212/nix/store/54yzskzwmapls2awvih149wyzci717gw-onnx-src/onnx/defs/nn/defs.cc:208:17: warning: unused parameter 'additionalDescription' [-Wunused-parameter]1213 208 | const char* additionalDescription,1214 | ~~~~~~~~~~~~^~~~~~~~~~~~~~~~~~~~~1215/nix/store/54yzskzwmapls2awvih149wyzci717gw-onnx-src/onnx/defs/nn/defs.cc: In function 'std::function<void(onnx::OpSchema&)> onnx::LpPoolOpSchemaGenerator(const char*)':1216/nix/store/54yzskzwmapls2awvih149wyzci717gw-onnx-src/onnx/defs/nn/defs.cc:534:75: warning: unused parameter 'name' [-Wunused-parameter]1217 534 | static std::function<void(OpSchema&)> LpPoolOpSchemaGenerator(const char* name) {1218 | ~~~~~~~~~~~~^~~~1219/nix/store/54yzskzwmapls2awvih149wyzci717gw-onnx-src/onnx/defs/nn/defs.cc: In function 'std::function<void(onnx::OpSchema&)> onnx::RoiPoolOpSchemaGenerator(const char*)':1220/nix/store/54yzskzwmapls2awvih149wyzci717gw-onnx-src/onnx/defs/nn/defs.cc:661:76: warning: unused parameter 'name' [-Wunused-parameter]1221 661 | static std::function<void(OpSchema&)> RoiPoolOpSchemaGenerator(const char* name) {1222 | ~~~~~~~~~~~~^~~~1223/nix/store/54yzskzwmapls2awvih149wyzci717gw-onnx-src/onnx/defs/nn/defs.cc: In function 'std::function<void(onnx::OpSchema&)> onnx::ConvOpSchemaGenerator(const char*)':1224/nix/store/54yzskzwmapls2awvih149wyzci717gw-onnx-src/onnx/defs/nn/defs.cc:717:73: warning: unused parameter 'filter_desc' [-Wunused-parameter]1225 717 | static std::function<void(OpSchema&)> ConvOpSchemaGenerator(const char* filter_desc) {1226 | ~~~~~~~~~~~~^~~~~~~~~~~1227/nix/store/54yzskzwmapls2awvih149wyzci717gw-onnx-src/onnx/defs/nn/defs.cc: In function 'std::function<void(onnx::OpSchema&)> onnx::ConvTransposeOpSchemaGenerator(const char*)':1228/nix/store/54yzskzwmapls2awvih149wyzci717gw-onnx-src/onnx/defs/nn/defs.cc:1232:82: warning: unused parameter 'filter_desc' [-Wunused-parameter]1229 1232 | static std::function<void(OpSchema&)> ConvTransposeOpSchemaGenerator(const char* filter_desc) {1230 | ~~~~~~~~~~~~^~~~~~~~~~~1231/nix/store/54yzskzwmapls2awvih149wyzci717gw-onnx-src/onnx/defs/nn/defs.cc: In function 'std::function<void(onnx::OpSchema&)> onnx::GlobalPoolingOpSchemaGenerator(const char*, const char*)':1232/nix/store/54yzskzwmapls2awvih149wyzci717gw-onnx-src/onnx/defs/nn/defs.cc:1473:82: warning: unused parameter 'op_type' [-Wunused-parameter]1233 1473 | static std::function<void(OpSchema&)> GlobalPoolingOpSchemaGenerator(const char* op_type, const char* op) {1234 | ~~~~~~~~~~~~^~~~~~~1235/nix/store/54yzskzwmapls2awvih149wyzci717gw-onnx-src/onnx/defs/nn/defs.cc:1473:103: warning: unused parameter 'op' [-Wunused-parameter]1236 1473 | static std::function<void(OpSchema&)> GlobalPoolingOpSchemaGenerator(const char* op_type, const char* op) {1237 | ~~~~~~~~~~~~^~1238/nix/store/54yzskzwmapls2awvih149wyzci717gw-onnx-src/onnx/defs/nn/defs.cc: In function 'std::function<void(onnx::OpSchema&)> onnx::GlobalLpPoolingOpSchemaGenerator(const char*, const char*)':1239/nix/store/54yzskzwmapls2awvih149wyzci717gw-onnx-src/onnx/defs/nn/defs.cc:1521:84: warning: unused parameter 'op_type' [-Wunused-parameter]1240 1521 | static std::function<void(OpSchema&)> GlobalLpPoolingOpSchemaGenerator(const char* op_type, const char* op) {1241 | ~~~~~~~~~~~~^~~~~~~1242/nix/store/54yzskzwmapls2awvih149wyzci717gw-onnx-src/onnx/defs/nn/defs.cc:1521:105: warning: unused parameter 'op' [-Wunused-parameter]1243 1521 | static std::function<void(OpSchema&)> GlobalLpPoolingOpSchemaGenerator(const char* op_type, const char* op) {1244 | ~~~~~~~~~~~~^~1245[ 43%] Built target onnxruntime_mlas_q4dq1246[ 43%] Building CXX object CMakeFiles/onnxruntime_session.dir/build/source/onnxruntime/core/session/model_compilation_options.cc.o1247/nix/store/54yzskzwmapls2awvih149wyzci717gw-onnx-src/onnx/defs/nn/old.cc: In function 'std::function<void(onnx::OpSchema&)> onnx::GlobalLpPoolingOpSchemaGenerator_opset2(const char*, const char*)':1248/nix/store/54yzskzwmapls2awvih149wyzci717gw-onnx-src/onnx/defs/nn/old.cc:44:91: warning: unused parameter 'op_type' [-Wunused-parameter]1249 44 | static std::function<void(OpSchema&)> GlobalLpPoolingOpSchemaGenerator_opset2(const char* op_type, const char* op) {1250 | ~~~~~~~~~~~~^~~~~~~1251/nix/store/54yzskzwmapls2awvih149wyzci717gw-onnx-src/onnx/defs/nn/old.cc:44:112: warning: unused parameter 'op' [-Wunused-parameter]1252 44 | static std::function<void(OpSchema&)> GlobalLpPoolingOpSchemaGenerator_opset2(const char* op_type, const char* op) {1253 | ~~~~~~~~~~~~^~1254/nix/store/54yzskzwmapls2awvih149wyzci717gw-onnx-src/onnx/defs/nn/old.cc: In function 'std::function<void(onnx::OpSchema&)> onnx::GlobalPoolingOpSchemaGenerator_opset1(const char*, const char*)':1255/nix/store/54yzskzwmapls2awvih149wyzci717gw-onnx-src/onnx/defs/nn/old.cc:550:89: warning: unused parameter 'op_type' [-Wunused-parameter]1256 550 | static std::function<void(OpSchema&)> GlobalPoolingOpSchemaGenerator_opset1(const char* op_type, const char* op) {1257 | ~~~~~~~~~~~~^~~~~~~1258/nix/store/54yzskzwmapls2awvih149wyzci717gw-onnx-src/onnx/defs/nn/old.cc:550:110: warning: unused parameter 'op' [-Wunused-parameter]1259 550 | static std::function<void(OpSchema&)> GlobalPoolingOpSchemaGenerator_opset1(const char* op_type, const char* op) {1260 | ~~~~~~~~~~~~^~1261/nix/store/54yzskzwmapls2awvih149wyzci717gw-onnx-src/onnx/defs/nn/old.cc: In function 'std::function<void(onnx::OpSchema&)> onnx::ConvTransposeOpSchemaGenerator_opset11(const char*)':1262/nix/store/54yzskzwmapls2awvih149wyzci717gw-onnx-src/onnx/defs/nn/old.cc:841:90: warning: unused parameter 'filter_desc' [-Wunused-parameter]1263 841 | static std::function<void(OpSchema&)> ConvTransposeOpSchemaGenerator_opset11(const char* filter_desc) {1264 | ~~~~~~~~~~~~^~~~~~~~~~~1265/nix/store/54yzskzwmapls2awvih149wyzci717gw-onnx-src/onnx/defs/nn/old.cc: In function 'std::function<void(onnx::OpSchema&)> onnx::ConvOpSchemaGenerator_opset11(const char*)':1266/nix/store/54yzskzwmapls2awvih149wyzci717gw-onnx-src/onnx/defs/nn/old.cc:966:81: warning: unused parameter 'filter_desc' [-Wunused-parameter]1267 966 | static std::function<void(OpSchema&)> ConvOpSchemaGenerator_opset11(const char* filter_desc) {1268 | ~~~~~~~~~~~~^~~~~~~~~~~1269/nix/store/54yzskzwmapls2awvih149wyzci717gw-onnx-src/onnx/defs/nn/old.cc: In function 'std::function<void(onnx::OpSchema&)> onnx::RoiPoolOpSchemaGenerator_opset1(const char*)':1270/nix/store/54yzskzwmapls2awvih149wyzci717gw-onnx-src/onnx/defs/nn/old.cc:1112:83: warning: unused parameter 'name' [-Wunused-parameter]1271 1112 | static std::function<void(OpSchema&)> RoiPoolOpSchemaGenerator_opset1(const char* name) {1272 | ~~~~~~~~~~~~^~~~1273/nix/store/54yzskzwmapls2awvih149wyzci717gw-onnx-src/onnx/defs/nn/old.cc: In function 'std::function<void(onnx::OpSchema&)> onnx::LpPoolOpSchemaGenerator_opset18(const char*)':1274/nix/store/54yzskzwmapls2awvih149wyzci717gw-onnx-src/onnx/defs/nn/old.cc:1171:83: warning: unused parameter 'name' [-Wunused-parameter]1275 1171 | static std::function<void(OpSchema&)> LpPoolOpSchemaGenerator_opset18(const char* name) {1276 | ~~~~~~~~~~~~^~~~1277/nix/store/54yzskzwmapls2awvih149wyzci717gw-onnx-src/onnx/defs/nn/old.cc: In function 'std::function<void(onnx::OpSchema&)> onnx::PoolOpSchemaGenerator_opset19(const char*, const char*, const char*, bool, bool)':1278/nix/store/54yzskzwmapls2awvih149wyzci717gw-onnx-src/onnx/defs/nn/old.cc:1344:17: warning: unused parameter 'name' [-Wunused-parameter]1279 1344 | const char* name,1280 | ~~~~~~~~~~~~^~~~1281/nix/store/54yzskzwmapls2awvih149wyzci717gw-onnx-src/onnx/defs/nn/old.cc:1345:17: warning: unused parameter 'opName' [-Wunused-parameter]1282 1345 | const char* opName,1283 | ~~~~~~~~~~~~^~~~~~1284/nix/store/54yzskzwmapls2awvih149wyzci717gw-onnx-src/onnx/defs/nn/old.cc:1346:17: warning: unused parameter 'additionalDescription' [-Wunused-parameter]1285 1346 | const char* additionalDescription,1286 | ~~~~~~~~~~~~^~~~~~~~~~~~~~~~~~~~~1287/nix/store/54yzskzwmapls2awvih149wyzci717gw-onnx-src/onnx/defs/nn/old.cc: In function 'std::function<void(onnx::OpSchema&)> onnx::PoolOpSchemaGenerator_9(const char*, const char*, const char*)':1288/nix/store/54yzskzwmapls2awvih149wyzci717gw-onnx-src/onnx/defs/nn/old.cc:2088:37: warning: unused parameter 'name' [-Wunused-parameter]1289 2088 | PoolOpSchemaGenerator_9(const char* name, const char* opName, const char* additionalDescription) {1290 | ~~~~~~~~~~~~^~~~1291/nix/store/54yzskzwmapls2awvih149wyzci717gw-onnx-src/onnx/defs/nn/old.cc:2088:55: warning: unused parameter 'opName' [-Wunused-parameter]1292 2088 | PoolOpSchemaGenerator_9(const char* name, const char* opName, const char* additionalDescription) {1293 | ~~~~~~~~~~~~^~~~~~1294/nix/store/54yzskzwmapls2awvih149wyzci717gw-onnx-src/onnx/defs/nn/old.cc:2088:75: warning: unused parameter 'additionalDescription' [-Wunused-parameter]1295 2088 | PoolOpSchemaGenerator_9(const char* name, const char* opName, const char* additionalDescription) {1296 | ~~~~~~~~~~~~^~~~~~~~~~~~~~~~~~~~~1297/nix/store/54yzskzwmapls2awvih149wyzci717gw-onnx-src/onnx/defs/nn/old.cc: In function 'std::function<void(onnx::OpSchema&)> onnx::PoolOpSchemaGenerator_10(const char*, const char*, const char*, bool, int)':1298/nix/store/54yzskzwmapls2awvih149wyzci717gw-onnx-src/onnx/defs/nn/old.cc:2166:17: warning: unused parameter 'name' [-Wunused-parameter]1299 2166 | const char* name,1300 | ~~~~~~~~~~~~^~~~1301/nix/store/54yzskzwmapls2awvih149wyzci717gw-onnx-src/onnx/defs/nn/old.cc:2167:17: warning: unused parameter 'opName' [-Wunused-parameter]1302 2167 | const char* opName,1303 | ~~~~~~~~~~~~^~~~~~1304/nix/store/54yzskzwmapls2awvih149wyzci717gw-onnx-src/onnx/defs/nn/old.cc:2168:17: warning: unused parameter 'additionalDescription' [-Wunused-parameter]1305 2168 | const char* additionalDescription,1306 | ~~~~~~~~~~~~^~~~~~~~~~~~~~~~~~~~~1307/nix/store/54yzskzwmapls2awvih149wyzci717gw-onnx-src/onnx/defs/nn/old.cc: In function 'std::function<void(onnx::OpSchema&)> onnx::PoolOpSchemaGenerator_11(const char*, const char*, const char*, bool, bool)':1308/nix/store/54yzskzwmapls2awvih149wyzci717gw-onnx-src/onnx/defs/nn/old.cc:2277:17: warning: unused parameter 'name' [-Wunused-parameter]1309 2277 | const char* name,1310 | ~~~~~~~~~~~~^~~~1311/nix/store/54yzskzwmapls2awvih149wyzci717gw-onnx-src/onnx/defs/nn/old.cc:2278:17: warning: unused parameter 'opName' [-Wunused-parameter]1312 2278 | const char* opName,1313 | ~~~~~~~~~~~~^~~~~~1314/nix/store/54yzskzwmapls2awvih149wyzci717gw-onnx-src/onnx/defs/nn/old.cc:2279:17: warning: unused parameter 'additionalDescription' [-Wunused-parameter]1315 2279 | const char* additionalDescription,1316 | ~~~~~~~~~~~~^~~~~~~~~~~~~~~~~~~~~1317/nix/store/54yzskzwmapls2awvih149wyzci717gw-onnx-src/onnx/defs/nn/old.cc: In function 'std::function<void(onnx::OpSchema&)> onnx::LpPoolOpSchemaGenerator_10(const char*)':1318/nix/store/54yzskzwmapls2awvih149wyzci717gw-onnx-src/onnx/defs/nn/old.cc:2741:78: warning: unused parameter 'name' [-Wunused-parameter]1319 2741 | static std::function<void(OpSchema&)> LpPoolOpSchemaGenerator_10(const char* name) {1320 | ~~~~~~~~~~~~^~~~1321/nix/store/54yzskzwmapls2awvih149wyzci717gw-onnx-src/onnx/defs/nn/old.cc: In function 'std::function<void(onnx::OpSchema&)> onnx::LpPoolOpSchemaGenerator_11(const char*)':1322/nix/store/54yzskzwmapls2awvih149wyzci717gw-onnx-src/onnx/defs/nn/old.cc:2796:78: warning: unused parameter 'name' [-Wunused-parameter]1323 2796 | static std::function<void(OpSchema&)> LpPoolOpSchemaGenerator_11(const char* name) {1324 | ~~~~~~~~~~~~^~~~1325/nix/store/54yzskzwmapls2awvih149wyzci717gw-onnx-src/onnx/defs/nn/old.cc: In function 'std::function<void(onnx::OpSchema&)> onnx::ConvOpSchemaGenerator_10(const char*)':1326/nix/store/54yzskzwmapls2awvih149wyzci717gw-onnx-src/onnx/defs/nn/old.cc:2858:76: warning: unused parameter 'filter_desc' [-Wunused-parameter]1327 2858 | static std::function<void(OpSchema&)> ConvOpSchemaGenerator_10(const char* filter_desc) {1328 | ~~~~~~~~~~~~^~~~~~~~~~~1329/nix/store/54yzskzwmapls2awvih149wyzci717gw-onnx-src/onnx/defs/nn/old.cc: In function 'std::function<void(onnx::OpSchema&)> onnx::ConvTransposeOpSchemaGenerator_10(const char*)':1330/nix/store/54yzskzwmapls2awvih149wyzci717gw-onnx-src/onnx/defs/nn/old.cc:3072:85: warning: unused parameter 'filter_desc' [-Wunused-parameter]1331 3072 | static std::function<void(OpSchema&)> ConvTransposeOpSchemaGenerator_10(const char* filter_desc) {1332 | ~~~~~~~~~~~~^~~~~~~~~~~1333[ 44%] Building CXX object CMakeFiles/onnxruntime_optimizer.dir/build/source/onnxruntime/core/optimizer/free_dim_override_transformer.cc.o1334[ 44%] Building CXX object CMakeFiles/onnxruntime_framework.dir/build/source/onnxruntime/core/framework/feeds_fetches_manager.cc.o1335[ 44%] Building CXX object CMakeFiles/onnxruntime_session.dir/build/source/onnxruntime/core/session/model_editor_c_api.cc.o1336[ 44%] Building CXX object CMakeFiles/onnxruntime_framework.dir/build/source/onnxruntime/core/framework/func_kernel.cc.o1337[ 44%] Building CXX object CMakeFiles/onnxruntime_framework.dir/build/source/onnxruntime/core/framework/fuse_nodes_funcs.cc.o1338[ 44%] Building CXX object CMakeFiles/onnxruntime_optimizer.dir/build/source/onnxruntime/core/optimizer/fuse_initializers_transformer.cc.o1339[ 44%] Building CXX object CMakeFiles/onnxruntime_optimizer.dir/build/source/onnxruntime/core/optimizer/gather_fusion.cc.o1340[ 44%] Building CXX object CMakeFiles/onnxruntime_mlas_test.dir/build/source/onnxruntime/test/mlas/unittest/test_pool2d_nchwc.cpp.o1341[ 44%] Building CXX object CMakeFiles/onnxruntime_optimizer.dir/build/source/onnxruntime/core/optimizer/gelu_approximation.cc.o1342[ 44%] Building CXX object CMakeFiles/onnxruntime_optimizer.dir/build/source/onnxruntime/core/optimizer/gelu_fusion.cc.o1343[ 44%] Building CXX object CMakeFiles/onnxruntime_graph.dir/build/source/onnxruntime/core/graph/data_propagation/squeeze_op_data_propagation.cc.o1344[ 44%] Building CXX object CMakeFiles/onnxruntime_mlas_test.dir/build/source/onnxruntime/test/mlas/unittest/test_pool3d.cpp.o1345[ 44%] Building CXX object CMakeFiles/onnxruntime_mlas_test.dir/build/source/onnxruntime/test/mlas/unittest/test_q4gemm.cpp.o1346[ 44%] Building CXX object CMakeFiles/onnxruntime_optimizer.dir/build/source/onnxruntime/core/optimizer/gemm_activation_fusion.cc.o1347[ 44%] Building CXX object CMakeFiles/onnxruntime_mlas_test.dir/build/source/onnxruntime/test/mlas/unittest/test_q4qdq.cpp.o1348[ 44%] Building CXX object CMakeFiles/onnxruntime_session.dir/build/source/onnxruntime/core/session/model_package/model_package_context.cc.o1349[ 44%] Building CXX object CMakeFiles/onnxruntime_framework.dir/build/source/onnxruntime/core/framework/graph_partitioner.cc.o1350[ 44%] Building CXX object CMakeFiles/onnxruntime_framework.dir/build/source/onnxruntime/core/framework/kernel_def_builder.cc.o1351[ 44%] Building CXX object _deps/onnx-build/CMakeFiles/onnx.dir/onnx/defs/object_detection/defs.cc.o1352[ 44%] Building CXX object _deps/onnx-build/CMakeFiles/onnx.dir/onnx/defs/object_detection/old.cc.o1353[ 44%] Building CXX object _deps/onnx-build/CMakeFiles/onnx.dir/onnx/defs/optional/defs.cc.o1354[ 44%] Building CXX object _deps/onnx-build/CMakeFiles/onnx.dir/onnx/defs/optional/old.cc.o1355[ 44%] Building CXX object _deps/onnx-build/CMakeFiles/onnx.dir/onnx/defs/parser.cc.o1356[ 44%] Building CXX object CMakeFiles/onnxruntime_mlas_test.dir/build/source/onnxruntime/test/mlas/unittest/test_q8q4gemm.cpp.o1357[ 45%] Building CXX object CMakeFiles/onnxruntime_session.dir/build/source/onnxruntime/core/session/model_package/model_package_descriptor_parser.cc.o1358[ 45%] Building CXX object CMakeFiles/onnxruntime_session.dir/build/source/onnxruntime/core/session/onnxruntime_c_api.cc.o1359[ 45%] Building CXX object CMakeFiles/onnxruntime_optimizer.dir/build/source/onnxruntime/core/optimizer/gemm_sum_fusion.cc.o1360[ 45%] Building CXX object CMakeFiles/onnxruntime_session.dir/build/source/onnxruntime/core/session/ort_env.cc.o1361[ 45%] Building CXX object CMakeFiles/onnxruntime_mlas_test.dir/build/source/onnxruntime/test/mlas/unittest/test_qgemm.cpp.o1362[ 45%] Building CXX object CMakeFiles/onnxruntime_graph.dir/build/source/onnxruntime/core/graph/data_propagation/sub_op_data_propagation.cc.o1363[ 45%] Building CXX object CMakeFiles/onnxruntime_graph.dir/build/source/onnxruntime/core/graph/data_propagation/unsqueeze_op_data_propagation.cc.o1364/build/source/onnxruntime/core/framework/graph_partitioner.cc: In function 'onnxruntime::common::Status onnxruntime::CreateEpContextModel(const ExecutionProviders&, const Graph&, const epctx::ModelGenOptions&, const logging::Logger&)':1365/build/source/onnxruntime/core/framework/graph_partitioner.cc:1133:33: warning: ignoring return value of 'bool google::protobuf::MessageLite::SerializeToArray(void*, int) const', declared with attribute 'nodiscard' [-Wunused-result]1366 1133 | model_proto.SerializeToArray(buffer.get(), static_cast<int>(buffer_size));1367 | ~~~~~~~~~~~~~~~~~~~~~~~~~~~~^~~~~~~~~~~~~~~~~~~~~~~~~~~~~~~~~~~~~~~~~~~~~1368In file included from /nix/store/9pgz5bq44kvmf7zsf85yblghr1pjmfnc-protobuf-36.2-dev/include/google/protobuf/generated_message_tctable_decl.h:23,1369 from /build/source/build/_deps/onnx-build/onnx/onnx-ml.pb.h:24,1370 from /nix/store/54yzskzwmapls2awvih149wyzci717gw-onnx-src/onnx/onnx_pb.h:51,1371 from /nix/store/54yzskzwmapls2awvih149wyzci717gw-onnx-src/onnx/defs/data_type_utils.h:13,1372 from /nix/store/54yzskzwmapls2awvih149wyzci717gw-onnx-src/onnx/defs/schema.h:24,1373 from /build/source/include/onnxruntime/core/graph/onnx_protobuf.h:22,1374 from /build/source/include/onnxruntime/core/framework/data_types.h:21,1375 from /build/source/include/onnxruntime/core/framework/ort_value.h:11,1376 from /build/source/include/onnxruntime/core/graph/graph.h:30,1377 from /build/source/onnxruntime/core/framework/graph_partitioner.h:7,1378 from /build/source/onnxruntime/core/framework/graph_partitioner.cc:4:1379/nix/store/9pgz5bq44kvmf7zsf85yblghr1pjmfnc-protobuf-36.2-dev/include/google/protobuf/message_lite.h:621:44: note: declared here1380 621 | PROTOBUF_FUTURE_ADD_EARLY_NODISCARD bool SerializeToArray(void* data,1381 | ^~~~~~~~~~~~~~~~1382[ 45%] Building CXX object _deps/onnx-build/CMakeFiles/onnx.dir/onnx/defs/printer.cc.o1383/build/source/onnxruntime/core/framework/graph_partitioner.cc:1146:35: warning: ignoring return value of 'bool google::protobuf::MessageLite::SerializeToOstream(std::ostream*) const', declared with attribute 'nodiscard' [-Wunused-result]1384 1146 | model_proto.SerializeToOstream(&out_stream);1385 | ~~~~~~~~~~~~~~~~~~~~~~~~~~~~~~^~~~~~~~~~~~~1386/nix/store/9pgz5bq44kvmf7zsf85yblghr1pjmfnc-protobuf-36.2-dev/include/google/protobuf/message_lite.h:647:44: note: declared here1387 647 | PROTOBUF_FUTURE_ADD_EARLY_NODISCARD bool SerializeToOstream(1388 | ^~~~~~~~~~~~~~~~~~1389[ 45%] Building CXX object _deps/onnx-build/CMakeFiles/onnx.dir/onnx/defs/quantization/defs.cc.o1390[ 45%] Building CXX object _deps/onnx-build/CMakeFiles/onnx.dir/onnx/defs/quantization/old.cc.o1391[ 45%] Building CXX object CMakeFiles/onnxruntime_optimizer.dir/build/source/onnxruntime/core/optimizer/gemm_transpose_fusion.cc.o1392[ 45%] Building CXX object CMakeFiles/onnxruntime_optimizer.dir/build/source/onnxruntime/core/optimizer/graph_optimizer_registry.cc.o1393[ 45%] Building CXX object CMakeFiles/onnxruntime_graph.dir/build/source/onnxruntime/core/graph/ep_api_types.cc.o1394[ 45%] Building CXX object CMakeFiles/onnxruntime_graph.dir/build/source/onnxruntime/core/graph/function.cc.o1395[ 45%] Building CXX object CMakeFiles/onnxruntime_optimizer.dir/build/source/onnxruntime/core/optimizer/graph_transformer.cc.o1396[ 45%] Building CXX object CMakeFiles/onnxruntime_optimizer.dir/build/source/onnxruntime/core/optimizer/graph_transformer_mgr.cc.o1397[ 45%] Building CXX object CMakeFiles/onnxruntime_graph.dir/build/source/onnxruntime/core/graph/function_utils.cc.o1398[ 45%] Building CXX object CMakeFiles/onnxruntime_graph.dir/build/source/onnxruntime/core/graph/graph.cc.o1399[ 46%] Building CXX object _deps/onnx-build/CMakeFiles/onnx.dir/onnx/defs/reduction/defs.cc.o1400[ 46%] Building CXX object CMakeFiles/onnxruntime_graph.dir/build/source/onnxruntime/core/graph/graph_flatbuffers_utils.cc.o1401[ 46%] Building CXX object _deps/onnx-build/CMakeFiles/onnx.dir/onnx/defs/reduction/old.cc.o1402[ 46%] Built target onnxruntime_providers_openvino1403[ 46%] Building CXX object CMakeFiles/onnxruntime_session.dir/build/source/onnxruntime/core/session/plugin_ep/ep_api.cc.o1404/build/source/onnxruntime/core/session/onnxruntime_c_api.cc: In function 'OrtStatus* OrtApis::OpAttr_GetType(const OrtOpAttr*, OrtOpAttrType*)':1405/build/source/onnxruntime/core/session/onnxruntime_c_api.cc:3552:14: warning: unused variable 'attr' [-Wunused-variable]1406 3552 | const auto attr = attribute->attr_proto;1407 | ^~~~1408[ 46%] Building CXX object CMakeFiles/onnxruntime_graph.dir/build/source/onnxruntime/core/graph/graph_proto_serializer.cc.o1409/nix/store/54yzskzwmapls2awvih149wyzci717gw-onnx-src/onnx/defs/reduction/defs.cc: In function 'std::function<void(onnx::OpSchema&)> onnx::ArgReduceDocGenerator(const char*)':1410/nix/store/54yzskzwmapls2awvih149wyzci717gw-onnx-src/onnx/defs/reduction/defs.cc:95:73: warning: unused parameter 'name' [-Wunused-parameter]1411 95 | static std::function<void(OpSchema&)> ArgReduceDocGenerator(const char* name) {1412 | ~~~~~~~~~~~~^~~~1413[ 46%] Building CXX object CMakeFiles/onnxruntime_mlas_test.dir/build/source/onnxruntime/test/mlas/unittest/test_qkv_quant.cpp.o1414[ 46%] Building CXX object CMakeFiles/onnxruntime_framework.dir/build/source/onnxruntime/core/framework/kernel_registry.cc.o1415[ 46%] Building CXX object _deps/onnx-build/CMakeFiles/onnx.dir/onnx/defs/reduction/utils.cc.o1416[ 46%] Building CXX object CMakeFiles/onnxruntime_session.dir/build/source/onnxruntime/core/session/plugin_ep/ep_control_flow_kernel_impls.cc.o1417/nix/store/54yzskzwmapls2awvih149wyzci717gw-onnx-src/onnx/defs/reduction/old.cc: In function 'std::function<void(onnx::OpSchema&)> onnx::ReduceDocGenerator_opset12(const char*, bool)':1418/nix/store/54yzskzwmapls2awvih149wyzci717gw-onnx-src/onnx/defs/reduction/old.cc:28:17: warning: unused parameter 'name' [-Wunused-parameter]1419 28 | const char* name,1420 | ~~~~~~~~~~~~^~~~1421/nix/store/54yzskzwmapls2awvih149wyzci717gw-onnx-src/onnx/defs/reduction/old.cc: In function 'std::function<void(onnx::OpSchema&)> onnx::ArgReduceDocGenerator_opset12(const char*)':1422/nix/store/54yzskzwmapls2awvih149wyzci717gw-onnx-src/onnx/defs/reduction/old.cc:123:81: warning: unused parameter 'name' [-Wunused-parameter]1423 123 | static std::function<void(OpSchema&)> ArgReduceDocGenerator_opset12(const char* name) {1424 | ~~~~~~~~~~~~^~~~1425/nix/store/54yzskzwmapls2awvih149wyzci717gw-onnx-src/onnx/defs/reduction/old.cc: In function 'std::function<void(onnx::OpSchema&)> onnx::ReduceDocGenerator_opset1(const char*, const char*, int)':1426/nix/store/54yzskzwmapls2awvih149wyzci717gw-onnx-src/onnx/defs/reduction/old.cc:204:39: warning: unused parameter 'name' [-Wunused-parameter]1427 204 | ReduceDocGenerator_opset1(const char* name, const char* empty_value, int opset = 1) {1428 | ~~~~~~~~~~~~^~~~1429/nix/store/54yzskzwmapls2awvih149wyzci717gw-onnx-src/onnx/defs/reduction/old.cc: In function 'std::function<void(onnx::OpSchema&)> onnx::ArgReduceDocGenerator_opset1(const char*)':1430/nix/store/54yzskzwmapls2awvih149wyzci717gw-onnx-src/onnx/defs/reduction/old.cc:305:80: warning: unused parameter 'name' [-Wunused-parameter]1431 305 | static std::function<void(OpSchema&)> ArgReduceDocGenerator_opset1(const char* name) {1432 | ~~~~~~~~~~~~^~~~1433[ 46%] Building CXX object _deps/onnx-build/CMakeFiles/onnx.dir/onnx/defs/rnn/defs.cc.o1434[ 46%] Building CXX object CMakeFiles/onnxruntime_mlas_test.dir/build/source/onnxruntime/test/mlas/unittest/test_qlinear_binaryop.cpp.o1435[ 46%] Building CXX object CMakeFiles/onnxruntime_optimizer.dir/build/source/onnxruntime/core/optimizer/graph_transformer_utils.cc.o1436[ 46%] Building CXX object CMakeFiles/onnxruntime_session.dir/build/source/onnxruntime/core/session/plugin_ep/ep_event_profiling.cc.o1437[ 46%] Building CXX object CMakeFiles/onnxruntime_framework.dir/build/source/onnxruntime/core/framework/kernel_registry_manager.cc.o1438[ 46%] Building CXX object CMakeFiles/onnxruntime_session.dir/build/source/onnxruntime/core/session/plugin_ep/ep_factory_cpu.cc.o1439[ 46%] Building CXX object CMakeFiles/onnxruntime_optimizer.dir/build/source/onnxruntime/core/optimizer/group_query_attention_fusion.cc.o1440[ 46%] Building CXX object CMakeFiles/onnxruntime_graph.dir/build/source/onnxruntime/core/graph/graph_utils.cc.o1441[ 46%] Building CXX object CMakeFiles/onnxruntime_session.dir/build/source/onnxruntime/core/session/plugin_ep/ep_factory_dml.cc.o1442[ 46%] Building CXX object CMakeFiles/onnxruntime_mlas_test.dir/build/source/onnxruntime/test/mlas/unittest/test_qlinear_gavgpool.cpp.o1443[ 46%] Building CXX object _deps/onnx-build/CMakeFiles/onnx.dir/onnx/defs/rnn/old.cc.o1444[ 46%] Building CXX object CMakeFiles/onnxruntime_mlas_test.dir/build/source/onnxruntime/test/mlas/unittest/test_quantizelinear.cpp.o1445[ 46%] Building CXX object CMakeFiles/onnxruntime_optimizer.dir/build/source/onnxruntime/core/optimizer/identical_children_consolidation.cc.o1446[ 47%] Building CXX object CMakeFiles/onnxruntime_mlas_test.dir/build/source/onnxruntime/test/mlas/unittest/test_reorder_output.cpp.o1447[ 47%] Building CXX object _deps/onnx-build/CMakeFiles/onnx.dir/onnx/defs/schema.cc.o1448[ 47%] Building CXX object CMakeFiles/onnxruntime_framework.dir/build/source/onnxruntime/core/framework/kernel_type_str_resolver.cc.o1449[ 47%] Building CXX object CMakeFiles/onnxruntime_graph.dir/build/source/onnxruntime/core/graph/graph_viewer.cc.o1450[ 47%] Building CXX object _deps/onnx-build/CMakeFiles/onnx.dir/onnx/defs/sequence/defs.cc.o1451[ 47%] Building CXX object CMakeFiles/onnxruntime_mlas_test.dir/build/source/onnxruntime/test/mlas/unittest/test_rope.cpp.o1452[ 47%] Building CXX object CMakeFiles/onnxruntime_optimizer.dir/build/source/onnxruntime/core/optimizer/identity_elimination.cc.o1453[ 47%] Building CXX object CMakeFiles/onnxruntime_mlas_test.dir/build/source/onnxruntime/test/mlas/unittest/test_rope_neon_fp16.cpp.o1454[ 47%] Building CXX object CMakeFiles/onnxruntime_mlas_test.dir/build/source/onnxruntime/test/mlas/unittest/test_sbgemm.cpp.o1455[ 47%] Building CXX object CMakeFiles/onnxruntime_mlas_test.dir/build/source/onnxruntime/test/mlas/unittest/test_scaleoutput.cpp.o1456[ 47%] Building CXX object CMakeFiles/onnxruntime_graph.dir/build/source/onnxruntime/core/graph/model.cc.o1457[ 47%] Building CXX object CMakeFiles/onnxruntime_optimizer.dir/build/source/onnxruntime/core/optimizer/initializer.cc.o1458[ 48%] Building CXX object CMakeFiles/onnxruntime_optimizer.dir/build/source/onnxruntime/core/optimizer/insert_cast_transformer.cc.o1459[ 48%] Building CXX object CMakeFiles/onnxruntime_optimizer.dir/build/source/onnxruntime/core/optimizer/isinf_reducesum_fusion.cc.o1460/nix/store/54yzskzwmapls2awvih149wyzci717gw-onnx-src/onnx/defs/schema.cc: In member function 'onnx::OpSchema& onnx::OpSchema::Input(int, std::string, const std::string&, std::string, FormalParameterOption, bool, int, DifferentiationCategory)':1461/nix/store/54yzskzwmapls2awvih149wyzci717gw-onnx-src/onnx/defs/schema.cc:600:24: warning: unused parameter 'description' [-Wunused-parameter]1462 600 | const std::string& description,1463 | ~~~~~~~~~~~~~~~~~~~^~~~~~~~~~~1464/nix/store/54yzskzwmapls2awvih149wyzci717gw-onnx-src/onnx/defs/schema.cc: In member function 'onnx::OpSchema& onnx::OpSchema::Input(int, const char*, const char*, const char*, FormalParameterOption, bool, int, DifferentiationCategory)':1465/nix/store/54yzskzwmapls2awvih149wyzci717gw-onnx-src/onnx/defs/schema.cc:625:17: warning: unused parameter 'description' [-Wunused-parameter]1466 625 | const char* description,1467 | ~~~~~~~~~~~~^~~~~~~~~~~1468/nix/store/54yzskzwmapls2awvih149wyzci717gw-onnx-src/onnx/defs/schema.cc: In member function 'onnx::OpSchema& onnx::OpSchema::Output(int, std::string, const std::string&, std::string, FormalParameterOption, bool, int, DifferentiationCategory)':1469/nix/store/54yzskzwmapls2awvih149wyzci717gw-onnx-src/onnx/defs/schema.cc:657:24: warning: unused parameter 'description' [-Wunused-parameter]1470 657 | const std::string& description,1471 | ~~~~~~~~~~~~~~~~~~~^~~~~~~~~~~1472/nix/store/54yzskzwmapls2awvih149wyzci717gw-onnx-src/onnx/defs/schema.cc: In member function 'onnx::OpSchema& onnx::OpSchema::Output(int, const char*, const char*, const char*, FormalParameterOption, bool, int, DifferentiationCategory)':1473/nix/store/54yzskzwmapls2awvih149wyzci717gw-onnx-src/onnx/defs/schema.cc:682:17: warning: unused parameter 'description' [-Wunused-parameter]1474 682 | const char* description,1475 | ~~~~~~~~~~~~^~~~~~~~~~~1476[ 48%] Building CXX object CMakeFiles/onnxruntime_optimizer.dir/build/source/onnxruntime/core/optimizer/label_encoder_fusion.cc.o1477[ 48%] Building CXX object CMakeFiles/onnxruntime_optimizer.dir/build/source/onnxruntime/core/optimizer/layer_norm_fusion.cc.o1478[ 48%] Building CXX object CMakeFiles/onnxruntime_optimizer.dir/build/source/onnxruntime/core/optimizer/layout_transformation/layout_transformation.cc.o1479[ 48%] Building CXX object CMakeFiles/onnxruntime_mlas_test.dir/build/source/onnxruntime/test/mlas/unittest/test_softcap.cpp.o1480[ 48%] Building CXX object _deps/onnx-build/CMakeFiles/onnx.dir/onnx/defs/sequence/old.cc.o1481[ 48%] Building CXX object _deps/onnx-build/CMakeFiles/onnx.dir/onnx/defs/sequence/utils.cc.o1482[ 48%] Building CXX object _deps/onnx-build/CMakeFiles/onnx.dir/onnx/defs/shape_inference.cc.o1483[ 48%] Building CXX object _deps/onnx-build/CMakeFiles/onnx.dir/onnx/defs/tensor/defs.cc.o1484[ 48%] Building CXX object CMakeFiles/onnxruntime_optimizer.dir/build/source/onnxruntime/core/optimizer/matmul_activation_fusion.cc.o1485[ 48%] Building CXX object CMakeFiles/onnxruntime_framework.dir/build/source/onnxruntime/core/framework/kernel_type_str_resolver_utils.cc.o1486[ 48%] Building CXX object CMakeFiles/onnxruntime_framework.dir/build/source/onnxruntime/core/framework/layering_annotations.cc.o1487[ 48%] Building CXX object CMakeFiles/onnxruntime_optimizer.dir/build/source/onnxruntime/core/optimizer/matmul_add_fusion.cc.o1488[ 48%] Building CXX object CMakeFiles/onnxruntime_mlas_test.dir/build/source/onnxruntime/test/mlas/unittest/test_softmax.cpp.o1489[ 48%] Building CXX object CMakeFiles/onnxruntime_mlas_test.dir/build/source/onnxruntime/test/mlas/unittest/test_sq8bitgemm.cpp.o1490[ 48%] Building CXX object CMakeFiles/onnxruntime_mlas_test.dir/build/source/onnxruntime/test/mlas/unittest/test_sqlutgemm.cpp.o1491/build/source/onnxruntime/core/optimizer/matmul_add_fusion.cc:263:1: fatal error: error writing to /build/ccKqjpf0.s: No space left on device1492 263 | } // namespace onnxruntime1493 | ^1494compilation terminated.1495make[2]: *** [CMakeFiles/onnxruntime_optimizer.dir/build.make:807: CMakeFiles/onnxruntime_optimizer.dir/build/source/onnxruntime/core/optimizer/matmul_add_fusion.cc.o] Error 11496make[1]: *** [CMakeFiles/Makefile2:1625: CMakeFiles/onnxruntime_optimizer.dir/all] Error 21497/build/source/onnxruntime/core/graph/model.cc:1068:1: fatal error: error writing to /build/ccoKMnNm.s: No space left on device1498 1068 | } // namespace onnxruntime1499 | ^1500compilation terminated.1501make[2]: *** [CMakeFiles/onnxruntime_graph.dir/build.make:499: CMakeFiles/onnxruntime_graph.dir/build/source/onnxruntime/core/graph/model.cc.o] Error 11502make[1]: *** [CMakeFiles/Makefile2:1312: CMakeFiles/onnxruntime_graph.dir/all] Error 21503make[1]: *** [CMakeFiles/Makefile2:1378: CMakeFiles/onnxruntime_framework.dir/all] Error 21504make[1]: *** [CMakeFiles/Makefile2:3153: CMakeFiles/onnxruntime_mlas_test.dir/all] Error 21505make: *** [Makefile:146: all] Error 2