nixbot

builds

failed onnxruntime-1.27.1 checks.x86_64-linux.nixos-dorits-laptop · build #837 · raw

1tribuchet: building on jamie2structuredAttrs is enabled3Sourcing python-catch-conflicts-hook.sh4Using checkPhaseThreadLimitHook
unpackPhase
5unpacking source archive /nix/store/3bgfas08hsxbyqgljj2n514fcwcwgaf0-source6source root is source7separate-debug-info: recording checksum of source files for debug support...
patchPhase
8applying patch /nix/store/hy7lyvr2sbwwy15vb2p6smz7fyh14687-musl-cstdint.patch9patching file include/onnxruntime/core/framework/tensor_shape.h10patching file onnxruntime/test/perftest/strings_helper.h11applying patch /nix/store/dwza8g7791laflhk6g1kjwgqhsz8clkd-remove-MATH_NO_EXCEPT-macro.patch12patching file onnxruntime/test/providers/cpu/math/element_wise_ops_test.cc13Hunk #1 succeeded at 3968 (offset 171 lines).14Hunk #2 succeeded at 3986 (offset 171 lines).15Hunk #3 succeeded at 4000 (offset 171 lines).
configurePhase
16cmake flags: -DCMAKE_FIND_USE_SYSTEM_PACKAGE_REGISTRY=OFF -DCMAKE_FIND_USE_PACKAGE_REGISTRY=OFF -DCMAKE_EXPORT_NO_PACKAGE_REGISTRY=ON -DCMAKE_BUILD_TYPE=Release -DCMAKE_INSTALL_LOCALEDIR=/nix/store/sasv616d39l3jad1pk8qq9kn1dvbcbp6-onnxruntime-1.27.1/share/locale -DCMAKE_INSTALL_LIBEXECDIR=/nix/store/sasv616d39l3jad1pk8qq9kn1dvbcbp6-onnxruntime-1.27.1/libexec -DCMAKE_INSTALL_LIBDIR=/nix/store/sasv616d39l3jad1pk8qq9kn1dvbcbp6-onnxruntime-1.27.1/lib -DCMAKE_INSTALL_DOCDIR=/nix/store/sasv616d39l3jad1pk8qq9kn1dvbcbp6-onnxruntime-1.27.1/share/doc/onnxruntime -DCMAKE_INSTALL_INFODIR=/nix/store/sasv616d39l3jad1pk8qq9kn1dvbcbp6-onnxruntime-1.27.1/share/info -DCMAKE_INSTALL_MANDIR=/nix/store/sasv616d39l3jad1pk8qq9kn1dvbcbp6-onnxruntime-1.27.1/share/man -DCMAKE_INSTALL_INCLUDEDIR=/nix/store/8p5288p9d78pm0m7nhrbp8qjikmg0lsc-onnxruntime-1.27.1-dev/include -DCMAKE_INSTALL_SBINDIR=/nix/store/sasv616d39l3jad1pk8qq9kn1dvbcbp6-onnxruntime-1.27.1/sbin -DCMAKE_INSTALL_BINDIR=/nix/store/sasv616d39l3jad1pk8qq9kn1dvbcbp6-onnxruntime-1.27.1/bin -DCMAKE_INSTALL_NAME_DIR=/nix/store/sasv616d39l3jad1pk8qq9kn1dvbcbp6-onnxruntime-1.27.1/lib -DCMAKE_STRIP=/nix/store/r5ri78axx1qggkjq3vawywlzglg70b5w-gcc-wrapper-16.2.0/bin/strip -DCMAKE_RANLIB=/nix/store/r5ri78axx1qggkjq3vawywlzglg70b5w-gcc-wrapper-16.2.0/bin/ranlib -DCMAKE_AR=/nix/store/r5ri78axx1qggkjq3vawywlzglg70b5w-gcc-wrapper-16.2.0/bin/ar -DCMAKE_C_COMPILER=gcc -DCMAKE_CXX_COMPILER=g++ -DCMAKE_INSTALL_PREFIX=/nix/store/sasv616d39l3jad1pk8qq9kn1dvbcbp6-onnxruntime-1.27.1 --compile-no-warning-as-error -DABSL_ENABLE_INSTALL:BOOL=TRUE -DFETCHCONTENT_FULLY_DISCONNECTED:BOOL=TRUE -DFETCHCONTENT_QUIET:BOOL=FALSE -DFETCHCONTENT_SOURCE_DIR_ABSEIL_CPP:STRING=/nix/store/xfqnd1mhbii0bard2zmxx9pvfjizxhcr-source -DFETCHCONTENT_SOURCE_DIR_DLPACK:STRING=/nix/store/n9ylaq80s7fhi25i89rqrv5ngbiz0bdg-dlpack-src -DFETCHCONTENT_SOURCE_DIR_FLATBUFFERS:STRING=/nix/store/v6bf8zbm7xiv0a3bg27n62kg64j7ql98-source -DFETCHCONTENT_SOURCE_DIR_MP11:STRING=/nix/store/2sbbyvyq7q4p4sjvdl861d3g8m78aljr-mp11-src -DFETCHCONTENT_SOURCE_DIR_ONNX:STRING=/nix/store/54yzskzwmapls2awvih149wyzci717gw-onnx-src -DFETCHCONTENT_SOURCE_DIR_RE2:STRING=/nix/store/py2j3i67pywazyqfaya1m0wg9qbv3k3m-source -DFETCHCONTENT_SOURCE_DIR_SAFEINT:STRING=/nix/store/f13w7sivmfnpdhbcdjl83ibvyz4ihh2p-safeint-src -DFETCHCONTENT_TRY_FIND_PACKAGE_MODE:STRING=ALWAYS -DONNX_CUSTOM_PROTOC_EXECUTABLE:STRING=/nix/store/hjz0cvp9c6vi3mpsnhrnh2qjyhwb1db0-protobuf-36.2/bin/protoc -Donnxruntime_BUILD_SHARED_LIB:BOOL=TRUE -Donnxruntime_BUILD_UNIT_TESTS:BOOL=TRUE -Donnxruntime_USE_FULL_PROTOBUF:BOOL=FALSE -Donnxruntime_USE_CUDA:BOOL=FALSE -Donnxruntime_USE_NCCL:BOOL=FALSE -Donnxruntime_USE_MIGRAPHX:BOOL=FALSE -Donnxruntime_USE_COREML:BOOL=FALSE -Donnxruntime_ENABLE_LTO:BOOL=TRUE -DCMAKE_CXX_FLAGS:STRING=-D_GLIBCXX_USE_OLD_GENERATE_CANONICAL -Donnxruntime_USE_OPENVINO:BOOL=TRUE -Donnxruntime_USE_OPENVINO_AUTO:STRING=NPU\,GPU\,CPU -Donnxruntime_USE_OPENVINO_GPU:BOOL=TRUE -Donnxruntime_USE_OPENVINO_CPU:BOOL=TRUE -Donnxruntime_USE_OPENVINO_NPU:BOOL=TRUE -DOpenVINO_DIR:STRING=/nix/store/kq0d9if8dv85lhr2rm0hziqmlxbp1adb-openvino-2026.4.0-dev/runtime/cmake -Donnxruntime_DISABLE_RTTI:BOOL=FALSE -Donnxruntime_ENABLE_PYTHON:BOOL=TRUE -DPYBIND11_PYTHONLIBS_OVERWRITE=OFF -DPYTHON_EXECUTABLE=/nix/store/xahxrjs30p3mw0a42bqg9ikgkikskw8m-python3-3.14.8/bin/python3.14 -DPYTHON_INCLUDE_DIR=/nix/store/xahxrjs30p3mw0a42bqg9ikgkikskw8m-python3-3.14.8/include/python3.14 -DPYTHON_SITE_PACKAGES=/nix/store/xahxrjs30p3mw0a42bqg9ikgkikskw8m-python3-3.14.8/lib/python3.14/site-packages -DPROTOC_EXE=/nix/store/hjz0cvp9c6vi3mpsnhrnh2qjyhwb1db0-protobuf-36.2/bin/protoc -DProtobuf_PROTOC_EXE=/nix/store/hjz0cvp9c6vi3mpsnhrnh2qjyhwb1db0-protobuf-36.2/bin/protoc -DProtobuf_PROTOC_EXECUTABLE=/nix/store/hjz0cvp9c6vi3mpsnhrnh2qjyhwb1db0-protobuf-36.2/bin/protoc17Ignoring COMPILE_WARNING_AS_ERROR target property and CMAKE_COMPILE_WARNING_AS_ERROR variable.18CMake Warning (deprecated) at CMakeLists.txt:9 (cmake_policy):19 The OLD behavior for policy CMP0104 will be removed from a future version20 of CMake.2122 The cmake-policies(7) manual explains that the OLD behaviors of all23 policies are deprecated and that a policy should be set to OLD only under24 specific short-term circumstances. Projects should be ported to the NEW25 behavior and not rely on setting a policy to OLD.26This warning is for project developers. Use -Wno-author or -Wno-deprecated27to suppress it.2829-- The C compiler identification is GNU 16.2.030-- The CXX compiler identification is GNU 16.2.031-- The ASM compiler identification is GNU32-- Found assembler: /nix/store/r5ri78axx1qggkjq3vawywlzglg70b5w-gcc-wrapper-16.2.0/bin/gcc33-- Detecting C compiler ABI info34-- Detecting C compiler ABI info - done35-- Check for working C compiler: /nix/store/r5ri78axx1qggkjq3vawywlzglg70b5w-gcc-wrapper-16.2.0/bin/gcc - skipped36-- Detecting C compile features37-- Detecting C compile features - done38-- Detecting CXX compiler ABI info39-- Detecting CXX compiler ABI info - done40-- Check for working CXX compiler: /nix/store/r5ri78axx1qggkjq3vawywlzglg70b5w-gcc-wrapper-16.2.0/bin/g++ - skipped41-- Detecting CXX compile features42-- Detecting CXX compile features - done43-- Setting CMAKE_C_STANDARD to 9944-- Setting CMAKE_CXX_STANDARD to 2045-- onnxruntime_target_platform = x86_6446-- Performing Test COMPILER_SUPPORT_MF16C47-- Performing Test COMPILER_SUPPORT_MF16C - Success48-- Performing Test COMPILER_SUPPORT_FMA49-- Performing Test COMPILER_SUPPORT_FMA - Success50-- Performing Test COMPILER_SUPPORT_AVX51-- Performing Test COMPILER_SUPPORT_AVX - Success52-- Performing Test onnxruntime_HAVE_BUILTIN_ATOMICS53-- Performing Test onnxruntime_HAVE_BUILTIN_ATOMICS - Success54-- Performing Test CMAKE_HAVE_LIBC_PTHREAD55-- Performing Test CMAKE_HAVE_LIBC_PTHREAD - Success56-- Found Threads: TRUE57-- Performing Test Iconv_IS_BUILT_IN58-- Performing Test Iconv_IS_BUILT_IN - Success59-- Found Iconv: built in to C library60-- Found Patch: /nix/store/d5jz315vxbphknfawsrjs192ci9bc6df-patch-2.8/bin/patch61Patch found: /nix/store/d5jz315vxbphknfawsrjs192ci9bc6df-patch-2.8/bin/patch62-- Found Python: /nix/store/xahxrjs30p3mw0a42bqg9ikgkikskw8m-python3-3.14.8/bin/python3.14 (found suitable version "3.14.8", minimum required is "3.10") found components: Interpreter Development.Module NumPy63Numpy version: 2.5.364-- Loading Dependencies URLs ...65-- Loading Dependencies ...66-- Fetch abseil_cpp from https://github.com/abseil/abseil-cpp/archive/refs/tags/20250814.0.zip67-- Performing Test ABSL_INTERNAL_AT_LEAST_CXX1768-- Performing Test ABSL_INTERNAL_AT_LEAST_CXX17 - Success69-- Performing Test ABSL_INTERNAL_AT_LEAST_CXX2070-- Performing Test ABSL_INTERNAL_AT_LEAST_CXX20 - Success71-- Abseil source dir:/nix/store/xfqnd1mhbii0bard2zmxx9pvfjizxhcr-source72-- Fetch re2 from https://github.com/google/re2/archive/refs/tags/2024-07-02.zip73-- Fetch googletest from https://github.com/google/googletest/archive/refs/tags/v1.17.0.zip74-- Fetch Protobuf from https://github.com/protocolbuffers/protobuf/archive/refs/tags/v21.12.zip75-- Found ZLIB: /nix/store/ji36842higmp6b06hbbpmzbd59g1c07c-zlib-1.3.2/lib/libz.so (found version "1.3.2")76-- Using protobuf from find_package(or vcpkg). Protobuf version: 36.2.077-- Fetch date from https://github.com/HowardHinnant/date/archive/refs/tags/v3.0.1.zip78-- Fetch mp11 from https://github.com/boostorg/mp11/archive/refs/tags/boost-1.82.0.zip79CMake Warning (author) at /nix/store/rlpcs1h48m058z811xxkn5672v77p5qj-cmake-4.4.4/share/cmake-4.4/Modules/FetchContent.cmake:1968 (message):80 Calling FetchContent_Populate(mp11) is deprecated, call81 FetchContent_MakeAvailable(mp11) instead. Policy CMP0169 can be set to OLD82 to allow FetchContent_Populate(mp11) to be called directly for now, but the83 ability to call it with declared details will be removed completely in a84 future version.85Call Stack (most recent call first):86 external/onnxruntime_external_deps.cmake:295 (FetchContent_Populate)87 CMakeLists.txt:591 (include)88This warning is for project developers. Use -Wno-author to suppress it.8990-- Fetch nlohmann_json from https://github.com/nlohmann/json/archive/refs/tags/v3.11.3.zip91-- Applying sysfs fallback patch for cpuinfo on Linux92-- Fetch pytorch_cpuinfo from https://github.com/pytorch/cpuinfo/archive/403d652dca4c1046e8145950b1c0997a9f748b57.zip93-- Aliasing cpuinfo::cpuinfo to cpuinfo94-- Fetch GSL from https://github.com/microsoft/GSL/archive/refs/tags/v4.2.1.zip95-- Fetch safeint from https://github.com/dcleblanc/SafeInt/archive/refs/tags/3.0.28.zip96CMake Warning (author) at /nix/store/rlpcs1h48m058z811xxkn5672v77p5qj-cmake-4.4.4/share/cmake-4.4/Modules/FetchContent.cmake:1968 (message):97 Calling FetchContent_Populate(safeint) is deprecated, call98 FetchContent_MakeAvailable(safeint) instead. Policy CMP0169 can be set to99 OLD to allow FetchContent_Populate(safeint) to be called directly for now,100 but the ability to call it with declared details will be removed completely101 in a future version.102Call Stack (most recent call first):103 external/onnxruntime_external_deps.cmake:440 (FetchContent_Populate)104 CMakeLists.txt:591 (include)105This warning is for project developers. Use -Wno-author to suppress it.106107-- Fetch flatbuffers from https://github.com/google/flatbuffers/archive/refs/tags/v23.5.26.zip108-- Proceeding with version: 23.5.26.0109-- Looking for strtof_l110-- Looking for strtof_l - found111-- Looking for strtoull_l112-- Looking for strtoull_l - found113-- Looking for realpath114-- Looking for realpath - found115-- CMAKE_CXX_FLAGS: -D_GLIBCXX_USE_OLD_GENERATE_CANONICAL -ffunction-sections -fdata-sections116-- Fetch pybind11_project from https://github.com/pybind/pybind11/archive/refs/tags/v3.0.2.zip117-- Found pybind11: /nix/store/aaiyjhv7zpx9k9x1357dkls4hnj9cxbg-python3.14-pybind11-3.1.0/include (found version "")118Setting pybind11_lib119-- Fetch onnx from https://github.com/onnx/onnx/archive/refs/tags/v1.21.0.zip120-- Found Python3: /nix/store/xahxrjs30p3mw0a42bqg9ikgkikskw8m-python3-3.14.8/bin/python3.14 (found version "3.14.8") found components: Interpreter121-- Found Python: /nix/store/xahxrjs30p3mw0a42bqg9ikgkikskw8m-python3-3.14.8/bin/python3.14 (found version "3.14.8") found components: Interpreter122-- Using custom protoc executable123-- ONNX_PROTOC_EXECUTABLE: /nix/store/hjz0cvp9c6vi3mpsnhrnh2qjyhwb1db0-protobuf-36.2/bin/protoc124Generated: /build/source/build/_deps/onnx-build/onnx/onnx-ml.proto125Generated: /build/source/build/_deps/onnx-build/onnx/onnx-operators-ml.proto126Generated: /build/source/build/_deps/onnx-build/onnx/onnx-data.proto127-- 128-- ******** Summary ********129-- CMake version : 4.4.4130-- CMake command : /nix/store/rlpcs1h48m058z811xxkn5672v77p5qj-cmake-4.4.4/bin/cmake131-- System : Linux132-- C++ compiler : /nix/store/r5ri78axx1qggkjq3vawywlzglg70b5w-gcc-wrapper-16.2.0/bin/g++133-- C++ compiler version : 16.2.0134-- Build type : Release135-- CMAKE_INSTALL_PREFIX : /nix/store/sasv616d39l3jad1pk8qq9kn1dvbcbp6-onnxruntime-1.27.1136-- CMAKE_MODULE_PATH : /build/source/cmake/external;/nix/store/54yzskzwmapls2awvih149wyzci717gw-onnx-src/cmake/external137-- 138-- ONNX version : 1.21.0139-- ONNX NAMESPACE : onnx140-- ONNX_USE_LITE_PROTO : ON141-- ONNX_USE_PROTOBUF_SHARED_LIBS : OFF142-- ONNX_DISABLE_EXCEPTIONS : OFF143-- ONNX_DISABLE_STATIC_REGISTRATION : OFF144-- ONNX_WERROR : OFF145-- ONNX_HARDENING : OFF146-- ONNX_BUILD_TESTS : OFF147-- ONNX_USE_UNITY_BUILD : OFF148-- BUILD_SHARED_LIBS : OFF149-- 150-- onnx compile options : -Wall;-Wextra;-Wno-stringop-overflow151-- onnx_proto compile options : -Wall;-Wextra;-Wno-stringop-overflow152-- onnx compile definitions : ONNX_NAMESPACE=onnx;ONNX_ML=1;ONNX_USE_LITE_PROTO=1153-- onnx_proto compile definitions : ONNX_NAMESPACE=onnx;ONNX_ML=1;ONNX_USE_LITE_PROTO=1154-- onnx link libraries : protobuf::libprotobuf-lite155-- onnx_proto link libraries : protobuf::libprotobuf-lite156-- 157-- Protobuf version : 36.2.0158-- Protobuf compiler : /nix/store/hjz0cvp9c6vi3mpsnhrnh2qjyhwb1db0-protobuf-36.2/bin/protoc159-- ONNX_BUILD_PYTHON : OFF160-- Fetch Eigen3 from https://github.com/eigen-mirror/eigen/archive/1d8b82b0740839c0de7f1242a3585e3390ff5f33/eigen-1d8b82b0740839c0de7f1242a3585e3390ff5f33.zip161-- dlpack is enabled.162-- Fetch dlpack from https://github.com/dmlc/dlpack/archive/5c210da409e7f1e51ddf445134a4376fdbd70d7d.zip163-- C++11 support has been enabled by default.164-- Finished fetching external dependencies165-- Performing Test HAS_AMBIGUOUS_REVERSED_OPERATOR166-- Performing Test HAS_AMBIGUOUS_REVERSED_OPERATOR - Failed167-- Performing Test HAS_INTERFERENCE_SIZE168-- Performing Test HAS_INTERFERENCE_SIZE - Success169-- Performing Test HAS_ARRAY_BOUNDS170-- Performing Test HAS_ARRAY_BOUNDS - Success171-- Performing Test HAS_BITWISE_INSTEAD_OF_LOGICAL172-- Performing Test HAS_BITWISE_INSTEAD_OF_LOGICAL - Failed173-- Performing Test HAS_CAST_FUNCTION_TYPE174-- Performing Test HAS_CAST_FUNCTION_TYPE - Success175-- Performing Test HAS_CATCH_VALUE176-- Performing Test HAS_CATCH_VALUE - Success177-- Performing Test HAS_CLASS_MEMACCESS178-- Performing Test HAS_CLASS_MEMACCESS - Success179-- Performing Test HAS_CHARACTER_CONVERSION180-- Performing Test HAS_CHARACTER_CONVERSION - Failed181-- Performing Test HAS_NO_ERROR_CHARACTER_CONVERSION182-- Performing Test HAS_NO_ERROR_CHARACTER_CONVERSION - Failed183-- Performing Test HAS_DANGLING_REFERENCE184-- Performing Test HAS_DANGLING_REFERENCE - Success185-- Performing Test HAS_DEPRECATED_ANON_ENUM_ENUM_CONVERSION186-- Performing Test HAS_DEPRECATED_ANON_ENUM_ENUM_CONVERSION - Failed187-- Performing Test HAS_DEPRECATED_BUILTINS188-- Performing Test HAS_DEPRECATED_BUILTINS - Failed189-- Performing Test HAS_DEPRECATED_COPY190-- Performing Test HAS_DEPRECATED_COPY - Success191-- Performing Test HAS_DEPRECATED_DECLARATIONS192-- Performing Test HAS_DEPRECATED_DECLARATIONS - Success193-- Performing Test HAS_DEPRECATED_LITERAL_OPERATOR194-- Performing Test HAS_DEPRECATED_LITERAL_OPERATOR - Success195-- Performing Test HAS_DEPRECATED_THIS_CAPTURE196-- Performing Test HAS_DEPRECATED_THIS_CAPTURE - Failed197-- Performing Test HAS_ENUM_CONSTEXPR_CONVERSION198-- Performing Test HAS_ENUM_CONSTEXPR_CONVERSION - Failed199-- Performing Test HAS_FORMAT_TRUNCATION200-- Performing Test HAS_FORMAT_TRUNCATION - Success201-- Performing Test HAS_IGNORED_ATTRIBUTES202-- Performing Test HAS_IGNORED_ATTRIBUTES - Success203-- Performing Test HAS_MAYBE_UNINITIALIZED204-- Performing Test HAS_MAYBE_UNINITIALIZED - Success205-- Performing Test HAS_MISSING_BRACES206-- Performing Test HAS_MISSING_BRACES - Success207-- Performing Test HAS_NONNULL_COMPARE208-- Performing Test HAS_NONNULL_COMPARE - Success209-- Performing Test HAS_PARENTHESES210-- Performing Test HAS_PARENTHESES - Success211-- Performing Test HAS_SHORTEN_64_TO_32212-- Performing Test HAS_SHORTEN_64_TO_32 - Failed213-- Performing Test HAS_STRICT_ALIASING214-- Performing Test HAS_STRICT_ALIASING - Success215-- Performing Test HAS_STRINGOP_OVERFLOW216-- Performing Test HAS_STRINGOP_OVERFLOW - Success217-- Performing Test HAS_TAUTOLOGICAL_POINTER_COMPARE218-- Performing Test HAS_TAUTOLOGICAL_POINTER_COMPARE - Failed219-- Performing Test HAS_UNDEFINED_VAR_TEMPLATE220-- Performing Test HAS_UNDEFINED_VAR_TEMPLATE - Failed221-- Performing Test HAS_UNUSED_BUT_SET_PARAMETER222-- Performing Test HAS_UNUSED_BUT_SET_PARAMETER - Success223-- Performing Test HAS_UNUSED_BUT_SET_VARIABLE224-- Performing Test HAS_UNUSED_BUT_SET_VARIABLE - Success225-- Performing Test HAS_UNUSED_VARIABLE226-- Performing Test HAS_UNUSED_VARIABLE - Success227-- Performing Test HAS_USELESS_CAST228-- Performing Test HAS_USELESS_CAST - Success229-- Looking for reallocarray230-- Looking for reallocarray - found231-- Could NOT find Git (missing: GIT_EXECUTABLE) 232-- Looking for clock_gettime in rt233-- Looking for clock_gettime in rt - found234-- Python Build is enabled235-- CMAKE_CXX_COMPILER_ID: GNU236-- CMAKE_CXX_COMPILER_VERSION: 16.2.0237-- Using -mavx2 -mfma -mavxvnni flags238-- Performing Test LINKER_SUPPORT_RPATH239-- Performing Test LINKER_SUPPORT_RPATH - Success240-- Python_EXECUTABLE: /nix/store/xahxrjs30p3mw0a42bqg9ikgkikskw8m-python3-3.14.8/bin/python3.14241-- Configuring done (11.4s)242-- Generating done (0.7s)243CMake Warning (unused-cli):244 Manually-specified variables were not used by the project:245246 CMAKE_EXPORT_NO_PACKAGE_REGISTRY247 FETCHCONTENT_FULLY_DISCONNECTED248 FETCHCONTENT_QUIET249 PROTOC_EXE250 PYBIND11_PYTHONLIBS_OVERWRITE251 PYTHON_EXECUTABLE252 PYTHON_INCLUDE_DIR253 PYTHON_SITE_PACKAGES254 Protobuf_PROTOC_EXE255 Protobuf_PROTOC_EXECUTABLE256257258-- Build files have been written to: /build/source/build
buildPhase
259build flags: -j24 SHELL=/nix/store/nnm9gdr70ihc6zc9298mzz8jpcgaciql-bash-5.3p20/bin/bash260Ignoring COMPILE_WARNING_AS_ERROR target property and CMAKE_COMPILE_WARNING_AS_ERROR variable.261[ 0%] Building CXX object _deps/abseil_cpp-build/absl/base/CMakeFiles/log_severity.dir/log_severity.cc.o262[ 0%] Building CXX object _deps/abseil_cpp-build/absl/base/CMakeFiles/strerror.dir/internal/strerror.cc.o263[ 0%] Building CXX object _deps/abseil_cpp-build/absl/types/CMakeFiles/source_location.dir/source_location.cc.o264[ 0%] Building CXX object _deps/abseil_cpp-build/absl/base/CMakeFiles/spinlock_wait.dir/internal/spinlock_wait.cc.o265[ 0%] Building CXX object _deps/abseil_cpp-build/absl/debugging/CMakeFiles/utf8_for_code_point.dir/internal/utf8_for_code_point.cc.o266[ 1%] Building CXX object _deps/abseil_cpp-build/absl/time/CMakeFiles/time_zone.dir/internal/cctz/src/time_zone_fixed.cc.o267[ 1%] Building CXX object _deps/abseil_cpp-build/absl/profiling/CMakeFiles/exponential_biased.dir/internal/exponential_biased.cc.o268[ 1%] Building CXX object _deps/abseil_cpp-build/absl/flags/CMakeFiles/flags_commandlineflag_internal.dir/internal/commandlineflag.cc.o269[ 1%] Building CXX object _deps/abseil_cpp-build/absl/random/CMakeFiles/random_internal_platform.dir/internal/randen_round_keys.cc.o270[ 1%] Building CXX object _deps/flatbuffers-build/CMakeFiles/flatbuffers.dir/src/idl_parser.cpp.o271[ 2%] Building CXX object CMakeFiles/custom_op_library.dir/build/source/onnxruntime/test/testdata/custom_op_library/cpu/cpu_ops.cc.o272[ 2%] Building CXX object _deps/abseil_cpp-build/absl/base/CMakeFiles/hardening.dir/internal/hardening.cc.o273[ 2%] Building CXX object CMakeFiles/onnxruntime_providers_shared.dir/build/source/onnxruntime/core/providers/shared/common.cc.o274[ 2%] Generating onnxruntime.lds, generated_source.c275[ 2%] Building CXX object CMakeFiles/custom_op_local_function.dir/build/source/onnxruntime/test/testdata/custom_op_local_function/custom_op_local_function.cc.o276[ 2%] Building CXX object _deps/flatbuffers-build/CMakeFiles/flatc.dir/src/idl_parser.cpp.o277[ 2%] Building CXX object CMakeFiles/onnxruntime_mocked_allocator.dir/build/source/onnxruntime/test/util/test_allocator.cc.o278[ 2%] Building CXX object _deps/abseil_cpp-build/absl/debugging/CMakeFiles/leak_check.dir/leak_check.cc.o279[ 2%] Building CXX object CMakeFiles/custom_op_invalid_library.dir/build/source/onnxruntime/test/testdata/custom_op_invalid_library/custom_op_library.cc.o280[ 2%] Building CXX object CMakeFiles/custom_op_get_const_input_test_library.dir/build/source/onnxruntime/test/testdata/custom_op_get_const_input_test_library/custom_op.cc.o281[ 3%] Building CXX object CMakeFiles/custom_op_openvino_wrapper_library.dir/build/source/onnxruntime/test/testdata/custom_op_openvino_wrapper_library/custom_op_lib.cc.o282[ 3%] Building CXX object _deps/abseil_cpp-build/absl/log/CMakeFiles/log_internal_nullguard.dir/internal/nullguard.cc.o283[ 3%] Building CXX object _deps/abseil_cpp-build/absl/time/CMakeFiles/civil_time.dir/internal/cctz/src/civil_time_detail.cc.o284[ 3%] Building CXX object CMakeFiles/onnxruntime_mlas.dir/build/source/onnxruntime/core/mlas/lib/platform.cpp.o285[ 3%] Linking CXX shared library libonnxruntime_providers_shared.so286[ 3%] Linking CXX static library libabsl_random_internal_platform.a287[ 3%] Linking CXX static library libabsl_leak_check.a288Generating symbol file for ['cpu', 'openvino']289VERSION:1.27.1290[ 3%] Linking CXX static library libabsl_utf8_for_code_point.a291[ 4%] Linking CXX static library libabsl_source_location.a292[ 4%] Built target onnxruntime_generate_def293[ 4%] Built target random_internal_platform294[ 4%] Building CXX object CMakeFiles/custom_op_local_function.dir/build/source/onnxruntime/test/testdata/custom_op_local_function/dummy_gemm.cc.o295[ 4%] Linking CXX static library libabsl_flags_commandlineflag_internal.a296[ 4%] Built target leak_check297[ 4%] Building CXX object CMakeFiles/custom_op_get_const_input_test_library.dir/build/source/onnxruntime/test/testdata/custom_op_get_const_input_test_library/custom_op_lib.cc.o298[ 4%] Built target utf8_for_code_point299[ 4%] Building CXX object _deps/abseil_cpp-build/absl/time/CMakeFiles/time_zone.dir/internal/cctz/src/time_zone_format.cc.o300[ 4%] Built target source_location301[ 4%] Building CXX object _deps/flatbuffers-build/CMakeFiles/flatbuffers.dir/src/idl_gen_text.cpp.o302[ 4%] Building CXX object _deps/abseil_cpp-build/absl/time/CMakeFiles/time_zone.dir/internal/cctz/src/time_zone_if.cc.o303[ 5%] Linking CXX shared module libcustom_op_invalid_library.so304[ 5%] Built target flags_commandlineflag_internal305[ 5%] Linking CXX static library libabsl_log_internal_nullguard.a306[ 5%] Building CXX object _deps/flatbuffers-build/CMakeFiles/flatbuffers.dir/src/reflection.cpp.o307[ 5%] Linking CXX static library libabsl_hardening.a308[ 5%] Built target log_internal_nullguard309[ 5%] Building CXX object _deps/abseil_cpp-build/absl/time/CMakeFiles/time_zone.dir/internal/cctz/src/time_zone_impl.cc.o310[ 5%] Linking CXX static library libabsl_spinlock_wait.a311[ 5%] Built target hardening312[ 5%] Building CXX object _deps/abseil_cpp-build/absl/time/CMakeFiles/time_zone.dir/internal/cctz/src/time_zone_info.cc.o313[ 5%] Built target spinlock_wait314[ 5%] Building CXX object _deps/abseil_cpp-build/absl/time/CMakeFiles/time_zone.dir/internal/cctz/src/time_zone_libc.cc.o315[ 5%] Built target onnxruntime_providers_shared316[ 5%] Building CXX object _deps/abseil_cpp-build/absl/time/CMakeFiles/time_zone.dir/internal/cctz/src/time_zone_lookup.cc.o317[ 5%] Built target custom_op_invalid_library318[ 5%] Building CXX object _deps/abseil_cpp-build/absl/time/CMakeFiles/time_zone.dir/internal/cctz/src/time_zone_posix.cc.o319[ 5%] Linking CXX static library libabsl_exponential_biased.a320[ 5%] Linking CXX static library libabsl_strerror.a321[ 5%] Built target exponential_biased322[ 5%] Built target strerror323[ 5%] Linking CXX static library libabsl_log_severity.a324[ 5%] Building CXX object _deps/flatbuffers-build/CMakeFiles/flatbuffers.dir/src/util.cpp.o325[ 5%] Building CXX object CMakeFiles/custom_op_library.dir/build/source/onnxruntime/test/testdata/custom_op_library/custom_op_library.cc.o326[ 5%] Built target log_severity327[ 5%] Building CXX object CMakeFiles/onnxruntime_mlas.dir/build/source/onnxruntime/core/mlas/lib/threading.cpp.o328[ 5%] Linking CXX static library libabsl_civil_time.a329[ 5%] Built target civil_time330[ 5%] Building CXX object _deps/abseil_cpp-build/absl/random/CMakeFiles/random_internal_randen_hwaes_impl.dir/internal/randen_hwaes.cc.o331[ 5%] Building CXX object _deps/abseil_cpp-build/absl/random/CMakeFiles/random_internal_randen_slow.dir/internal/randen_slow.cc.o332[ 5%] Building CXX object _deps/abseil_cpp-build/absl/base/CMakeFiles/raw_logging_internal.dir/internal/raw_logging.cc.o333[ 5%] Building CXX object CMakeFiles/onnxruntime_mlas.dir/build/source/onnxruntime/core/mlas/lib/sgemm.cpp.o334[ 5%] Building CXX object CMakeFiles/onnxruntime_mlas.dir/build/source/onnxruntime/core/mlas/lib/halfgemm.cpp.o335[ 5%] Building CXX object CMakeFiles/onnxruntime_mlas.dir/build/source/onnxruntime/core/mlas/lib/qgemm.cpp.o336[ 5%] Linking CXX static library libabsl_random_internal_randen_hwaes_impl.a337[ 5%] Building CXX object CMakeFiles/onnxruntime_mlas.dir/build/source/onnxruntime/core/mlas/lib/qdwconv.cpp.o338[ 5%] Built target random_internal_randen_hwaes_impl339[ 5%] Building CXX object CMakeFiles/onnxruntime_mlas.dir/build/source/onnxruntime/core/mlas/lib/convolve.cpp.o340[ 6%] Building CXX object CMakeFiles/onnxruntime_mlas.dir/build/source/onnxruntime/core/mlas/lib/sconv_nchw_depthwise_multiplier_greater_than_1.cpp.o341[ 6%] Building CXX object CMakeFiles/onnxruntime_mlas.dir/build/source/onnxruntime/core/mlas/lib/convsym.cpp.o342[ 6%] Building CXX object _deps/flatbuffers-build/CMakeFiles/flatc.dir/src/idl_gen_text.cpp.o343[ 6%] Linking CXX static library libabsl_random_internal_randen_slow.a344[ 6%] Building CXX object _deps/flatbuffers-build/CMakeFiles/flatc.dir/src/reflection.cpp.o345[ 6%] Linking CXX static library libabsl_raw_logging_internal.a346[ 6%] Built target random_internal_randen_slow347[ 6%] Building CXX object _deps/flatbuffers-build/CMakeFiles/flatc.dir/src/util.cpp.o348[ 6%] Built target raw_logging_internal349[ 6%] Building CXX object _deps/flatbuffers-build/CMakeFiles/flatc.dir/src/idl_gen_binary.cpp.o350[ 6%] Building CXX object _deps/abseil_cpp-build/absl/time/CMakeFiles/time_zone.dir/internal/cctz/src/zone_info_source.cc.o351[ 6%] Linking CXX shared module libcustom_op_get_const_input_test_library.so352[ 6%] Linking CXX shared module libcustom_op_local_function.so353[ 6%] Building CXX object _deps/abseil_cpp-build/absl/random/CMakeFiles/random_internal_randen_hwaes.dir/internal/randen_detect.cc.o354[ 7%] Linking CXX static library libonnxruntime_mocked_allocator.a355[ 7%] Built target onnxruntime_mocked_allocator356[ 7%] Building CXX object _deps/abseil_cpp-build/absl/base/CMakeFiles/base.dir/casts.cc.o357[ 7%] Linking CXX static library libabsl_random_internal_randen_hwaes.a358[ 7%] Built target random_internal_randen_hwaes359[ 7%] Building CXX object _deps/abseil_cpp-build/absl/base/CMakeFiles/throw_delegate.dir/throw_delegate.cc.o360[ 7%] Building CXX object _deps/flatbuffers-build/CMakeFiles/flatc.dir/src/idl_gen_cpp.cpp.o361[ 7%] Built target custom_op_get_const_input_test_library362[ 7%] Building CXX object _deps/abseil_cpp-build/absl/base/CMakeFiles/base.dir/internal/cycleclock.cc.o363[ 7%] Building CXX object _deps/abseil_cpp-build/absl/base/CMakeFiles/base.dir/internal/spinlock.cc.o364[ 7%] Linking CXX static library libabsl_time_zone.a365[ 7%] Building CXX object _deps/abseil_cpp-build/absl/base/CMakeFiles/base.dir/internal/sysinfo.cc.o366[ 7%] Built target custom_op_local_function367[ 7%] Building CXX object _deps/abseil_cpp-build/absl/base/CMakeFiles/base.dir/internal/thread_identity.cc.o368[ 7%] Built target time_zone369[ 7%] Building CXX object _deps/abseil_cpp-build/absl/base/CMakeFiles/base.dir/internal/unscaledcycleclock.cc.o370[ 7%] Building CXX object _deps/abseil_cpp-build/absl/debugging/CMakeFiles/debugging_internal.dir/internal/address_is_readable.cc.o371[ 7%] Linking CXX static library libabsl_throw_delegate.a372[ 7%] Building CXX object _deps/abseil_cpp-build/absl/strings/CMakeFiles/cordz_functions.dir/internal/cordz_functions.cc.o373[ 7%] Building CXX object _deps/flatbuffers-build/CMakeFiles/flatc.dir/src/idl_gen_csharp.cpp.o374[ 7%] Built target throw_delegate375[ 7%] Building CXX object _deps/flatbuffers-build/CMakeFiles/flatc.dir/src/idl_gen_dart.cpp.o376[ 7%] Building CXX object _deps/flatbuffers-build/CMakeFiles/flatc.dir/src/idl_gen_kotlin.cpp.o377[ 7%] Building CXX object CMakeFiles/custom_op_openvino_wrapper_library.dir/build/source/onnxruntime/test/testdata/custom_op_openvino_wrapper_library/openvino_wrapper.cc.o378[ 7%] Building CXX object _deps/flatbuffers-build/CMakeFiles/flatc.dir/src/idl_gen_go.cpp.o379[ 7%] Building CXX object _deps/abseil_cpp-build/absl/debugging/CMakeFiles/debugging_internal.dir/internal/elf_mem_image.cc.o380[ 7%] Building CXX object _deps/flatbuffers-build/CMakeFiles/flatc.dir/src/idl_gen_java.cpp.o381[ 7%] Building CXX object _deps/flatbuffers-build/CMakeFiles/flatc.dir/src/idl_gen_ts.cpp.o382[ 7%] Linking CXX static library libabsl_base.a383[ 7%] Building CXX object _deps/flatbuffers-build/CMakeFiles/flatc.dir/src/idl_gen_php.cpp.o384[ 7%] Built target base385[ 7%] Building CXX object _deps/flatbuffers-build/CMakeFiles/flatc.dir/src/idl_gen_python.cpp.o386[ 7%] Building CXX object _deps/abseil_cpp-build/absl/random/CMakeFiles/random_seed_gen_exception.dir/seed_gen_exception.cc.o387[ 7%] Linking CXX static library libabsl_cordz_functions.a388[ 7%] Building CXX object _deps/abseil_cpp-build/absl/random/CMakeFiles/random_internal_randen.dir/internal/randen.cc.o389[ 7%] Building CXX object _deps/abseil_cpp-build/absl/base/CMakeFiles/base_cpu_detect.dir/internal/cpu_detect.cc.o390[ 8%] Building CXX object _deps/flatbuffers-build/CMakeFiles/flatc.dir/src/idl_gen_lobster.cpp.o391[ 8%] Building CXX object _deps/abseil_cpp-build/absl/base/CMakeFiles/malloc_internal.dir/internal/low_level_alloc.cc.o392[ 8%] Building CXX object _deps/flatbuffers-build/CMakeFiles/flatc.dir/src/idl_gen_rust.cpp.o393[ 8%] Built target cordz_functions394[ 8%] Building CXX object _deps/flatbuffers-build/CMakeFiles/flatc.dir/src/idl_gen_fbs.cpp.o395[ 8%] Linking CXX static library libabsl_random_internal_randen.a396[ 8%] Building CXX object CMakeFiles/onnxruntime_mlas.dir/build/source/onnxruntime/core/mlas/lib/pooling.cpp.o397[ 8%] Built target random_internal_randen398[ 8%] Building CXX object _deps/flatbuffers-build/CMakeFiles/flatc.dir/src/idl_gen_grpc.cpp.o399[ 8%] Building CXX object _deps/abseil_cpp-build/absl/base/CMakeFiles/tracing_internal.dir/internal/tracing.cc.o400[ 8%] Linking CXX static library libabsl_tracing_internal.a401[ 8%] Built target tracing_internal402[ 8%] Building CXX object CMakeFiles/onnxruntime_mlas.dir/build/source/onnxruntime/core/mlas/lib/transpose.cpp.o403[ 8%] Building CXX object _deps/abseil_cpp-build/absl/debugging/CMakeFiles/debugging_internal.dir/internal/vdso_support.cc.o404[ 8%] Building CXX object CMakeFiles/onnxruntime_mlas.dir/build/source/onnxruntime/core/mlas/lib/reorder.cpp.o405[ 8%] Linking CXX static library libabsl_base_cpu_detect.a406[ 8%] Built target base_cpu_detect407[ 8%] Linking CXX static library libabsl_random_seed_gen_exception.a408[ 8%] Building CXX object _deps/flatbuffers-build/CMakeFiles/flatc.dir/src/idl_gen_json_schema.cpp.o409[ 8%] Built target random_seed_gen_exception410[ 8%] Building CXX object _deps/flatbuffers-build/CMakeFiles/flatc.dir/src/idl_gen_swift.cpp.o411[ 8%] Linking CXX static library libabsl_malloc_internal.a412[ 8%] Linking CXX static library libabsl_debugging_internal.a413[ 8%] Built target debugging_internal414[ 8%] Built target malloc_internal415[ 8%] Building CXX object CMakeFiles/onnxruntime_mlas.dir/build/source/onnxruntime/core/mlas/lib/snchwc.cpp.o416[ 8%] Building CXX object _deps/abseil_cpp-build/absl/debugging/CMakeFiles/decode_rust_punycode.dir/internal/decode_rust_punycode.cc.o417[ 8%] Linking CXX shared library libcustom_op_library.so418[ 8%] Linking CXX static library libabsl_decode_rust_punycode.a419[ 8%] Built target decode_rust_punycode420[ 8%] Building CXX object _deps/flatbuffers-build/CMakeFiles/flatc.dir/src/file_name_saving_file_manager.cpp.o421[ 8%] Building CXX object _deps/abseil_cpp-build/absl/numeric/CMakeFiles/int128.dir/int128.cc.o422[ 8%] Building CXX object _deps/abseil_cpp-build/absl/strings/CMakeFiles/strings_internal.dir/internal/ostringstream.cc.o423[ 8%] Building CXX object _deps/abseil_cpp-build/absl/synchronization/CMakeFiles/graphcycles_internal.dir/internal/graphcycles.cc.o424[ 8%] Building CXX object _deps/abseil_cpp-build/absl/crc/CMakeFiles/crc_internal.dir/internal/crc.cc.o425[ 8%] Building CXX object _deps/abseil_cpp-build/absl/strings/CMakeFiles/strings_internal.dir/internal/utf8.cc.o426[ 8%] Building CXX object _deps/abseil_cpp-build/absl/strings/CMakeFiles/strings_internal.dir/internal/escaping.cc.o427[ 8%] Building CXX object CMakeFiles/onnxruntime_mlas.dir/build/source/onnxruntime/core/mlas/lib/activate.cpp.o428[ 8%] Building CXX object CMakeFiles/onnxruntime_mlas.dir/build/source/onnxruntime/core/mlas/lib/logistic.cpp.o429[ 8%] Building CXX object CMakeFiles/onnxruntime_mlas.dir/build/source/onnxruntime/core/mlas/lib/tanh.cpp.o430[ 8%] Building CXX object _deps/flatbuffers-build/CMakeFiles/flatc.dir/src/file_binary_writer.cpp.o431[ 8%] Building CXX object _deps/flatbuffers-build/CMakeFiles/flatc.dir/src/file_writer.cpp.o432[ 8%] Building CXX object CMakeFiles/onnxruntime_mlas.dir/build/source/onnxruntime/core/mlas/lib/eltwise.cpp.o433[ 8%] Building CXX object CMakeFiles/onnxruntime_mlas.dir/build/source/onnxruntime/core/mlas/lib/erf.cpp.o434[ 8%] Building CXX object CMakeFiles/onnxruntime_mlas.dir/build/source/onnxruntime/core/mlas/lib/silu.cpp.o435[ 8%] Building CXX object _deps/flatbuffers-build/CMakeFiles/flatc.dir/src/flatc.cpp.o436[ 8%] Building CXX object CMakeFiles/onnxruntime_mlas.dir/build/source/onnxruntime/core/mlas/lib/gelu.cpp.o437[ 9%] Linking CXX static library libflatbuffers.a438[ 9%] Linking CXX static library libabsl_int128.a439[ 9%] Building CXX object _deps/abseil_cpp-build/absl/hash/CMakeFiles/city.dir/internal/city.cc.o440[ 9%] Built target int128441[ 9%] Building CXX object _deps/abseil_cpp-build/absl/crc/CMakeFiles/crc_internal.dir/internal/crc_x86_arm_combined.cc.o442[ 9%] Building CXX object _deps/abseil_cpp-build/absl/log/CMakeFiles/log_internal_conditions.dir/internal/conditions.cc.o443[ 9%] Built target flatbuffers444[ 9%] Building CXX object _deps/flatbuffers-build/CMakeFiles/flatc.dir/src/flatc_main.cpp.o445[ 9%] Building CXX object _deps/flatbuffers-build/CMakeFiles/flatc.dir/src/binary_annotator.cpp.o446[ 9%] Building CXX object _deps/abseil_cpp-build/absl/debugging/CMakeFiles/stacktrace.dir/stacktrace.cc.o447[ 9%] Building CXX object _deps/abseil_cpp-build/absl/debugging/CMakeFiles/demangle_rust.dir/internal/demangle_rust.cc.o448[ 9%] Linking CXX static library libabsl_strings_internal.a449[ 9%] Built target strings_internal450[ 9%] Linking CXX static library libabsl_log_internal_conditions.a451[ 9%] Building CXX object _deps/flatbuffers-build/CMakeFiles/flatc.dir/src/annotated_binary_text_gen.cpp.o452[ 9%] Building CXX object _deps/flatbuffers-build/CMakeFiles/flatc.dir/src/bfbs_gen_lua.cpp.o453[ 9%] Built target log_internal_conditions454[ 9%] Linking CXX static library libabsl_graphcycles_internal.a455[ 9%] Linking CXX shared module libcustom_op_openvino_wrapper_library.so456[ 9%] Building CXX object _deps/flatbuffers-build/CMakeFiles/flatc.dir/src/bfbs_gen_nim.cpp.o457[ 9%] Linking CXX static library libabsl_demangle_rust.a458[ 9%] Built target graphcycles_internal459[ 9%] Building CXX object _deps/flatbuffers-build/CMakeFiles/flatc.dir/src/code_generators.cpp.o460[ 9%] Built target demangle_rust461[ 10%] Building CXX object _deps/flatbuffers-build/CMakeFiles/flatc.dir/grpc/src/compiler/cpp_generator.cc.o462[ 10%] Building CXX object _deps/abseil_cpp-build/absl/strings/CMakeFiles/strings.dir/ascii.cc.o463[ 10%] Building CXX object _deps/abseil_cpp-build/absl/strings/CMakeFiles/strings.dir/charconv.cc.o464[ 10%] Linking CXX static library libabsl_stacktrace.a465[ 10%] Built target stacktrace466[ 10%] Building CXX object _deps/flatbuffers-build/CMakeFiles/flatc.dir/grpc/src/compiler/go_generator.cc.o467[ 10%] Building CXX object CMakeFiles/onnxruntime_mlas.dir/build/source/onnxruntime/core/mlas/lib/compute.cpp.o468[ 11%] Building CXX object _deps/abseil_cpp-build/absl/debugging/CMakeFiles/demangle_internal.dir/internal/demangle.cc.o469[ 11%] Linking CXX static library libabsl_crc_internal.a470[ 11%] Linking CXX static library libabsl_city.a471[ 11%] Built target city472[ 11%] Built target crc_internal473[ 11%] Building CXX object CMakeFiles/onnxruntime_mlas.dir/build/source/onnxruntime/core/mlas/lib/dequantize.cpp.o474[ 11%] Building CXX object CMakeFiles/onnxruntime_mlas.dir/build/source/onnxruntime/core/mlas/lib/quantize.cpp.o475[ 12%] Building CXX object CMakeFiles/onnxruntime_mlas.dir/build/source/onnxruntime/core/mlas/lib/qgemm_kernel_default.cpp.o476[ 12%] Built target custom_op_library477[ 12%] Building CXX object _deps/abseil_cpp-build/absl/strings/CMakeFiles/strings.dir/escaping.cc.o478[ 12%] Linking CXX static library libabsl_demangle_internal.a479[ 12%] Built target demangle_internal480[ 12%] Building CXX object _deps/flatbuffers-build/CMakeFiles/flatc.dir/grpc/src/compiler/java_generator.cc.o481[ 12%] Building CXX object CMakeFiles/onnxruntime_mlas.dir/build/source/onnxruntime/core/mlas/lib/qladd.cpp.o482[ 12%] Building CXX object CMakeFiles/onnxruntime_mlas.dir/build/source/onnxruntime/core/mlas/lib/qlmul.cpp.o483[ 12%] Building CXX object _deps/abseil_cpp-build/absl/strings/CMakeFiles/strings.dir/internal/charconv_bigint.cc.o484[ 12%] Building CXX object _deps/abseil_cpp-build/absl/strings/CMakeFiles/strings.dir/internal/charconv_parse.cc.o485[ 12%] Building CXX object _deps/abseil_cpp-build/absl/strings/CMakeFiles/strings.dir/internal/damerau_levenshtein_distance.cc.o486[ 12%] Building CXX object _deps/abseil_cpp-build/absl/strings/CMakeFiles/strings.dir/internal/memutil.cc.o487[ 12%] Built target custom_op_openvino_wrapper_library488[ 12%] Building CXX object _deps/abseil_cpp-build/absl/strings/CMakeFiles/strings.dir/internal/stringify_sink.cc.o489[ 12%] Building CXX object _deps/abseil_cpp-build/absl/strings/CMakeFiles/strings.dir/match.cc.o490[ 12%] Building CXX object _deps/abseil_cpp-build/absl/strings/CMakeFiles/strings.dir/numbers.cc.o491[ 13%] Building CXX object _deps/abseil_cpp-build/absl/strings/CMakeFiles/strings.dir/str_cat.cc.o492[ 13%] Building CXX object _deps/abseil_cpp-build/absl/strings/CMakeFiles/strings.dir/str_replace.cc.o493[ 13%] Building CXX object _deps/abseil_cpp-build/absl/strings/CMakeFiles/strings.dir/str_split.cc.o494[ 13%] Building CXX object _deps/abseil_cpp-build/absl/strings/CMakeFiles/strings.dir/substitute.cc.o495[ 13%] Building CXX object CMakeFiles/onnxruntime_mlas.dir/build/source/onnxruntime/core/mlas/lib/qpostprocessor.cpp.o496[ 13%] Building CXX object CMakeFiles/onnxruntime_mlas.dir/build/source/onnxruntime/core/mlas/lib/qlgavgpool.cpp.o497[ 13%] Building CXX object CMakeFiles/onnxruntime_mlas.dir/build/source/onnxruntime/core/mlas/lib/qdwconv_kernelsize.cpp.o498[ 13%] Building CXX object CMakeFiles/onnxruntime_mlas.dir/build/source/onnxruntime/core/mlas/lib/qnbitgemm.cpp.o499[ 13%] Building CXX object CMakeFiles/onnxruntime_mlas.dir/build/source/onnxruntime/core/mlas/lib/qlutgemm.cpp.o500[ 13%] Building CXX object CMakeFiles/onnxruntime_mlas.dir/build/source/onnxruntime/core/mlas/lib/flashattn.cpp.o501[ 13%] Building CXX object CMakeFiles/onnxruntime_mlas.dir/build/source/onnxruntime/core/mlas/lib/flashattn_qkv.cpp.o502[ 13%] Building CXX object CMakeFiles/onnxruntime_mlas.dir/build/source/onnxruntime/core/mlas/lib/qkv_quant.cpp.o503[ 13%] Building CXX object _deps/flatbuffers-build/CMakeFiles/flatc.dir/grpc/src/compiler/python_generator.cc.o504[ 13%] Building CXX object _deps/flatbuffers-build/CMakeFiles/flatc.dir/grpc/src/compiler/swift_generator.cc.o505[ 13%] Building CXX object _deps/flatbuffers-build/CMakeFiles/flatc.dir/grpc/src/compiler/ts_generator.cc.o506[ 13%] Building CXX object CMakeFiles/onnxruntime_mlas.dir/build/source/onnxruntime/core/mlas/lib/cast.cpp.o507[ 13%] Building CXX object CMakeFiles/onnxruntime_mlas.dir/build/source/onnxruntime/core/mlas/lib/layernorm.cpp.o508[ 13%] Building CXX object CMakeFiles/onnxruntime_mlas.dir/build/source/onnxruntime/core/mlas/lib/rotary_embedding.cpp.o509[ 13%] Building CXX object CMakeFiles/onnxruntime_mlas.dir/build/source/onnxruntime/core/mlas/lib/saturation_check.cpp.o510[ 13%] Building CXX object CMakeFiles/onnxruntime_mlas.dir/build/source/onnxruntime/core/mlas/lib/q4_dq.cpp.o511[ 14%] Building CXX object CMakeFiles/onnxruntime_mlas.dir/build/source/onnxruntime/core/mlas/lib/q4gemm.cpp.o512[ 14%] Building CXX object CMakeFiles/onnxruntime_mlas.dir/build/source/onnxruntime/core/mlas/lib/activate_fp16.cpp.o513[ 14%] Building CXX object CMakeFiles/onnxruntime_mlas.dir/build/source/onnxruntime/core/mlas/lib/dwconv.cpp.o514[ 14%] Building CXX object CMakeFiles/onnxruntime_mlas.dir/build/source/onnxruntime/core/mlas/lib/dgemm.cpp.o515[ 14%] Linking CXX static library libabsl_strings.a516[ 14%] Built target strings517[ 14%] Building CXX object _deps/abseil_cpp-build/absl/debugging/CMakeFiles/symbolize.dir/symbolize.cc.o518[ 14%] Building CXX object _deps/abseil_cpp-build/absl/time/CMakeFiles/time.dir/civil_time.cc.o519[ 14%] Building CXX object _deps/abseil_cpp-build/absl/strings/CMakeFiles/str_format_internal.dir/internal/str_format/arg.cc.o520[ 14%] Building CXX object _deps/abseil_cpp-build/absl/hash/CMakeFiles/hash.dir/internal/hash.cc.o521[ 14%] Building CXX object _deps/abseil_cpp-build/absl/strings/CMakeFiles/str_format_internal.dir/internal/str_format/bind.cc.o522[ 14%] Building CXX object CMakeFiles/onnxruntime_mlas.dir/build/source/onnxruntime/core/mlas/lib/pooling_fp16.cpp.o523[ 14%] Linking CXX executable flatc524[ 14%] Building CXX object _deps/abseil_cpp-build/absl/time/CMakeFiles/time.dir/clock.cc.o525[ 14%] Linking CXX static library libabsl_symbolize.a526[ 14%] Built target symbolize527[ 14%] Building CXX object _deps/abseil_cpp-build/absl/flags/CMakeFiles/flags_commandlineflag.dir/commandlineflag.cc.o528[ 14%] Building CXX object _deps/abseil_cpp-build/absl/log/CMakeFiles/log_internal_proto.dir/internal/proto.cc.o529[ 14%] Building CXX object _deps/abseil_cpp-build/absl/log/CMakeFiles/log_internal_fnmatch.dir/internal/fnmatch.cc.o530[ 14%] Building CXX object _deps/abseil_cpp-build/absl/random/CMakeFiles/random_distributions.dir/discrete_distribution.cc.o531[ 14%] Building CXX object _deps/abseil_cpp-build/absl/random/CMakeFiles/random_distributions.dir/gaussian_distribution.cc.o532[ 14%] Linking CXX static library libabsl_log_internal_fnmatch.a533[ 14%] Building CXX object CMakeFiles/onnxruntime_mlas.dir/build/source/onnxruntime/core/mlas/lib/qgemm_kernel_avx2.cpp.o534[ 14%] Built target log_internal_fnmatch535[ 14%] Building CXX object CMakeFiles/onnxruntime_mlas.dir/build/source/onnxruntime/core/mlas/lib/qgemm_kernel_sse.cpp.o536[ 14%] Building CXX object _deps/abseil_cpp-build/absl/random/CMakeFiles/random_internal_seed_material.dir/internal/seed_material.cc.o537[ 14%] Building CXX object _deps/abseil_cpp-build/absl/debugging/CMakeFiles/examine_stack.dir/internal/examine_stack.cc.o538[ 14%] Building CXX object _deps/abseil_cpp-build/absl/strings/CMakeFiles/str_format_internal.dir/internal/str_format/extension.cc.o539[ 14%] Building ASM object CMakeFiles/onnxruntime_mlas.dir/build/source/onnxruntime/core/mlas/lib/x86_64/DgemmKernelSse2.S.o540[ 15%] Building CXX object _deps/abseil_cpp-build/absl/strings/CMakeFiles/str_format_internal.dir/internal/str_format/float_conversion.cc.o541[ 15%] Linking CXX static library libabsl_hash.a542[ 15%] Building ASM object CMakeFiles/onnxruntime_mlas.dir/build/source/onnxruntime/core/mlas/lib/x86_64/SgemmKernelSse2.S.o543[ 15%] Built target hash544[ 15%] Building CXX object _deps/abseil_cpp-build/absl/strings/CMakeFiles/str_format_internal.dir/internal/str_format/output.cc.o545[ 15%] Building CXX object _deps/abseil_cpp-build/absl/time/CMakeFiles/time.dir/duration.cc.o546[ 15%] Building CXX object _deps/abseil_cpp-build/absl/time/CMakeFiles/time.dir/format.cc.o547[ 15%] Building ASM object CMakeFiles/onnxruntime_mlas.dir/build/source/onnxruntime/core/mlas/lib/x86_64/SgemmTransposePackB16x4Sse2.S.o548[ 15%] Linking CXX static library libabsl_flags_commandlineflag.a549[ 15%] Building CXX object _deps/abseil_cpp-build/absl/time/CMakeFiles/time.dir/time.cc.o550[ 15%] Built target flags_commandlineflag551[ 15%] Building CXX object _deps/abseil_cpp-build/absl/strings/CMakeFiles/str_format_internal.dir/internal/str_format/parser.cc.o552[ 15%] Building ASM object CMakeFiles/onnxruntime_mlas.dir/build/source/onnxruntime/core/mlas/lib/x86_64/SconvKernelSse2.S.o553[ 15%] Building CXX object _deps/abseil_cpp-build/absl/flags/CMakeFiles/flags_private_handle_accessor.dir/internal/private_handle_accessor.cc.o554[ 15%] Building ASM object CMakeFiles/onnxruntime_mlas.dir/build/source/onnxruntime/core/mlas/lib/x86_64/SpoolKernelSse2.S.o555[ 15%] Building ASM object CMakeFiles/onnxruntime_mlas.dir/build/source/onnxruntime/core/mlas/lib/x86_64/cvtfp16a.S.o556[ 15%] Building ASM object CMakeFiles/onnxruntime_mlas.dir/build/source/onnxruntime/core/mlas/lib/x86_64/DgemmKernelAvx.S.o557[ 15%] Building ASM object CMakeFiles/onnxruntime_mlas.dir/build/source/onnxruntime/core/mlas/lib/x86_64/SgemmKernelAvx.S.o558[ 16%] Building ASM object CMakeFiles/onnxruntime_mlas.dir/build/source/onnxruntime/core/mlas/lib/x86_64/SgemmKernelM1Avx.S.o559[ 16%] Building ASM object CMakeFiles/onnxruntime_mlas.dir/build/source/onnxruntime/core/mlas/lib/x86_64/SgemmKernelM1TransposeBAvx.S.o560[ 16%] Linking CXX static library libabsl_log_internal_proto.a561[ 16%] Building ASM object CMakeFiles/onnxruntime_mlas.dir/build/source/onnxruntime/core/mlas/lib/x86_64/SconvKernelAvx.S.o562[ 16%] Building ASM object CMakeFiles/onnxruntime_mlas.dir/build/source/onnxruntime/core/mlas/lib/x86_64/SpoolKernelAvx.S.o563[ 16%] Building ASM object CMakeFiles/onnxruntime_mlas.dir/build/source/onnxruntime/core/mlas/lib/x86_64/SoftmaxKernelAvx.S.o564[ 16%] Building ASM object CMakeFiles/onnxruntime_mlas.dir/build/source/onnxruntime/core/mlas/lib/x86_64/SgemmTransposePackB16x4Avx.S.o565[ 16%] Building CXX object CMakeFiles/onnxruntime_mlas.dir/build/source/onnxruntime/core/mlas/lib/intrinsics/avx/min_max_elements.cpp.o566[ 16%] Built target log_internal_proto567[ 16%] Building ASM object CMakeFiles/onnxruntime_mlas.dir/build/source/onnxruntime/core/mlas/lib/x86_64/QgemmU8S8KernelAvx2.S.o568[ 16%] Building ASM object CMakeFiles/onnxruntime_mlas.dir/build/source/onnxruntime/core/mlas/lib/x86_64/QgemvU8S8KernelAvx2.S.o569[ 16%] Building ASM object CMakeFiles/onnxruntime_mlas.dir/build/source/onnxruntime/core/mlas/lib/x86_64/QgemmU8U8KernelAvx2.S.o570[ 16%] Building ASM object CMakeFiles/onnxruntime_mlas.dir/build/source/onnxruntime/core/mlas/lib/x86_64/QgemvU8S8KernelAvxVnni.S.o571[ 16%] Building ASM object CMakeFiles/onnxruntime_mlas.dir/build/source/onnxruntime/core/mlas/lib/x86_64/QgemmU8X8KernelAvx2.S.o572[ 16%] Building ASM object CMakeFiles/onnxruntime_mlas.dir/build/source/onnxruntime/core/mlas/lib/x86_64/ConvSymKernelAvx2.S.o573[ 16%] Building ASM object CMakeFiles/onnxruntime_mlas.dir/build/source/onnxruntime/core/mlas/lib/x86_64/DgemmKernelFma3.S.o574[ 16%] Building ASM object CMakeFiles/onnxruntime_mlas.dir/build/source/onnxruntime/core/mlas/lib/x86_64/SgemmKernelFma3.S.o575[ 16%] Building ASM object CMakeFiles/onnxruntime_mlas.dir/build/source/onnxruntime/core/mlas/lib/x86_64/SconvKernelFma3.S.o576[ 17%] Building ASM object CMakeFiles/onnxruntime_mlas.dir/build/source/onnxruntime/core/mlas/lib/x86_64/TransKernelFma3.S.o577[ 17%] Building ASM object CMakeFiles/onnxruntime_mlas.dir/build/source/onnxruntime/core/mlas/lib/x86_64/LogisticKernelFma3.S.o578[ 17%] Building ASM object CMakeFiles/onnxruntime_mlas.dir/build/source/onnxruntime/core/mlas/lib/x86_64/TanhKernelFma3.S.o579[ 17%] Building ASM object CMakeFiles/onnxruntime_mlas.dir/build/source/onnxruntime/core/mlas/lib/x86_64/ErfKernelFma3.S.o580[ 17%] Building CXX object CMakeFiles/onnxruntime_mlas.dir/build/source/onnxruntime/core/mlas/lib/intrinsics/avx2/qladd_avx2.cpp.o581[ 17%] Building CXX object CMakeFiles/onnxruntime_mlas.dir/build/source/onnxruntime/core/mlas/lib/intrinsics/avx2/qdwconv_avx2.cpp.o582[ 17%] Building CXX object CMakeFiles/onnxruntime_mlas.dir/build/source/onnxruntime/core/mlas/lib/intrinsics/avx2/saturation_check_avx2.cpp.o583[ 17%] Building CXX object CMakeFiles/onnxruntime_mlas.dir/build/source/onnxruntime/core/mlas/lib/sqnbitgemm_kernel_avx2.cpp.o584[ 17%] Building CXX object CMakeFiles/onnxruntime_mlas.dir/build/source/onnxruntime/core/mlas/lib/sqnbitgemm_lut_kernel_avx2.cpp.o585[ 17%] Building CXX object CMakeFiles/onnxruntime_mlas.dir/build/source/onnxruntime/core/mlas/lib/rotary_embedding_kernel_avx2.cpp.o586[ 17%] Building ASM object CMakeFiles/onnxruntime_mlas.dir/build/source/onnxruntime/core/mlas/lib/x86_64/cvtfp16Avx.S.o587[ 17%] Building CXX object CMakeFiles/onnxruntime_mlas.dir/build/source/onnxruntime/core/mlas/lib/qkv_quant_kernel_avx2.cpp.o588[ 17%] Building CXX object _deps/abseil_cpp-build/absl/log/CMakeFiles/log_internal_structured_proto.dir/internal/structured_proto.cc.o589[ 17%] Building ASM object CMakeFiles/onnxruntime_mlas.dir/build/source/onnxruntime/core/mlas/lib/x86_64/DgemmKernelAvx512F.S.o590[ 17%] Linking CXX static library libabsl_examine_stack.a591[ 17%] Linking CXX static library libabsl_random_distributions.a592[ 17%] Building ASM object CMakeFiles/onnxruntime_mlas.dir/build/source/onnxruntime/core/mlas/lib/x86_64/SgemmKernelAvx512F.S.o593[ 17%] Built target examine_stack594[ 17%] Built target random_distributions595[ 17%] Building ASM object CMakeFiles/onnxruntime_mlas.dir/build/source/onnxruntime/core/mlas/lib/x86_64/SconvKernelAvx512F.S.o596[ 17%] Building ASM object CMakeFiles/onnxruntime_mlas.dir/build/source/onnxruntime/core/mlas/lib/x86_64/SoftmaxKernelAvx512F.S.o597[ 18%] Building ASM object CMakeFiles/onnxruntime_mlas.dir/build/source/onnxruntime/core/mlas/lib/x86_64/SpoolKernelAvx512F.S.o598[ 18%] Building ASM object CMakeFiles/onnxruntime_mlas.dir/build/source/onnxruntime/core/mlas/lib/x86_64/TransKernelAvx512F.S.o599[ 18%] Building CXX object CMakeFiles/onnxruntime_mlas.dir/build/source/onnxruntime/core/mlas/lib/intrinsics/avx512/gelu_avx512f.cpp.o600[ 18%] Building CXX object CMakeFiles/onnxruntime_mlas.dir/build/source/onnxruntime/core/mlas/lib/intrinsics/avx512/silu_avx512f.cpp.o601[ 18%] Building CXX object CMakeFiles/onnxruntime_mlas.dir/build/source/onnxruntime/core/mlas/lib/intrinsics/avx512/quantize_avx512f.cpp.o602[ 18%] Linking CXX static library libabsl_flags_private_handle_accessor.a603[ 18%] Linking CXX static library libabsl_random_internal_seed_material.a604[ 18%] Built target flags_private_handle_accessor605[ 18%] Building CXX object CMakeFiles/onnxruntime_mlas.dir/build/source/onnxruntime/core/mlas/lib/intrinsics/avx512/sconv_nchw_depthwise_multiplier_greater_than_1_avx512f.cpp.o606[ 18%] Built target random_internal_seed_material607[ 18%] Building ASM object CMakeFiles/onnxruntime_mlas.dir/build/source/onnxruntime/core/mlas/lib/x86_64/QgemvU8S8KernelAvx512Core.S.o608[ 18%] Building ASM object CMakeFiles/onnxruntime_mlas.dir/build/source/onnxruntime/core/mlas/lib/x86_64/QgemvU8S8KernelAvx512Vnni.S.o609[ 18%] Building ASM object CMakeFiles/onnxruntime_mlas.dir/build/source/onnxruntime/core/mlas/lib/x86_64/QgemmU8X8KernelAvx512Core.S.o610[ 18%] Building ASM object CMakeFiles/onnxruntime_mlas.dir/build/source/onnxruntime/core/mlas/lib/x86_64/ConvSymKernelAvx512Core.S.o611[ 18%] Building CXX object CMakeFiles/onnxruntime_mlas.dir/build/source/onnxruntime/core/mlas/lib/sqnbitgemm_kernel_avx512.cpp.o612[ 18%] Building CXX object CMakeFiles/onnxruntime_mlas.dir/build/source/onnxruntime/core/mlas/lib/sqnbitgemm_kernel_avx512vnni.cpp.o613[ 18%] Building CXX object CMakeFiles/onnxruntime_mlas.dir/build/source/onnxruntime/core/mlas/lib/qkv_quant_kernel_avx512vnni.cpp.o614[ 18%] Building CXX object CMakeFiles/onnxruntime_mlas.dir/build/source/onnxruntime/core/mlas/lib/q4gemm_avx512.cpp.o615[ 18%] Linking CXX static library libabsl_str_format_internal.a616[ 18%] Building ASM object CMakeFiles/onnxruntime_mlas.dir/build/source/onnxruntime/core/mlas/lib/x86_64/QgemmU8S8KernelAmxCommon.S.o617[ 18%] Built target str_format_internal618[ 18%] Building CXX object CMakeFiles/onnxruntime_mlas.dir/build/source/onnxruntime/core/mlas/lib/qgemm_kernel_amx.cpp.o619[ 19%] Building ASM object CMakeFiles/onnxruntime_mlas.dir/build/source/onnxruntime/core/mlas/lib/x86_64/QgemmU8S8KernelAmx.S.o620[ 19%] Building CXX object _deps/abseil_cpp-build/absl/crc/CMakeFiles/crc32c.dir/crc32c.cc.o621[ 19%] Linking CXX static library libabsl_log_internal_structured_proto.a622[ 19%] Built target log_internal_structured_proto623[ 19%] Building CXX object _deps/abseil_cpp-build/absl/flags/CMakeFiles/flags_marshalling.dir/marshalling.cc.o624[ 19%] Linking CXX static library libabsl_time.a625[ 19%] Building CXX object _deps/abseil_cpp-build/absl/crc/CMakeFiles/crc32c.dir/internal/crc_memcpy_fallback.cc.o626[ 19%] Built target time627[ 19%] Building CXX object _deps/abseil_cpp-build/absl/crc/CMakeFiles/crc32c.dir/internal/crc_memcpy_x86_arm_combined.cc.o628[ 19%] Building CXX object _deps/abseil_cpp-build/absl/crc/CMakeFiles/crc32c.dir/internal/crc_non_temporal_memcpy.cc.o629[ 19%] Building CXX object _deps/abseil_cpp-build/absl/synchronization/CMakeFiles/kernel_timeout_internal.dir/internal/kernel_timeout.cc.o630[ 19%] Building CXX object _deps/abseil_cpp-build/absl/log/CMakeFiles/log_internal_globals.dir/internal/globals.cc.o631[ 19%] Building CXX object _deps/abseil_cpp-build/absl/log/CMakeFiles/log_entry.dir/log_entry.cc.o632[ 19%] Linking CXX static library libabsl_flags_marshalling.a633[ 19%] Built target flags_marshalling634[ 19%] Linking CXX static library libabsl_kernel_timeout_internal.a635[ 19%] Built target kernel_timeout_internal636[ 19%] Linking CXX static library libabsl_crc32c.a637[ 19%] Built target crc32c638[ 19%] Linking CXX static library libabsl_log_internal_globals.a639[ 19%] Building CXX object _deps/abseil_cpp-build/absl/synchronization/CMakeFiles/synchronization.dir/barrier.cc.o640[ 19%] Built target log_internal_globals641[ 19%] Building CXX object _deps/abseil_cpp-build/absl/crc/CMakeFiles/crc_cord_state.dir/internal/crc_cord_state.cc.o642[ 19%] Linking CXX static library libabsl_log_entry.a643[ 19%] Built target log_entry644[ 19%] Building CXX object _deps/abseil_cpp-build/absl/log/CMakeFiles/log_internal_format.dir/internal/log_format.cc.o645[ 19%] Building CXX object _deps/abseil_cpp-build/absl/log/CMakeFiles/log_sink.dir/log_sink.cc.o646[ 19%] Building CXX object _deps/abseil_cpp-build/absl/synchronization/CMakeFiles/synchronization.dir/blocking_counter.cc.o647[ 19%] Building CXX object _deps/abseil_cpp-build/absl/synchronization/CMakeFiles/synchronization.dir/internal/create_thread_identity.cc.o648[ 19%] Building CXX object _deps/abseil_cpp-build/absl/synchronization/CMakeFiles/synchronization.dir/internal/futex_waiter.cc.o649[ 19%] Building CXX object _deps/abseil_cpp-build/absl/synchronization/CMakeFiles/synchronization.dir/internal/per_thread_sem.cc.o650[ 19%] Linking CXX static library libonnxruntime_mlas.a651[ 20%] Building CXX object _deps/abseil_cpp-build/absl/synchronization/CMakeFiles/synchronization.dir/internal/pthread_waiter.cc.o652[ 20%] Built target onnxruntime_mlas653[ 20%] Building CXX object _deps/abseil_cpp-build/absl/synchronization/CMakeFiles/synchronization.dir/internal/sem_waiter.cc.o654[ 20%] Building CXX object _deps/abseil_cpp-build/absl/synchronization/CMakeFiles/synchronization.dir/internal/stdcpp_waiter.cc.o655[ 20%] Building CXX object _deps/abseil_cpp-build/absl/synchronization/CMakeFiles/synchronization.dir/internal/waiter_base.cc.o656[ 20%] Linking CXX static library libabsl_crc_cord_state.a657[ 20%] Building CXX object _deps/abseil_cpp-build/absl/synchronization/CMakeFiles/synchronization.dir/internal/win32_waiter.cc.o658[ 20%] Building CXX object _deps/abseil_cpp-build/absl/synchronization/CMakeFiles/synchronization.dir/notification.cc.o659[ 20%] Built target crc_cord_state660[ 20%] Building CXX object _deps/abseil_cpp-build/absl/synchronization/CMakeFiles/synchronization.dir/mutex.cc.o661[ 20%] Linking CXX static library libabsl_log_sink.a662[ 20%] Built target log_sink663[ 20%] Building CXX object _deps/abseil_cpp-build/absl/strings/CMakeFiles/cord_internal.dir/internal/cord_internal.cc.o664[ 20%] Linking CXX static library libabsl_log_internal_format.a665[ 20%] Built target log_internal_format666[ 20%] Building CXX object _deps/abseil_cpp-build/absl/strings/CMakeFiles/cord_internal.dir/internal/cord_rep_btree.cc.o667[ 20%] Building CXX object _deps/abseil_cpp-build/absl/strings/CMakeFiles/cord_internal.dir/internal/cord_rep_btree_navigator.cc.o668[ 20%] Building CXX object _deps/abseil_cpp-build/absl/strings/CMakeFiles/cord_internal.dir/internal/cord_rep_btree_reader.cc.o669[ 20%] Building CXX object _deps/abseil_cpp-build/absl/strings/CMakeFiles/cord_internal.dir/internal/cord_rep_crc.cc.o670[ 20%] Building CXX object _deps/abseil_cpp-build/absl/strings/CMakeFiles/cord_internal.dir/internal/cord_rep_consume.cc.o671[ 20%] Linking CXX static library libabsl_synchronization.a672[ 20%] Built target synchronization673[ 20%] Building CXX object _deps/abseil_cpp-build/absl/container/CMakeFiles/hashtablez_sampler.dir/internal/hashtablez_sampler.cc.o674[ 20%] Building CXX object _deps/abseil_cpp-build/absl/container/CMakeFiles/hashtablez_sampler.dir/internal/hashtablez_sampler_force_weak_definition.cc.o675[ 20%] Building CXX object _deps/abseil_cpp-build/absl/strings/CMakeFiles/cordz_handle.dir/internal/cordz_handle.cc.o676[ 20%] Building CXX object _deps/abseil_cpp-build/absl/flags/CMakeFiles/flags_program_name.dir/internal/program_name.cc.o677[ 20%] Building CXX object _deps/abseil_cpp-build/absl/log/CMakeFiles/vlog_config_internal.dir/internal/vlog_config.cc.o678[ 21%] Building CXX object _deps/abseil_cpp-build/absl/random/CMakeFiles/random_internal_entropy_pool.dir/internal/entropy_pool.cc.o679[ 21%] Linking CXX static library libabsl_cord_internal.a680[ 21%] Built target cord_internal681[ 21%] Linking CXX static library libabsl_random_internal_entropy_pool.a682[ 21%] Linking CXX static library libabsl_hashtablez_sampler.a683[ 21%] Built target random_internal_entropy_pool684[ 21%] Built target hashtablez_sampler685[ 22%] Building CXX object _deps/abseil_cpp-build/absl/random/CMakeFiles/random_seed_sequences.dir/seed_sequences.cc.o686[ 22%] Linking CXX static library libabsl_flags_program_name.a687[ 22%] Linking CXX static library libabsl_cordz_handle.a688[ 22%] Built target flags_program_name689[ 22%] Built target cordz_handle690[ 22%] Building CXX object _deps/abseil_cpp-build/absl/flags/CMakeFiles/flags_config.dir/usage_config.cc.o691[ 22%] Building CXX object _deps/abseil_cpp-build/absl/strings/CMakeFiles/cordz_info.dir/internal/cordz_info.cc.o692[ 23%] Linking CXX static library libabsl_vlog_config_internal.a693[ 23%] Built target vlog_config_internal694[ 23%] Building CXX object _deps/abseil_cpp-build/absl/log/CMakeFiles/log_globals.dir/globals.cc.o695[ 23%] Linking CXX static library libabsl_random_seed_sequences.a696[ 23%] Built target random_seed_sequences697[ 23%] Linking CXX static library libabsl_flags_config.a698[ 23%] Built target flags_config699[ 23%] Building CXX object _deps/abseil_cpp-build/absl/flags/CMakeFiles/flags_internal.dir/internal/flag.cc.o700[ 23%] Linking CXX static library libabsl_log_globals.a701[ 23%] Built target log_globals702[ 24%] Building CXX object _deps/abseil_cpp-build/absl/log/CMakeFiles/log_initialize.dir/initialize.cc.o703[ 24%] Building CXX object _deps/abseil_cpp-build/absl/log/CMakeFiles/log_internal_log_sink_set.dir/internal/log_sink_set.cc.o704[ 24%] Linking CXX static library libabsl_cordz_info.a705[ 24%] Built target cordz_info706[ 25%] Building CXX object _deps/abseil_cpp-build/absl/strings/CMakeFiles/cord.dir/cord.cc.o707[ 25%] Building CXX object _deps/abseil_cpp-build/absl/strings/CMakeFiles/cord.dir/cord_analysis.cc.o708[ 25%] Linking CXX static library libabsl_log_initialize.a709[ 25%] Built target log_initialize710[ 25%] Linking CXX static library libabsl_log_internal_log_sink_set.a711[ 25%] Linking CXX static library libabsl_flags_internal.a712[ 25%] Built target log_internal_log_sink_set713[ 25%] Built target flags_internal714[ 25%] Building CXX object _deps/abseil_cpp-build/absl/log/CMakeFiles/log_internal_message.dir/internal/log_message.cc.o715[ 25%] Built target flatc716[ 25%] Linking CXX static library libabsl_cord.a717[ 25%] Built target cord718[ 25%] Building CXX object _deps/abseil_cpp-build/absl/status/CMakeFiles/status.dir/internal/status_internal.cc.o719[ 25%] Building CXX object _deps/abseil_cpp-build/absl/status/CMakeFiles/status.dir/status.cc.o720[ 25%] Building CXX object _deps/abseil_cpp-build/absl/container/CMakeFiles/raw_hash_set.dir/internal/raw_hash_set.cc.o721[ 25%] Building CXX object _deps/abseil_cpp-build/absl/status/CMakeFiles/status.dir/status_payload_printer.cc.o722[ 25%] Linking CXX static library libabsl_log_internal_message.a723[ 25%] Built target log_internal_message724[ 25%] Building CXX object _deps/abseil_cpp-build/absl/log/CMakeFiles/log_internal_check_op.dir/internal/check_op.cc.o725[ 25%] Building CXX object _deps/abseil_cpp-build/absl/log/CMakeFiles/die_if_null.dir/die_if_null.cc.o726[ 25%] Linking CXX static library libabsl_die_if_null.a727[ 25%] Built target die_if_null728[ 25%] Linking CXX static library libabsl_log_internal_check_op.a729[ 25%] Built target log_internal_check_op730[ 25%] Linking CXX static library libabsl_status.a731[ 25%] Built target status732[ 25%] Building CXX object _deps/abseil_cpp-build/absl/status/CMakeFiles/statusor.dir/statusor.cc.o733[ 25%] Linking CXX static library libabsl_raw_hash_set.a734[ 25%] Built target raw_hash_set735[ 25%] Building CXX object _deps/abseil_cpp-build/absl/flags/CMakeFiles/flags_reflection.dir/reflection.cc.o736[ 25%] Linking CXX static library libabsl_statusor.a737[ 25%] Built target statusor738[ 25%] Linking CXX static library libabsl_flags_reflection.a739[ 25%] Built target flags_reflection740[ 25%] Running gen_proto.py on onnx/onnx-data.in.proto741[ 25%] Running gen_proto.py on onnx/onnx.in.proto742[ 26%] Running gen_proto.py on onnx/onnx-operators.in.proto743[ 26%] Building CXX object _deps/re2-build/CMakeFiles/re2.dir/re2/bitmap256.cc.o744[ 26%] Building CXX object _deps/re2-build/CMakeFiles/re2.dir/re2/bitstate.cc.o745[ 26%] Building CXX object _deps/re2-build/CMakeFiles/re2.dir/re2/dfa.cc.o746[ 26%] Building CXX object _deps/re2-build/CMakeFiles/re2.dir/re2/filtered_re2.cc.o747[ 26%] Building CXX object _deps/re2-build/CMakeFiles/re2.dir/re2/nfa.cc.o748[ 26%] Building CXX object _deps/abseil_cpp-build/absl/flags/CMakeFiles/flags_usage_internal.dir/internal/usage.cc.o749[ 26%] Building CXX object _deps/re2-build/CMakeFiles/re2.dir/re2/compile.cc.o750[ 26%] Building CXX object _deps/re2-build/CMakeFiles/re2.dir/re2/parse.cc.o751[ 26%] Building CXX object _deps/re2-build/CMakeFiles/re2.dir/re2/mimics_pcre.cc.o752[ 26%] Building CXX object _deps/re2-build/CMakeFiles/re2.dir/re2/prefilter_tree.cc.o753[ 26%] Building CXX object _deps/re2-build/CMakeFiles/re2.dir/re2/re2.cc.o754[ 26%] Building CXX object _deps/re2-build/CMakeFiles/re2.dir/re2/onepass.cc.o755[ 26%] Building CXX object _deps/re2-build/CMakeFiles/re2.dir/re2/perl_groups.cc.o756[ 27%] Building CXX object _deps/re2-build/CMakeFiles/re2.dir/re2/prefilter.cc.o757[ 27%] Building CXX object _deps/re2-build/CMakeFiles/re2.dir/re2/regexp.cc.o758[ 27%] Building CXX object _deps/re2-build/CMakeFiles/re2.dir/re2/prog.cc.o759[ 27%] Building CXX object _deps/re2-build/CMakeFiles/re2.dir/re2/set.cc.o760[ 27%] Building CXX object _deps/re2-build/CMakeFiles/re2.dir/re2/tostring.cc.o761[ 27%] Building CXX object _deps/re2-build/CMakeFiles/re2.dir/re2/unicode_casefold.cc.o762[ 27%] Building CXX object _deps/re2-build/CMakeFiles/re2.dir/re2/simplify.cc.o763[ 27%] Building CXX object _deps/re2-build/CMakeFiles/re2.dir/re2/unicode_groups.cc.o764[ 27%] Building CXX object _deps/re2-build/CMakeFiles/re2.dir/util/rune.cc.o765[ 27%] Building CXX object _deps/re2-build/CMakeFiles/re2.dir/util/strutil.cc.o766Processing /nix/store/54yzskzwmapls2awvih149wyzci717gw-onnx-src/onnx/onnx-operators.in.proto767Writing /build/source/build/_deps/onnx-build/onnx/onnx-operators-ml.proto768Writing /build/source/build/_deps/onnx-build/onnx/onnx-operators-ml.proto3769generating /build/source/build/_deps/onnx-build/onnx/onnx_operators_pb.py770Processing /nix/store/54yzskzwmapls2awvih149wyzci717gw-onnx-src/onnx/onnx-data.in.proto771Writing /build/source/build/_deps/onnx-build/onnx/onnx-data.proto772Writing /build/source/build/_deps/onnx-build/onnx/onnx-data.proto3773generating /build/source/build/_deps/onnx-build/onnx/onnx_data_pb.py774Processing /nix/store/54yzskzwmapls2awvih149wyzci717gw-onnx-src/onnx/onnx.in.proto775Writing /build/source/build/_deps/onnx-build/onnx/onnx-ml.proto776Writing /build/source/build/_deps/onnx-build/onnx/onnx-ml.proto3777generating /build/source/build/_deps/onnx-build/onnx/onnx_pb.py778[ 27%] Running C++ protocol buffer compiler on /build/source/build/_deps/onnx-build/onnx/onnx-data.proto779[ 27%] Running C++ protocol buffer compiler on /build/source/build/_deps/onnx-build/onnx/onnx-ml.proto780[ 27%] Running C++ protocol buffer compiler on /build/source/build/_deps/onnx-build/onnx/onnx-operators-ml.proto781[ 27%] Building CXX object _deps/onnx-build/CMakeFiles/onnx_proto.dir/onnx/onnx-ml.pb.cc.o782[ 27%] Building CXX object _deps/onnx-build/CMakeFiles/onnx_proto.dir/onnx/onnx-data.pb.cc.o783[ 27%] Building CXX object _deps/onnx-build/CMakeFiles/onnx_proto.dir/onnx/onnx-operators-ml.pb.cc.o784/nix/store/py2j3i67pywazyqfaya1m0wg9qbv3k3m-source/re2/regexp.cc: In member function 'int re2::Regexp::Ref()':785/nix/store/py2j3i67pywazyqfaya1m0wg9qbv3k3m-source/re2/regexp.cc:98:32: warning: 'absl::lts_20260817::MutexLock::MutexLock(absl::lts_20260817::Mutex*)' is deprecated: Use the constructor that takes a reference instead [-Wdeprecated-declarations]786 98 | absl::MutexLock l(ref_mutex());787 | ^788In file included from /nix/store/xfqnd1mhbii0bard2zmxx9pvfjizxhcr-source/absl/strings/internal/cordz_info.h:31,789 from /nix/store/xfqnd1mhbii0bard2zmxx9pvfjizxhcr-source/absl/strings/cord.h:94,790 from /nix/store/xfqnd1mhbii0bard2zmxx9pvfjizxhcr-source/absl/container/internal/hash_function_defaults.h:59,791 from /nix/store/xfqnd1mhbii0bard2zmxx9pvfjizxhcr-source/absl/container/hash_container_defaults.h:19,792 from /nix/store/xfqnd1mhbii0bard2zmxx9pvfjizxhcr-source/absl/container/flat_hash_map.h:43,793 from /nix/store/py2j3i67pywazyqfaya1m0wg9qbv3k3m-source/re2/regexp.cc:21:794/nix/store/xfqnd1mhbii0bard2zmxx9pvfjizxhcr-source/absl/synchronization/mutex.h:635:12: note: declared here795 635 | explicit MutexLock(Mutex* absl_nonnull mu) ABSL_EXCLUSIVE_LOCK_FUNCTION(mu)796 | ^~~~~~~~~797/nix/store/py2j3i67pywazyqfaya1m0wg9qbv3k3m-source/re2/regexp.cc: In member function 're2::Regexp* re2::Regexp::Incref()':798/nix/store/py2j3i67pywazyqfaya1m0wg9qbv3k3m-source/re2/regexp.cc:111:34: warning: 'absl::lts_20260817::MutexLock::MutexLock(absl::lts_20260817::Mutex*)' is deprecated: Use the constructor that takes a reference instead [-Wdeprecated-declarations]799 111 | absl::MutexLock l(ref_mutex());800 | ^801/nix/store/xfqnd1mhbii0bard2zmxx9pvfjizxhcr-source/absl/synchronization/mutex.h:635:12: note: declared here802 635 | explicit MutexLock(Mutex* absl_nonnull mu) ABSL_EXCLUSIVE_LOCK_FUNCTION(mu)803 | ^~~~~~~~~804/nix/store/py2j3i67pywazyqfaya1m0wg9qbv3k3m-source/re2/regexp.cc: In member function 'void re2::Regexp::Decref()':805/nix/store/py2j3i67pywazyqfaya1m0wg9qbv3k3m-source/re2/regexp.cc:131:34: warning: 'absl::lts_20260817::MutexLock::MutexLock(absl::lts_20260817::Mutex*)' is deprecated: Use the constructor that takes a reference instead [-Wdeprecated-declarations]806 131 | absl::MutexLock l(ref_mutex());807 | ^808/nix/store/xfqnd1mhbii0bard2zmxx9pvfjizxhcr-source/absl/synchronization/mutex.h:635:12: note: declared here809 635 | explicit MutexLock(Mutex* absl_nonnull mu) ABSL_EXCLUSIVE_LOCK_FUNCTION(mu)810 | ^~~~~~~~~811/nix/store/py2j3i67pywazyqfaya1m0wg9qbv3k3m-source/re2/dfa.cc: In member function 're2::DFA::State* re2::DFA::RunStateOnByteUnlocked(State*, int)':812/nix/store/py2j3i67pywazyqfaya1m0wg9qbv3k3m-source/re2/dfa.cc:1018:28: warning: 'absl::lts_20260817::MutexLock::MutexLock(absl::lts_20260817::Mutex*)' is deprecated: Use the constructor that takes a reference instead [-Wdeprecated-declarations]813 1018 | absl::MutexLock l(&mutex_);814 | ^815In file included from /nix/store/xfqnd1mhbii0bard2zmxx9pvfjizxhcr-source/absl/strings/internal/cordz_info.h:31,816 from /nix/store/xfqnd1mhbii0bard2zmxx9pvfjizxhcr-source/absl/strings/cord.h:94,817 from /nix/store/xfqnd1mhbii0bard2zmxx9pvfjizxhcr-source/absl/container/internal/hash_function_defaults.h:59,818 from /nix/store/xfqnd1mhbii0bard2zmxx9pvfjizxhcr-source/absl/container/hash_container_defaults.h:19,819 from /nix/store/xfqnd1mhbii0bard2zmxx9pvfjizxhcr-source/absl/container/flat_hash_map.h:43,820 from /nix/store/py2j3i67pywazyqfaya1m0wg9qbv3k3m-source/re2/dfa.cc:39:821/nix/store/xfqnd1mhbii0bard2zmxx9pvfjizxhcr-source/absl/synchronization/mutex.h:635:12: note: declared here822 635 | explicit MutexLock(Mutex* absl_nonnull mu) ABSL_EXCLUSIVE_LOCK_FUNCTION(mu)823 | ^~~~~~~~~824/nix/store/py2j3i67pywazyqfaya1m0wg9qbv3k3m-source/re2/dfa.cc: In constructor 're2::DFA::RWLocker::RWLocker(re2::DFA::CacheMutex*)':825/nix/store/py2j3i67pywazyqfaya1m0wg9qbv3k3m-source/re2/dfa.cc:1155:18: warning: 'void absl::lts_20260817::Mutex::ReaderLock()' is deprecated [-Wdeprecated-declarations]826 1155 | mu_->ReaderLock();827 | ~~~~~~~~~~~~~~~^~828/nix/store/xfqnd1mhbii0bard2zmxx9pvfjizxhcr-source/absl/synchronization/mutex.h:269:8: note: declared here829 269 | void ReaderLock() ABSL_SHARED_LOCK_FUNCTION() { lock_shared(); }830 | ^~~~~~~~~~831/nix/store/py2j3i67pywazyqfaya1m0wg9qbv3k3m-source/re2/dfa.cc: In member function 'void re2::DFA::RWLocker::LockForWriting()':832/nix/store/py2j3i67pywazyqfaya1m0wg9qbv3k3m-source/re2/dfa.cc:1162:22: warning: 'void absl::lts_20260817::Mutex::ReaderUnlock()' is deprecated [-Wdeprecated-declarations]833 1162 | mu_->ReaderUnlock();834 | ~~~~~~~~~~~~~~~~~^~835/nix/store/xfqnd1mhbii0bard2zmxx9pvfjizxhcr-source/absl/synchronization/mutex.h:279:8: note: declared here836 279 | void ReaderUnlock() ABSL_UNLOCK_FUNCTION() { unlock_shared(); }837 | ^~~~~~~~~~~~838/nix/store/py2j3i67pywazyqfaya1m0wg9qbv3k3m-source/re2/dfa.cc:1163:20: warning: 'void absl::lts_20260817::Mutex::WriterLock()' is deprecated [-Wdeprecated-declarations]839 1163 | mu_->WriterLock();840 | ~~~~~~~~~~~~~~~^~841/nix/store/xfqnd1mhbii0bard2zmxx9pvfjizxhcr-source/absl/synchronization/mutex.h:314:8: note: declared here842 314 | void WriterLock() ABSL_EXCLUSIVE_LOCK_FUNCTION() { lock(); }843 | ^~~~~~~~~~844/nix/store/py2j3i67pywazyqfaya1m0wg9qbv3k3m-source/re2/dfa.cc: In destructor 're2::DFA::RWLocker::~RWLocker()':845/nix/store/py2j3i67pywazyqfaya1m0wg9qbv3k3m-source/re2/dfa.cc:1170:22: warning: 'void absl::lts_20260817::Mutex::ReaderUnlock()' is deprecated [-Wdeprecated-declarations]846 1170 | mu_->ReaderUnlock();847 | ~~~~~~~~~~~~~~~~~^~848/nix/store/xfqnd1mhbii0bard2zmxx9pvfjizxhcr-source/absl/synchronization/mutex.h:279:8: note: declared here849 279 | void ReaderUnlock() ABSL_UNLOCK_FUNCTION() { unlock_shared(); }850 | ^~~~~~~~~~~~851/nix/store/py2j3i67pywazyqfaya1m0wg9qbv3k3m-source/re2/dfa.cc:1172:22: warning: 'void absl::lts_20260817::Mutex::WriterUnlock()' is deprecated [-Wdeprecated-declarations]852 1172 | mu_->WriterUnlock();853 | ~~~~~~~~~~~~~~~~~^~854/nix/store/xfqnd1mhbii0bard2zmxx9pvfjizxhcr-source/absl/synchronization/mutex.h:317:8: note: declared here855 317 | void WriterUnlock() ABSL_UNLOCK_FUNCTION() { unlock(); }856 | ^~~~~~~~~~~~857/nix/store/py2j3i67pywazyqfaya1m0wg9qbv3k3m-source/re2/dfa.cc: In member function 're2::DFA::State* re2::DFA::StateSaver::Restore()':858/nix/store/py2j3i67pywazyqfaya1m0wg9qbv3k3m-source/re2/dfa.cc:1270:34: warning: 'absl::lts_20260817::MutexLock::MutexLock(absl::lts_20260817::Mutex*)' is deprecated: Use the constructor that takes a reference instead [-Wdeprecated-declarations]859 1270 | absl::MutexLock l(&dfa_->mutex_);860 | ^861/nix/store/xfqnd1mhbii0bard2zmxx9pvfjizxhcr-source/absl/synchronization/mutex.h:635:12: note: declared here862 635 | explicit MutexLock(Mutex* absl_nonnull mu) ABSL_EXCLUSIVE_LOCK_FUNCTION(mu)863 | ^~~~~~~~~864/nix/store/py2j3i67pywazyqfaya1m0wg9qbv3k3m-source/re2/dfa.cc: In member function 'bool re2::DFA::AnalyzeSearchHelper(SearchParams*, StartInfo*, uint32_t)':865/nix/store/py2j3i67pywazyqfaya1m0wg9qbv3k3m-source/re2/dfa.cc:1733:28: warning: 'absl::lts_20260817::MutexLock::MutexLock(absl::lts_20260817::Mutex*)' is deprecated: Use the constructor that takes a reference instead [-Wdeprecated-declarations]866 1733 | absl::MutexLock l(&mutex_);867 | ^868/nix/store/xfqnd1mhbii0bard2zmxx9pvfjizxhcr-source/absl/synchronization/mutex.h:635:12: note: declared here869 635 | explicit MutexLock(Mutex* absl_nonnull mu) ABSL_EXCLUSIVE_LOCK_FUNCTION(mu)870 | ^~~~~~~~~871/nix/store/py2j3i67pywazyqfaya1m0wg9qbv3k3m-source/re2/dfa.cc: In member function 'bool re2::DFA::PossibleMatchRange(std::string*, std::string*, int)':872/nix/store/py2j3i67pywazyqfaya1m0wg9qbv3k3m-source/re2/dfa.cc:2053:31: warning: 'absl::lts_20260817::MutexLock::MutexLock(absl::lts_20260817::Mutex*)' is deprecated: Use the constructor that takes a reference instead [-Wdeprecated-declarations]873 2053 | absl::MutexLock lock(&mutex_);874 | ^875/nix/store/xfqnd1mhbii0bard2zmxx9pvfjizxhcr-source/absl/synchronization/mutex.h:635:12: note: declared here876 635 | explicit MutexLock(Mutex* absl_nonnull mu) ABSL_EXCLUSIVE_LOCK_FUNCTION(mu)877 | ^~~~~~~~~878[ 27%] Linking CXX static library libabsl_flags_usage_internal.a879[ 27%] Built target flags_usage_internal880[ 27%] Building CXX object _deps/abseil_cpp-build/absl/flags/CMakeFiles/flags_usage.dir/usage.cc.o881[ 27%] Linking CXX static library libre2.a882[ 27%] Built target re2883[ 27%] Linking CXX static library libabsl_flags_usage.a884[ 27%] Built target flags_usage885[ 28%] Building CXX object _deps/abseil_cpp-build/absl/flags/CMakeFiles/flags_parse.dir/parse.cc.o886[ 28%] Linking CXX static library libonnx_proto.a887[ 28%] Built target onnx_proto888[ 28%] Running cpp protocol buffer compiler (lite) on /build/source/onnxruntime/test/proto/tml.proto889[ 28%] Building CXX object CMakeFiles/onnxruntime_flatbuffers.dir/build/source/onnxruntime/core/flatbuffers/flatbuffers_utils.cc.o890[ 28%] Building CXX object CMakeFiles/onnxruntime_common.dir/build/source/onnxruntime/core/common/cpuid_info.cc.o891[ 28%] Building CXX object CMakeFiles/onnxruntime_common.dir/build/source/onnxruntime/core/common/cpuid_uarch.cc.o892[ 29%] Building CXX object CMakeFiles/onnxruntime_common.dir/build/source/onnxruntime/core/common/denormal.cc.o893[ 29%] Building CXX object CMakeFiles/onnxruntime_test_utils.dir/build/source/onnxruntime/test/util/compare_ortvalue.cc.o894[ 29%] Building CXX object CMakeFiles/onnxruntime_graph.dir/build/source/onnxruntime/core/graph/contrib_ops/bert_defs.cc.o895[ 29%] Building CXX object CMakeFiles/onnxruntime_lora.dir/build/source/onnxruntime/lora/adapter_format_utils.cc.o896[ 29%] Building CXX object CMakeFiles/onnxruntime_test_utils.dir/build/source/onnxruntime/test/util/default_providers.cc.o897[ 30%] Building CXX object CMakeFiles/onnxruntime_util.dir/build/source/onnxruntime/core/util/math_cpu.cc.o898[ 30%] Building CXX object CMakeFiles/onnxruntime_providers_openvino.dir/build/source/onnxruntime/core/providers/openvino/backend_manager.cc.o899[ 30%] Building CXX object CMakeFiles/onnxruntime_test_utils.dir/build/source/onnxruntime/test/util/file_util.cc.o900[ 30%] Building CXX object CMakeFiles/onnxruntime_graph.dir/build/source/onnxruntime/core/graph/contrib_ops/collective_defs.cc.o901[ 30%] Building CXX object CMakeFiles/onnxruntime_common.dir/build/source/onnxruntime/core/common/logging/logging.cc.o902[ 30%] Building CXX object CMakeFiles/onnxruntime_common.dir/build/source/onnxruntime/core/common/cpuid_info_vendor.cc.o903[ 30%] Building CXX object _deps/onnx-build/CMakeFiles/onnx.dir/onnx/checker.cc.o904[ 30%] Building CXX object CMakeFiles/onnxruntime_common.dir/build/source/onnxruntime/core/common/helper.cc.o905[ 30%] Building CXX object CMakeFiles/onnxruntime_framework.dir/build/source/onnxruntime/core/framework/allocation_planner.cc.o906[ 30%] Building CXX object CMakeFiles/onnxruntime_util.dir/build/source/onnxruntime/core/util/thread_utils.cc.o907[ 30%] Building CXX object CMakeFiles/onnxruntime_graph.dir/build/source/onnxruntime/core/graph/contrib_ops/attn_lstm_schema_defs.cc.o908[ 30%] Building CXX object CMakeFiles/onnxruntime_graph.dir/build/source/onnxruntime/core/graph/contrib_ops/contrib_defs.cc.o909[ 30%] Building CXX object CMakeFiles/onnxruntime_optimizer.dir/build/source/onnxruntime/core/optimizer/attention_fusion.cc.o910[ 30%] Building CXX object CMakeFiles/onnxruntime_common.dir/build/source/onnxruntime/core/common/logging/capture.cc.o911[ 30%] Building CXX object CMakeFiles/onnx_test_data_proto.dir/tml.pb.cc.o912[ 30%] Building CXX object CMakeFiles/onnxruntime_optimizer.dir/build/source/onnxruntime/core/optimizer/bias_dropout_fusion.cc.o913[ 31%] Building CXX object _deps/onnx-build/CMakeFiles/onnx.dir/onnx/common/assertions.cc.o914[ 31%] Building CXX object _deps/onnx-build/CMakeFiles/onnx.dir/onnx/common/interned_strings.cc.o915[ 31%] Linking CXX static library libabsl_flags_parse.a916[ 31%] Built target flags_parse917[ 31%] Building CXX object _deps/onnx-build/CMakeFiles/onnx.dir/onnx/common/ir_pb_converter.cc.o918[ 31%] Building CXX object CMakeFiles/onnxruntime_common.dir/build/source/onnxruntime/core/common/logging/sinks/ostream_sink.cc.o919[ 31%] Building CXX object _deps/onnx-build/CMakeFiles/onnx.dir/onnx/common/model_helpers.cc.o920[ 31%] Building CXX object CMakeFiles/onnxruntime_test_utils.dir/build/source/onnxruntime/test/util/scoped_env_vars.cc.o921[ 31%] Building CXX object CMakeFiles/onnxruntime_optimizer.dir/build/source/onnxruntime/core/optimizer/bias_gelu_fusion.cc.o922[ 31%] Building CXX object _deps/onnx-build/CMakeFiles/onnx.dir/onnx/common/status.cc.o923/build/source/onnxruntime/core/graph/contrib_ops/bert_defs.cc: In function 'void onnxruntime::contrib::PagedAttentionTypeAndShapeInference(onnx::InferenceContext&)':924/build/source/onnxruntime/core/graph/contrib_ops/bert_defs.cc:1410:40: warning: unused variable 'output_shape' [-Wunused-variable]925 1410 | ONNX_NAMESPACE::TensorShapeProto output_shape;926 | ^~~~~~~~~~~~927/build/source/onnxruntime/core/flatbuffers/flatbuffers_utils.cc: In function 'onnxruntime::common::Status onnxruntime::fbs::utils::LoadTensorShapeOrtFormat(const onnxruntime::fbs::Shape&, onnx::TensorShapeProto&)':928/build/source/onnxruntime/core/flatbuffers/flatbuffers_utils.cc:203:34: warning: unused variable 'dim' [-Wunused-variable]929 203 | TensorShapeProto_Dimension dim;930 | ^~~931[ 31%] Building CXX object CMakeFiles/onnxruntime_framework.dir/build/source/onnxruntime/core/framework/allocator.cc.o932[ 31%] Building CXX object CMakeFiles/onnxruntime_framework.dir/build/source/onnxruntime/core/framework/allocator_utils.cc.o933[ 31%] Building CXX object CMakeFiles/onnxruntime_framework.dir/build/source/onnxruntime/core/framework/bfc_arena.cc.o934[ 31%] Building CXX object CMakeFiles/onnxruntime_test_utils.dir/build/source/onnxruntime/test/util/temp_dir.cc.o935[ 31%] Building CXX object CMakeFiles/onnxruntime_common.dir/build/source/onnxruntime/core/common/profiler.cc.o936[ 31%] Building CXX object CMakeFiles/onnxruntime_graph.dir/build/source/onnxruntime/core/graph/contrib_ops/diffusion_defs.cc.o937[ 31%] Building CXX object CMakeFiles/onnxruntime_test_utils.dir/build/source/onnxruntime/test/util/tensors_from_file.cc.o938[ 31%] Linking CXX static library libonnx_test_data_proto.a939[ 31%] Built target onnx_test_data_proto940[ 32%] Building CXX object CMakeFiles/onnxruntime_test_utils.dir/build/source/onnxruntime/test/util/test_allocator.cc.o941[ 32%] Building CXX object CMakeFiles/onnx_test_runner_common.dir/build/source/onnxruntime/test/onnx/TestCase.cc.o942[ 32%] Building CXX object CMakeFiles/onnx_test_runner_common.dir/build/source/onnxruntime/test/onnx/TestCaseResult.cc.o943[ 32%] Linking CXX static library libonnxruntime_flatbuffers.a944[ 32%] Built target onnxruntime_flatbuffers945[ 32%] Building CXX object _deps/onnx-build/CMakeFiles/onnx.dir/onnx/defs/attr_proto_util.cc.o946[ 32%] Linking CXX static library libonnxruntime_lora.a947[ 32%] Built target onnxruntime_lora948[ 32%] Building CXX object _deps/onnx-build/CMakeFiles/onnx.dir/onnx/defs/controlflow/defs.cc.o949[ 32%] Building CXX object CMakeFiles/onnxruntime_session.dir/build/source/onnxruntime/core/session/IOBinding.cc.o950[ 32%] Building CXX object CMakeFiles/onnxruntime_session.dir/build/source/onnxruntime/core/session/abi_ep_types.cc.o951[ 32%] Building CXX object CMakeFiles/onnxruntime_optimizer.dir/build/source/onnxruntime/core/optimizer/bias_skip_layer_norm_fusion.cc.o952[ 32%] Building CXX object CMakeFiles/onnxruntime_graph.dir/build/source/onnxruntime/core/graph/contrib_ops/internal_nhwc_onnx_schemas.cc.o953[ 33%] Building CXX object CMakeFiles/onnxruntime_common.dir/build/source/onnxruntime/core/common/profiler_common.cc.o954[ 33%] Building CXX object _deps/onnx-build/CMakeFiles/onnx.dir/onnx/defs/controlflow/old.cc.o955[ 33%] Building CXX object CMakeFiles/onnxruntime_framework.dir/build/source/onnxruntime/core/framework/callback.cc.o956[ 33%] Building CXX object CMakeFiles/onnx_test_runner_common.dir/build/source/onnxruntime/test/onnx/TestResultStat.cc.o957[ 33%] Building CXX object CMakeFiles/onnx_test_runner_common.dir/build/source/onnxruntime/test/onnx/callback.cc.o958[ 33%] Building CXX object CMakeFiles/onnxruntime_optimizer.dir/build/source/onnxruntime/core/optimizer/bias_softmax_fusion.cc.o959[ 33%] Building CXX object CMakeFiles/onnxruntime_optimizer.dir/build/source/onnxruntime/core/optimizer/cast_chain_elimination.cc.o960[ 33%] Building CXX object CMakeFiles/onnxruntime_optimizer.dir/build/source/onnxruntime/core/optimizer/cast_elimination.cc.o961[ 33%] Building CXX object CMakeFiles/onnxruntime_optimizer.dir/build/source/onnxruntime/core/optimizer/common_subexpression_elimination.cc.o962[ 33%] Building CXX object _deps/onnx-build/CMakeFiles/onnx.dir/onnx/defs/controlflow/utils.cc.o963[ 33%] Building CXX object _deps/onnx-build/CMakeFiles/onnx.dir/onnx/defs/data_type_utils.cc.o964[ 33%] Building CXX object _deps/onnx-build/CMakeFiles/onnx.dir/onnx/defs/doc_strings.cc.o965[ 33%] Building CXX object CMakeFiles/onnxruntime_optimizer.dir/build/source/onnxruntime/core/optimizer/compute_optimizer/shared_utils.cc.o966[ 33%] Building CXX object _deps/onnx-build/CMakeFiles/onnx.dir/onnx/defs/function.cc.o967[ 33%] Building CXX object _deps/onnx-build/CMakeFiles/onnx.dir/onnx/defs/generator/defs.cc.o968[ 33%] Building CXX object _deps/onnx-build/CMakeFiles/onnx.dir/onnx/defs/generator/old.cc.o969[ 33%] Building CXX object CMakeFiles/onnxruntime_graph.dir/build/source/onnxruntime/core/graph/contrib_ops/nchwc_schema_defs.cc.o970[ 33%] Building CXX object CMakeFiles/onnxruntime_common.dir/build/source/onnxruntime/core/common/semver.cc.o971[ 33%] Building CXX object CMakeFiles/onnxruntime_graph.dir/build/source/onnxruntime/core/graph/contrib_ops/nhwc_schema_defs.cc.o972[ 33%] Building CXX object CMakeFiles/onnxruntime_graph.dir/build/source/onnxruntime/core/graph/contrib_ops/onnx_deprecated_operators.cc.o973[ 33%] Building CXX object CMakeFiles/onnxruntime_test_utils.dir/build/source/onnxruntime/test/util/test_environment.cc.o974[ 33%] Building CXX object _deps/onnx-build/CMakeFiles/onnx.dir/onnx/defs/generator/utils.cc.o975[ 33%] Building CXX object CMakeFiles/onnxruntime_providers_openvino.dir/build/source/onnxruntime/core/providers/openvino/backend_utils.cc.o976[ 33%] Building CXX object CMakeFiles/onnxruntime_graph.dir/build/source/onnxruntime/core/graph/contrib_ops/onnx_function_util.cc.o977[ 34%] Building CXX object CMakeFiles/onnxruntime_framework.dir/build/source/onnxruntime/core/framework/config_options.cc.o978[ 34%] Building CXX object CMakeFiles/onnxruntime_common.dir/build/source/onnxruntime/core/common/spin_pause.cc.o979[ 34%] Building CXX object CMakeFiles/onnxruntime_graph.dir/build/source/onnxruntime/core/graph/contrib_ops/quantization_defs.cc.o980[ 34%] Building CXX object CMakeFiles/onnxruntime_graph.dir/build/source/onnxruntime/core/graph/contrib_ops/range_schema_defs.cc.o981[ 34%] Building CXX object CMakeFiles/onnxruntime_test_utils.dir/build/source/onnxruntime/test/util/test_random_seed.cc.o982[ 34%] Building CXX object CMakeFiles/onnxruntime_optimizer.dir/build/source/onnxruntime/core/optimizer/compute_optimizer/upstream_gather.cc.o983[ 34%] Building CXX object _deps/onnx-build/CMakeFiles/onnx.dir/onnx/defs/image/defs.cc.o984[ 35%] Building CXX object _deps/onnx-build/CMakeFiles/onnx.dir/onnx/defs/logical/defs.cc.o985[ 35%] Building CXX object CMakeFiles/onnx_test_runner_common.dir/build/source/onnxruntime/test/onnx/dataitem_request.cc.o986[ 36%] Building CXX object CMakeFiles/onnx_test_runner_common.dir/build/source/onnxruntime/test/onnx/heap_buffer.cc.o987[ 36%] Building CXX object CMakeFiles/onnxruntime_optimizer.dir/build/source/onnxruntime/core/optimizer/compute_optimizer/upstream_gather_actors.cc.o988[ 36%] Building CXX object _deps/onnx-build/CMakeFiles/onnx.dir/onnx/defs/logical/old.cc.o989[ 36%] Building CXX object CMakeFiles/onnxruntime_optimizer.dir/build/source/onnxruntime/core/optimizer/compute_optimizer/upstream_reshape.cc.o990[ 36%] Building CXX object CMakeFiles/onnxruntime_graph.dir/build/source/onnxruntime/core/graph/contrib_ops/shape_inference_functions.cc.o991[ 36%] Building CXX object _deps/onnx-build/CMakeFiles/onnx.dir/onnx/defs/math/defs.cc.o992[ 36%] Building CXX object CMakeFiles/onnxruntime_common.dir/build/source/onnxruntime/core/common/status.cc.o993[ 36%] Building CXX object CMakeFiles/onnxruntime_common.dir/build/source/onnxruntime/core/common/threadpool.cc.o994[ 36%] Building CXX object CMakeFiles/onnxruntime_common.dir/build/source/onnxruntime/core/platform/check_intel.cc.o995[ 36%] Building CXX object CMakeFiles/onnx_test_runner_common.dir/build/source/onnxruntime/test/onnx/onnx_model_info.cc.o996[ 36%] Building CXX object CMakeFiles/onnx_test_runner_common.dir/build/source/onnxruntime/test/onnx/pb_helper.cc.o997[ 36%] Building CXX object CMakeFiles/onnxruntime_session.dir/build/source/onnxruntime/core/session/abi_session_options.cc.o998[ 36%] Building CXX object CMakeFiles/onnx_test_runner_common.dir/build/source/onnxruntime/test/onnx/tensorprotoutils.cc.o999[ 36%] Building CXX object CMakeFiles/onnxruntime_session.dir/build/source/onnxruntime/core/session/allocator_adapters.cc.o1000[ 36%] Building CXX object CMakeFiles/onnxruntime_session.dir/build/source/onnxruntime/core/session/compile_api.cc.o1001[ 36%] Building CXX object CMakeFiles/onnxruntime_optimizer.dir/build/source/onnxruntime/core/optimizer/compute_optimizer/upstream_reshape_actors.cc.o1002[ 36%] Building CXX object CMakeFiles/onnxruntime_optimizer.dir/build/source/onnxruntime/core/optimizer/compute_optimizer/upstream_transformer_base.cc.o1003[ 36%] Building CXX object CMakeFiles/onnxruntime_optimizer.dir/build/source/onnxruntime/core/optimizer/concat_slice_elimination.cc.o1004[ 36%] Building CXX object CMakeFiles/onnxruntime_common.dir/build/source/onnxruntime/core/platform/device_discovery_common.cc.o1005[ 36%] Building CXX object CMakeFiles/onnxruntime_common.dir/build/source/onnxruntime/core/platform/env.cc.o1006[ 36%] Building CXX object _deps/onnx-build/CMakeFiles/onnx.dir/onnx/defs/math/old.cc.o1007[ 36%] Building CXX object _deps/onnx-build/CMakeFiles/onnx.dir/onnx/defs/math/utils.cc.o1008In file included from /nix/store/2rq4fv67zqcgx3rm8a3q5yq3g2z8hrcp-eigen-3.4.1/include/eigen3/unsupported/Eigen/CXX11/Tensor:63,1009 from /build/source/include/onnxruntime/core/common/eigen_common_wrapper.h:70,1010 from /build/source/onnxruntime/core/common/threadpool.cc:22:1011/nix/store/2rq4fv67zqcgx3rm8a3q5yq3g2z8hrcp-eigen-3.4.1/include/eigen3/unsupported/Eigen/CXX11/src/Tensor/TensorDeviceThreadPool.h: In lambda function:1012/nix/store/2rq4fv67zqcgx3rm8a3q5yq3g2z8hrcp-eigen-3.4.1/include/eigen3/unsupported/Eigen/CXX11/src/Tensor/TensorDeviceThreadPool.h:210:19: warning: implicit capture of 'this' via '[=]' is deprecated in C++20 [-Wdeprecated]1013 210 | handleRange = [=, &handleRange, &barrier, &f](Index firstIdx,1014 | ^1015/nix/store/2rq4fv67zqcgx3rm8a3q5yq3g2z8hrcp-eigen-3.4.1/include/eigen3/unsupported/Eigen/CXX11/src/Tensor/TensorDeviceThreadPool.h:210:19: note: add explicit 'this' or '*this' capture1016/nix/store/54yzskzwmapls2awvih149wyzci717gw-onnx-src/onnx/defs/logical/defs.cc: In function 'std::function<void(onnx::OpSchema&)> onnx::BinaryLogicDocGenerator(const char*)':1017/nix/store/54yzskzwmapls2awvih149wyzci717gw-onnx-src/onnx/defs/logical/defs.cc:32:68: warning: unused parameter 'name' [-Wunused-parameter]1018 32 | std::function<void(OpSchema&)> BinaryLogicDocGenerator(const char* name) {1019 | ~~~~~~~~~~~~^~~~1020In file included from /nix/store/2rq4fv67zqcgx3rm8a3q5yq3g2z8hrcp-eigen-3.4.1/include/eigen3/unsupported/Eigen/CXX11/Tensor:91:1021/nix/store/2rq4fv67zqcgx3rm8a3q5yq3g2z8hrcp-eigen-3.4.1/include/eigen3/unsupported/Eigen/CXX11/src/Tensor/TensorContractionThreadPool.h: In lambda function:1022/nix/store/2rq4fv67zqcgx3rm8a3q5yq3g2z8hrcp-eigen-3.4.1/include/eigen3/unsupported/Eigen/CXX11/src/Tensor/TensorContractionThreadPool.h:1009:13: warning: implicit capture of 'this' via '[=]' is deprecated in C++20 [-Wdeprecated]1023 1009 | [=]() { kernel(m, n, k, use_thread_local); });1024 | ^1025/nix/store/2rq4fv67zqcgx3rm8a3q5yq3g2z8hrcp-eigen-3.4.1/include/eigen3/unsupported/Eigen/CXX11/src/Tensor/TensorContractionThreadPool.h:1009:13: note: add explicit 'this' or '*this' capture1026/nix/store/2rq4fv67zqcgx3rm8a3q5yq3g2z8hrcp-eigen-3.4.1/include/eigen3/unsupported/Eigen/CXX11/src/Tensor/TensorContractionThreadPool.h: In lambda function:1027/nix/store/2rq4fv67zqcgx3rm8a3q5yq3g2z8hrcp-eigen-3.4.1/include/eigen3/unsupported/Eigen/CXX11/src/Tensor/TensorContractionThreadPool.h:1063:15: warning: implicit capture of 'this' via '[=]' is deprecated in C++20 [-Wdeprecated]1028 1063 | [=]() { enqueue_packing_helper(mid, end, k, rhs); });1029 | ^1030/nix/store/2rq4fv67zqcgx3rm8a3q5yq3g2z8hrcp-eigen-3.4.1/include/eigen3/unsupported/Eigen/CXX11/src/Tensor/TensorContractionThreadPool.h:1063:15: note: add explicit 'this' or '*this' capture1031/nix/store/2rq4fv67zqcgx3rm8a3q5yq3g2z8hrcp-eigen-3.4.1/include/eigen3/unsupported/Eigen/CXX11/src/Tensor/TensorContractionThreadPool.h: In lambda function:1032/nix/store/2rq4fv67zqcgx3rm8a3q5yq3g2z8hrcp-eigen-3.4.1/include/eigen3/unsupported/Eigen/CXX11/src/Tensor/TensorContractionThreadPool.h:1082:15: warning: implicit capture of 'this' via '[=]' is deprecated in C++20 [-Wdeprecated]1033 1082 | [=]() { enqueue_packing_helper(start, end, k, rhs); });1034 | ^1035/nix/store/2rq4fv67zqcgx3rm8a3q5yq3g2z8hrcp-eigen-3.4.1/include/eigen3/unsupported/Eigen/CXX11/src/Tensor/TensorContractionThreadPool.h:1082:15: note: add explicit 'this' or '*this' capture1036/nix/store/54yzskzwmapls2awvih149wyzci717gw-onnx-src/onnx/defs/logical/defs.cc: In function 'std::function<void(onnx::OpSchema&)> onnx::BinaryBitwiseDocGenerator(const char*)':1037/nix/store/54yzskzwmapls2awvih149wyzci717gw-onnx-src/onnx/defs/logical/defs.cc:252:77: warning: unused parameter 'name' [-Wunused-parameter]1038 252 | static std::function<void(OpSchema&)> BinaryBitwiseDocGenerator(const char* name) {1039 | ~~~~~~~~~~~~^~~~1040/nix/store/54yzskzwmapls2awvih149wyzci717gw-onnx-src/onnx/defs/logical/old.cc: In function 'std::function<void(onnx::OpSchema&)> onnx::BinaryLogicDocGenerator_opset12(const char*)':1041/nix/store/54yzskzwmapls2awvih149wyzci717gw-onnx-src/onnx/defs/logical/old.cc:10:83: warning: unused parameter 'name' [-Wunused-parameter]1042 10 | static std::function<void(OpSchema&)> BinaryLogicDocGenerator_opset12(const char* name) {1043 | ~~~~~~~~~~~~^~~~1044/nix/store/54yzskzwmapls2awvih149wyzci717gw-onnx-src/onnx/defs/logical/old.cc: In function 'std::function<void(onnx::OpSchema&)> onnx::BinaryLogicDocGenerator_opset1(const char*)':1045/nix/store/54yzskzwmapls2awvih149wyzci717gw-onnx-src/onnx/defs/logical/old.cc:84:82: warning: unused parameter 'name' [-Wunused-parameter]1046 84 | static std::function<void(OpSchema&)> BinaryLogicDocGenerator_opset1(const char* name) {1047 | ~~~~~~~~~~~~^~~~1048/nix/store/54yzskzwmapls2awvih149wyzci717gw-onnx-src/onnx/defs/logical/old.cc: In function 'std::function<void(onnx::OpSchema&)> onnx::BinaryLogicDocGenerator_opset7(const char*)':1049/nix/store/54yzskzwmapls2awvih149wyzci717gw-onnx-src/onnx/defs/logical/old.cc:107:82: warning: unused parameter 'name' [-Wunused-parameter]1050 107 | static std::function<void(OpSchema&)> BinaryLogicDocGenerator_opset7(const char* name) {1051 | ~~~~~~~~~~~~^~~~1052[ 36%] Building CXX object CMakeFiles/onnxruntime_test_utils.dir/build/source/onnxruntime/test/util/test_utils.cc.o1053[ 36%] Building CXX object CMakeFiles/onnxruntime_framework.dir/build/source/onnxruntime/core/framework/copy.cc.o1054/nix/store/54yzskzwmapls2awvih149wyzci717gw-onnx-src/onnx/defs/math/defs.cc: In function 'std::function<void(onnx::OpSchema&)> onnx::SoftmaxFamilyDocGenerator(const char*, const char*, const char*)':1055/nix/store/54yzskzwmapls2awvih149wyzci717gw-onnx-src/onnx/defs/math/defs.cc:1005:57: warning: unused parameter 'description' [-Wunused-parameter]1056 1005 | SoftmaxFamilyDocGenerator(const char* name, const char* description, const char* equation) {1057 | ~~~~~~~~~~~~^~~~~~~~~~~1058/nix/store/54yzskzwmapls2awvih149wyzci717gw-onnx-src/onnx/defs/math/defs.cc:1005:82: warning: unused parameter 'equation' [-Wunused-parameter]1059 1005 | SoftmaxFamilyDocGenerator(const char* name, const char* description, const char* equation) {1060 | ~~~~~~~~~~~~^~~~~~~~1061[ 36%] Building CXX object CMakeFiles/onnxruntime_providers_openvino.dir/build/source/onnxruntime/core/providers/openvino/backends/backend_factory.cc.o1062[ 36%] Building CXX object CMakeFiles/onnx_test_runner_common.dir/build/source/onnxruntime/test/onnx/testcase_driver.cc.o1063[ 36%] Building CXX object CMakeFiles/onnxruntime_framework.dir/build/source/onnxruntime/core/framework/customregistry.cc.o1064[ 36%] Building CXX object CMakeFiles/onnxruntime_framework.dir/build/source/onnxruntime/core/framework/data_transfer.cc.o1065[ 36%] Building CXX object CMakeFiles/onnxruntime_graph.dir/build/source/onnxruntime/core/graph/data_propagation/add_op_data_propagation.cc.o1066[ 36%] Building CXX object CMakeFiles/onnxruntime_graph.dir/build/source/onnxruntime/core/graph/data_propagation/custom_data_propagation.cc.o1067[ 36%] Building CXX object CMakeFiles/onnxruntime_graph.dir/build/source/onnxruntime/core/graph/data_propagation/div_op_data_propagation.cc.o1068[ 36%] Building CXX object CMakeFiles/onnxruntime_graph.dir/build/source/onnxruntime/core/graph/data_propagation/gather_op_data_propagation.cc.o1069[ 36%] Building CXX object CMakeFiles/onnxruntime_common.dir/build/source/onnxruntime/core/platform/env_time.cc.o1070[ 36%] Building CXX object _deps/onnx-build/CMakeFiles/onnx.dir/onnx/defs/nn/defs.cc.o1071[ 36%] Building CXX object CMakeFiles/onnxruntime_common.dir/build/source/onnxruntime/core/platform/linux/device_discovery.cc.o1072[ 36%] Building CXX object _deps/onnx-build/CMakeFiles/onnx.dir/onnx/defs/nn/old.cc.o1073/nix/store/54yzskzwmapls2awvih149wyzci717gw-onnx-src/onnx/defs/math/old.cc: In function 'std::function<void(onnx::OpSchema&)> onnx::SoftmaxFamilyDocGenerator_opset_11(const char*, const char*)':1074/nix/store/54yzskzwmapls2awvih149wyzci717gw-onnx-src/onnx/defs/math/old.cc:922:104: warning: unused parameter 'description' [-Wunused-parameter]1075 922 | static std::function<void(OpSchema&)> SoftmaxFamilyDocGenerator_opset_11(const char* name, const char* description) {1076 | ~~~~~~~~~~~~^~~~~~~~~~~1077/nix/store/54yzskzwmapls2awvih149wyzci717gw-onnx-src/onnx/defs/math/old.cc: In function 'std::function<void(onnx::OpSchema&)> onnx::SoftmaxFamilyDocGenerator_opset1(const char*, const char*)':1078/nix/store/54yzskzwmapls2awvih149wyzci717gw-onnx-src/onnx/defs/math/old.cc:2275:84: warning: unused parameter 'name' [-Wunused-parameter]1079 2275 | static std::function<void(OpSchema&)> SoftmaxFamilyDocGenerator_opset1(const char* name, const char* description) {1080 | ~~~~~~~~~~~~^~~~1081/nix/store/54yzskzwmapls2awvih149wyzci717gw-onnx-src/onnx/defs/math/old.cc:2275:102: warning: unused parameter 'description' [-Wunused-parameter]1082 2275 | static std::function<void(OpSchema&)> SoftmaxFamilyDocGenerator_opset1(const char* name, const char* description) {1083 | ~~~~~~~~~~~~^~~~~~~~~~~1084/nix/store/54yzskzwmapls2awvih149wyzci717gw-onnx-src/onnx/defs/math/old.cc: In function 'std::function<void(onnx::OpSchema&)> onnx::MathDocGenerator_old(const char*)':1085/nix/store/54yzskzwmapls2awvih149wyzci717gw-onnx-src/onnx/defs/math/old.cc:2363:72: warning: unused parameter 'name' [-Wunused-parameter]1086 2363 | static std::function<void(OpSchema&)> MathDocGenerator_old(const char* name) {1087 | ~~~~~~~~~~~~^~~~1088[ 36%] Building CXX object CMakeFiles/onnxruntime_common.dir/build/source/onnxruntime/core/platform/logging/make_platform_default_log_sink.cc.o1089[ 36%] Building CXX object CMakeFiles/onnx_test_runner_common.dir/build/source/onnxruntime/test/onnx/testcase_request.cc.o1090[ 36%] Building CXX object CMakeFiles/onnx_test_runner_common.dir/build/source/onnxruntime/test/onnx/testenv.cc.o1091[ 36%] Building CXX object _deps/onnx-build/CMakeFiles/onnx.dir/onnx/defs/nn/utils.cc.o1092[ 36%] Building CXX object CMakeFiles/onnxruntime_common.dir/build/source/onnxruntime/core/platform/path_lib.cc.o1093/nix/store/54yzskzwmapls2awvih149wyzci717gw-onnx-src/onnx/defs/nn/defs.cc: In function 'std::function<void(onnx::OpSchema&)> onnx::PoolOpSchemaGenerator(const char*, const char*, const char*, bool, bool)':1094/nix/store/54yzskzwmapls2awvih149wyzci717gw-onnx-src/onnx/defs/nn/defs.cc:206:17: warning: unused parameter 'name' [-Wunused-parameter]1095 206 | const char* name,1096 | ~~~~~~~~~~~~^~~~1097/nix/store/54yzskzwmapls2awvih149wyzci717gw-onnx-src/onnx/defs/nn/defs.cc:207:17: warning: unused parameter 'opName' [-Wunused-parameter]1098 207 | const char* opName,1099 | ~~~~~~~~~~~~^~~~~~1100/nix/store/54yzskzwmapls2awvih149wyzci717gw-onnx-src/onnx/defs/nn/defs.cc:208:17: warning: unused parameter 'additionalDescription' [-Wunused-parameter]1101 208 | const char* additionalDescription,1102 | ~~~~~~~~~~~~^~~~~~~~~~~~~~~~~~~~~1103/nix/store/54yzskzwmapls2awvih149wyzci717gw-onnx-src/onnx/defs/nn/defs.cc: In function 'std::function<void(onnx::OpSchema&)> onnx::LpPoolOpSchemaGenerator(const char*)':1104/nix/store/54yzskzwmapls2awvih149wyzci717gw-onnx-src/onnx/defs/nn/defs.cc:534:75: warning: unused parameter 'name' [-Wunused-parameter]1105 534 | static std::function<void(OpSchema&)> LpPoolOpSchemaGenerator(const char* name) {1106 | ~~~~~~~~~~~~^~~~1107/nix/store/54yzskzwmapls2awvih149wyzci717gw-onnx-src/onnx/defs/nn/defs.cc: In function 'std::function<void(onnx::OpSchema&)> onnx::RoiPoolOpSchemaGenerator(const char*)':1108/nix/store/54yzskzwmapls2awvih149wyzci717gw-onnx-src/onnx/defs/nn/defs.cc:661:76: warning: unused parameter 'name' [-Wunused-parameter]1109 661 | static std::function<void(OpSchema&)> RoiPoolOpSchemaGenerator(const char* name) {1110 | ~~~~~~~~~~~~^~~~1111/nix/store/54yzskzwmapls2awvih149wyzci717gw-onnx-src/onnx/defs/nn/defs.cc: In function 'std::function<void(onnx::OpSchema&)> onnx::ConvOpSchemaGenerator(const char*)':1112/nix/store/54yzskzwmapls2awvih149wyzci717gw-onnx-src/onnx/defs/nn/defs.cc:717:73: warning: unused parameter 'filter_desc' [-Wunused-parameter]1113 717 | static std::function<void(OpSchema&)> ConvOpSchemaGenerator(const char* filter_desc) {1114 | ~~~~~~~~~~~~^~~~~~~~~~~1115/nix/store/54yzskzwmapls2awvih149wyzci717gw-onnx-src/onnx/defs/nn/defs.cc: In function 'std::function<void(onnx::OpSchema&)> onnx::ConvTransposeOpSchemaGenerator(const char*)':1116/nix/store/54yzskzwmapls2awvih149wyzci717gw-onnx-src/onnx/defs/nn/defs.cc:1232:82: warning: unused parameter 'filter_desc' [-Wunused-parameter]1117 1232 | static std::function<void(OpSchema&)> ConvTransposeOpSchemaGenerator(const char* filter_desc) {1118 | ~~~~~~~~~~~~^~~~~~~~~~~1119/nix/store/54yzskzwmapls2awvih149wyzci717gw-onnx-src/onnx/defs/nn/defs.cc: In function 'std::function<void(onnx::OpSchema&)> onnx::GlobalPoolingOpSchemaGenerator(const char*, const char*)':1120/nix/store/54yzskzwmapls2awvih149wyzci717gw-onnx-src/onnx/defs/nn/defs.cc:1473:82: warning: unused parameter 'op_type' [-Wunused-parameter]1121 1473 | static std::function<void(OpSchema&)> GlobalPoolingOpSchemaGenerator(const char* op_type, const char* op) {1122 | ~~~~~~~~~~~~^~~~~~~1123/nix/store/54yzskzwmapls2awvih149wyzci717gw-onnx-src/onnx/defs/nn/defs.cc:1473:103: warning: unused parameter 'op' [-Wunused-parameter]1124 1473 | static std::function<void(OpSchema&)> GlobalPoolingOpSchemaGenerator(const char* op_type, const char* op) {1125 | ~~~~~~~~~~~~^~1126/nix/store/54yzskzwmapls2awvih149wyzci717gw-onnx-src/onnx/defs/nn/defs.cc: In function 'std::function<void(onnx::OpSchema&)> onnx::GlobalLpPoolingOpSchemaGenerator(const char*, const char*)':1127/nix/store/54yzskzwmapls2awvih149wyzci717gw-onnx-src/onnx/defs/nn/defs.cc:1521:84: warning: unused parameter 'op_type' [-Wunused-parameter]1128 1521 | static std::function<void(OpSchema&)> GlobalLpPoolingOpSchemaGenerator(const char* op_type, const char* op) {1129 | ~~~~~~~~~~~~^~~~~~~1130/nix/store/54yzskzwmapls2awvih149wyzci717gw-onnx-src/onnx/defs/nn/defs.cc:1521:105: warning: unused parameter 'op' [-Wunused-parameter]1131 1521 | static std::function<void(OpSchema&)> GlobalLpPoolingOpSchemaGenerator(const char* op_type, const char* op) {1132 | ~~~~~~~~~~~~^~1133[ 36%] Building CXX object CMakeFiles/onnx_test_runner_common.dir/build/source/onnxruntime/core/framework/endian_utils.cc.o1134[ 37%] Building CXX object CMakeFiles/onnxruntime_graph.dir/build/source/onnxruntime/core/graph/data_propagation/mul_op_data_propagation.cc.o1135/nix/store/54yzskzwmapls2awvih149wyzci717gw-onnx-src/onnx/defs/nn/old.cc: In function 'std::function<void(onnx::OpSchema&)> onnx::GlobalLpPoolingOpSchemaGenerator_opset2(const char*, const char*)':1136/nix/store/54yzskzwmapls2awvih149wyzci717gw-onnx-src/onnx/defs/nn/old.cc:44:91: warning: unused parameter 'op_type' [-Wunused-parameter]1137 44 | static std::function<void(OpSchema&)> GlobalLpPoolingOpSchemaGenerator_opset2(const char* op_type, const char* op) {1138 | ~~~~~~~~~~~~^~~~~~~1139/nix/store/54yzskzwmapls2awvih149wyzci717gw-onnx-src/onnx/defs/nn/old.cc:44:112: warning: unused parameter 'op' [-Wunused-parameter]1140 44 | static std::function<void(OpSchema&)> GlobalLpPoolingOpSchemaGenerator_opset2(const char* op_type, const char* op) {1141 | ~~~~~~~~~~~~^~1142/nix/store/54yzskzwmapls2awvih149wyzci717gw-onnx-src/onnx/defs/nn/old.cc: In function 'std::function<void(onnx::OpSchema&)> onnx::GlobalPoolingOpSchemaGenerator_opset1(const char*, const char*)':1143/nix/store/54yzskzwmapls2awvih149wyzci717gw-onnx-src/onnx/defs/nn/old.cc:550:89: warning: unused parameter 'op_type' [-Wunused-parameter]1144 550 | static std::function<void(OpSchema&)> GlobalPoolingOpSchemaGenerator_opset1(const char* op_type, const char* op) {1145 | ~~~~~~~~~~~~^~~~~~~1146/nix/store/54yzskzwmapls2awvih149wyzci717gw-onnx-src/onnx/defs/nn/old.cc:550:110: warning: unused parameter 'op' [-Wunused-parameter]1147 550 | static std::function<void(OpSchema&)> GlobalPoolingOpSchemaGenerator_opset1(const char* op_type, const char* op) {1148 | ~~~~~~~~~~~~^~1149/nix/store/54yzskzwmapls2awvih149wyzci717gw-onnx-src/onnx/defs/nn/old.cc: In function 'std::function<void(onnx::OpSchema&)> onnx::ConvTransposeOpSchemaGenerator_opset11(const char*)':1150/nix/store/54yzskzwmapls2awvih149wyzci717gw-onnx-src/onnx/defs/nn/old.cc:841:90: warning: unused parameter 'filter_desc' [-Wunused-parameter]1151 841 | static std::function<void(OpSchema&)> ConvTransposeOpSchemaGenerator_opset11(const char* filter_desc) {1152 | ~~~~~~~~~~~~^~~~~~~~~~~1153/nix/store/54yzskzwmapls2awvih149wyzci717gw-onnx-src/onnx/defs/nn/old.cc: In function 'std::function<void(onnx::OpSchema&)> onnx::ConvOpSchemaGenerator_opset11(const char*)':1154/nix/store/54yzskzwmapls2awvih149wyzci717gw-onnx-src/onnx/defs/nn/old.cc:966:81: warning: unused parameter 'filter_desc' [-Wunused-parameter]1155 966 | static std::function<void(OpSchema&)> ConvOpSchemaGenerator_opset11(const char* filter_desc) {1156 | ~~~~~~~~~~~~^~~~~~~~~~~1157/nix/store/54yzskzwmapls2awvih149wyzci717gw-onnx-src/onnx/defs/nn/old.cc: In function 'std::function<void(onnx::OpSchema&)> onnx::RoiPoolOpSchemaGenerator_opset1(const char*)':1158/nix/store/54yzskzwmapls2awvih149wyzci717gw-onnx-src/onnx/defs/nn/old.cc:1112:83: warning: unused parameter 'name' [-Wunused-parameter]1159 1112 | static std::function<void(OpSchema&)> RoiPoolOpSchemaGenerator_opset1(const char* name) {1160 | ~~~~~~~~~~~~^~~~1161/nix/store/54yzskzwmapls2awvih149wyzci717gw-onnx-src/onnx/defs/nn/old.cc: In function 'std::function<void(onnx::OpSchema&)> onnx::LpPoolOpSchemaGenerator_opset18(const char*)':1162/nix/store/54yzskzwmapls2awvih149wyzci717gw-onnx-src/onnx/defs/nn/old.cc:1171:83: warning: unused parameter 'name' [-Wunused-parameter]1163 1171 | static std::function<void(OpSchema&)> LpPoolOpSchemaGenerator_opset18(const char* name) {1164 | ~~~~~~~~~~~~^~~~1165/nix/store/54yzskzwmapls2awvih149wyzci717gw-onnx-src/onnx/defs/nn/old.cc: In function 'std::function<void(onnx::OpSchema&)> onnx::PoolOpSchemaGenerator_opset19(const char*, const char*, const char*, bool, bool)':1166/nix/store/54yzskzwmapls2awvih149wyzci717gw-onnx-src/onnx/defs/nn/old.cc:1344:17: warning: unused parameter 'name' [-Wunused-parameter]1167 1344 | const char* name,1168 | ~~~~~~~~~~~~^~~~1169/nix/store/54yzskzwmapls2awvih149wyzci717gw-onnx-src/onnx/defs/nn/old.cc:1345:17: warning: unused parameter 'opName' [-Wunused-parameter]1170 1345 | const char* opName,1171 | ~~~~~~~~~~~~^~~~~~1172/nix/store/54yzskzwmapls2awvih149wyzci717gw-onnx-src/onnx/defs/nn/old.cc:1346:17: warning: unused parameter 'additionalDescription' [-Wunused-parameter]1173 1346 | const char* additionalDescription,1174 | ~~~~~~~~~~~~^~~~~~~~~~~~~~~~~~~~~1175/nix/store/54yzskzwmapls2awvih149wyzci717gw-onnx-src/onnx/defs/nn/old.cc: In function 'std::function<void(onnx::OpSchema&)> onnx::PoolOpSchemaGenerator_9(const char*, const char*, const char*)':1176/nix/store/54yzskzwmapls2awvih149wyzci717gw-onnx-src/onnx/defs/nn/old.cc:2088:37: warning: unused parameter 'name' [-Wunused-parameter]1177 2088 | PoolOpSchemaGenerator_9(const char* name, const char* opName, const char* additionalDescription) {1178 | ~~~~~~~~~~~~^~~~1179/nix/store/54yzskzwmapls2awvih149wyzci717gw-onnx-src/onnx/defs/nn/old.cc:2088:55: warning: unused parameter 'opName' [-Wunused-parameter]1180 2088 | PoolOpSchemaGenerator_9(const char* name, const char* opName, const char* additionalDescription) {1181 | ~~~~~~~~~~~~^~~~~~1182/nix/store/54yzskzwmapls2awvih149wyzci717gw-onnx-src/onnx/defs/nn/old.cc:2088:75: warning: unused parameter 'additionalDescription' [-Wunused-parameter]1183 2088 | PoolOpSchemaGenerator_9(const char* name, const char* opName, const char* additionalDescription) {1184 | ~~~~~~~~~~~~^~~~~~~~~~~~~~~~~~~~~1185/nix/store/54yzskzwmapls2awvih149wyzci717gw-onnx-src/onnx/defs/nn/old.cc: In function 'std::function<void(onnx::OpSchema&)> onnx::PoolOpSchemaGenerator_10(const char*, const char*, const char*, bool, int)':1186/nix/store/54yzskzwmapls2awvih149wyzci717gw-onnx-src/onnx/defs/nn/old.cc:2166:17: warning: unused parameter 'name' [-Wunused-parameter]1187 2166 | const char* name,1188 | ~~~~~~~~~~~~^~~~1189/nix/store/54yzskzwmapls2awvih149wyzci717gw-onnx-src/onnx/defs/nn/old.cc:2167:17: warning: unused parameter 'opName' [-Wunused-parameter]1190 2167 | const char* opName,1191 | ~~~~~~~~~~~~^~~~~~1192/nix/store/54yzskzwmapls2awvih149wyzci717gw-onnx-src/onnx/defs/nn/old.cc:2168:17: warning: unused parameter 'additionalDescription' [-Wunused-parameter]1193 2168 | const char* additionalDescription,1194 | ~~~~~~~~~~~~^~~~~~~~~~~~~~~~~~~~~1195/nix/store/54yzskzwmapls2awvih149wyzci717gw-onnx-src/onnx/defs/nn/old.cc: In function 'std::function<void(onnx::OpSchema&)> onnx::PoolOpSchemaGenerator_11(const char*, const char*, const char*, bool, bool)':1196/nix/store/54yzskzwmapls2awvih149wyzci717gw-onnx-src/onnx/defs/nn/old.cc:2277:17: warning: unused parameter 'name' [-Wunused-parameter]1197 2277 | const char* name,1198 | ~~~~~~~~~~~~^~~~1199/nix/store/54yzskzwmapls2awvih149wyzci717gw-onnx-src/onnx/defs/nn/old.cc:2278:17: warning: unused parameter 'opName' [-Wunused-parameter]1200 2278 | const char* opName,1201 | ~~~~~~~~~~~~^~~~~~1202/nix/store/54yzskzwmapls2awvih149wyzci717gw-onnx-src/onnx/defs/nn/old.cc:2279:17: warning: unused parameter 'additionalDescription' [-Wunused-parameter]1203 2279 | const char* additionalDescription,1204 | ~~~~~~~~~~~~^~~~~~~~~~~~~~~~~~~~~1205/nix/store/54yzskzwmapls2awvih149wyzci717gw-onnx-src/onnx/defs/nn/old.cc: In function 'std::function<void(onnx::OpSchema&)> onnx::LpPoolOpSchemaGenerator_10(const char*)':1206/nix/store/54yzskzwmapls2awvih149wyzci717gw-onnx-src/onnx/defs/nn/old.cc:2741:78: warning: unused parameter 'name' [-Wunused-parameter]1207 2741 | static std::function<void(OpSchema&)> LpPoolOpSchemaGenerator_10(const char* name) {1208 | ~~~~~~~~~~~~^~~~1209/nix/store/54yzskzwmapls2awvih149wyzci717gw-onnx-src/onnx/defs/nn/old.cc: In function 'std::function<void(onnx::OpSchema&)> onnx::LpPoolOpSchemaGenerator_11(const char*)':1210/nix/store/54yzskzwmapls2awvih149wyzci717gw-onnx-src/onnx/defs/nn/old.cc:2796:78: warning: unused parameter 'name' [-Wunused-parameter]1211 2796 | static std::function<void(OpSchema&)> LpPoolOpSchemaGenerator_11(const char* name) {1212 | ~~~~~~~~~~~~^~~~1213/nix/store/54yzskzwmapls2awvih149wyzci717gw-onnx-src/onnx/defs/nn/old.cc: In function 'std::function<void(onnx::OpSchema&)> onnx::ConvOpSchemaGenerator_10(const char*)':1214/nix/store/54yzskzwmapls2awvih149wyzci717gw-onnx-src/onnx/defs/nn/old.cc:2858:76: warning: unused parameter 'filter_desc' [-Wunused-parameter]1215 2858 | static std::function<void(OpSchema&)> ConvOpSchemaGenerator_10(const char* filter_desc) {1216 | ~~~~~~~~~~~~^~~~~~~~~~~1217/nix/store/54yzskzwmapls2awvih149wyzci717gw-onnx-src/onnx/defs/nn/old.cc: In function 'std::function<void(onnx::OpSchema&)> onnx::ConvTransposeOpSchemaGenerator_10(const char*)':1218/nix/store/54yzskzwmapls2awvih149wyzci717gw-onnx-src/onnx/defs/nn/old.cc:3072:85: warning: unused parameter 'filter_desc' [-Wunused-parameter]1219 3072 | static std::function<void(OpSchema&)> ConvTransposeOpSchemaGenerator_10(const char* filter_desc) {1220 | ~~~~~~~~~~~~^~~~~~~~~~~1221[ 38%] Building CXX object CMakeFiles/onnxruntime_optimizer.dir/build/source/onnxruntime/core/optimizer/constant_folding.cc.o1222[ 38%] Building CXX object CMakeFiles/onnxruntime_optimizer.dir/build/source/onnxruntime/core/optimizer/constant_sharing.cc.o1223[ 38%] Building CXX object CMakeFiles/onnxruntime_optimizer.dir/build/source/onnxruntime/core/optimizer/conv_activation_fusion.cc.o1224[ 38%] Building CXX object CMakeFiles/onnxruntime_optimizer.dir/build/source/onnxruntime/core/optimizer/conv_add_act_fusion.cc.o1225[ 38%] Building CXX object CMakeFiles/onnxruntime_framework.dir/build/source/onnxruntime/core/framework/data_transfer_manager.cc.o1226[ 38%] Building CXX object CMakeFiles/onnxruntime_framework.dir/build/source/onnxruntime/core/framework/data_types.cc.o1227[ 38%] Building CXX object CMakeFiles/onnxruntime_session.dir/build/source/onnxruntime/core/session/custom_ops.cc.o1228[ 38%] Linking CXX static library libonnx_test_runner_common.a1229[ 38%] Built target onnx_test_runner_common1230[ 38%] Building CXX object _deps/onnx-build/CMakeFiles/onnx.dir/onnx/defs/object_detection/defs.cc.o1231[ 38%] Building CXX object CMakeFiles/onnxruntime_common.dir/build/source/onnxruntime/core/platform/posix/env.cc.o1232[ 38%] Building CXX object CMakeFiles/onnxruntime_graph.dir/build/source/onnxruntime/core/graph/data_propagation/size_op_data_propagation.cc.o1233[ 38%] Building CXX object CMakeFiles/onnxruntime_providers_openvino.dir/build/source/onnxruntime/core/providers/openvino/backends/basic_backend.cc.o1234[ 38%] Linking CXX static library libonnxruntime_util.a1235[ 38%] Building CXX object CMakeFiles/onnxruntime_common.dir/build/source/onnxruntime/core/platform/posix/env_time.cc.o1236[ 38%] Building CXX object CMakeFiles/onnxruntime_common.dir/build/source/onnxruntime/core/platform/posix/stacktrace.cc.o1237[ 38%] Building CXX object CMakeFiles/onnxruntime_common.dir/build/source/onnxruntime/core/platform/telemetry.cc.o1238[ 38%] Building CXX object CMakeFiles/onnxruntime_framework.dir/build/source/onnxruntime/core/framework/debug_node_inputs_outputs_utils.cc.o1239[ 38%] Building CXX object CMakeFiles/onnxruntime_graph.dir/build/source/onnxruntime/core/graph/data_propagation/squeeze_op_data_propagation.cc.o1240[ 38%] Built target onnxruntime_util1241[ 38%] Building CXX object CMakeFiles/onnxruntime_providers_openvino.dir/build/source/onnxruntime/core/providers/openvino/onnx_ctx_model_helper.cc.o1242[ 38%] Building CXX object CMakeFiles/onnxruntime_providers_openvino.dir/build/source/onnxruntime/core/providers/openvino/openvino_execution_provider.cc.o1243[ 38%] Building CXX object CMakeFiles/onnxruntime_graph.dir/build/source/onnxruntime/core/graph/data_propagation/sub_op_data_propagation.cc.o1244[ 38%] Building CXX object _deps/onnx-build/CMakeFiles/onnx.dir/onnx/defs/object_detection/old.cc.o1245[ 38%] Building CXX object _deps/onnx-build/CMakeFiles/onnx.dir/onnx/defs/optional/defs.cc.o1246[ 38%] Building CXX object CMakeFiles/onnxruntime_framework.dir/build/source/onnxruntime/core/framework/device_stream_collection.cc.o1247[ 38%] Building CXX object CMakeFiles/onnxruntime_framework.dir/build/source/onnxruntime/core/framework/empty.cc.o1248[ 38%] Building CXX object CMakeFiles/onnxruntime_optimizer.dir/build/source/onnxruntime/core/optimizer/conv_add_fusion.cc.o1249[ 38%] Building CXX object CMakeFiles/onnxruntime_framework.dir/build/source/onnxruntime/core/framework/endian_utils.cc.o1250[ 38%] Building CXX object _deps/onnx-build/CMakeFiles/onnx.dir/onnx/defs/optional/old.cc.o1251[ 38%] Building CXX object _deps/onnx-build/CMakeFiles/onnx.dir/onnx/defs/parser.cc.o1252[ 38%] Building CXX object _deps/onnx-build/CMakeFiles/onnx.dir/onnx/defs/printer.cc.o1253[ 38%] Building CXX object CMakeFiles/onnxruntime_optimizer.dir/build/source/onnxruntime/core/optimizer/conv_bn_fusion.cc.o1254[ 38%] Building CXX object CMakeFiles/onnxruntime_framework.dir/build/source/onnxruntime/core/framework/ep_context_options.cc.o1255[ 39%] Linking CXX static library libonnxruntime_common.a1256[ 39%] Built target onnxruntime_common1257[ 39%] Building CXX object CMakeFiles/onnxruntime_session.dir/build/source/onnxruntime/core/session/default_cpu_allocator_c_api.cc.o1258[ 39%] Building CXX object CMakeFiles/onnxruntime_mlas_q4dq.dir/build/source/onnxruntime/core/mlas/lib/q4_dq_cli.cpp.o1259/build/source/onnxruntime/core/providers/openvino/openvino_execution_provider.cc: In function 'std::vector<std::__cxx11::basic_string<char> > onnxruntime::openvino_ep::parseDevices(const std::string&, const std::vector<std::__cxx11::basic_string<char> >&)':1260/build/source/onnxruntime/core/providers/openvino/openvino_execution_provider.cc:46:12: warning: variable 'dev_options_update' set but not used [-Wunused-but-set-variable=]1261 46 | auto dev_options_update = dev_options.emplace(device);1262 | ^~~~~~~~~~~~~~~~~~1263[ 39%] Linking CXX static library libonnxruntime_test_utils.a1264[ 39%] Built target onnxruntime_test_utils1265[ 39%] Building CXX object CMakeFiles/onnxruntime_session.dir/build/source/onnxruntime/core/session/environment.cc.o1266[ 39%] Building CXX object CMakeFiles/onnxruntime_runtime_path_test_shared_library.dir/build/source/onnxruntime/test/shared_lib/runtime_path_test_shared_library/runtime_path_test_shared_library.cc.o1267[ 39%] Building CXX object CMakeFiles/onnxruntime_session.dir/build/source/onnxruntime/core/session/inference_session.cc.o1268[ 39%] Building CXX object CMakeFiles/onnxruntime_session.dir/build/source/onnxruntime/core/session/inference_session_utils.cc.o1269[ 39%] Linking CXX executable onnxruntime_mlas_q4dq1270[ 39%] Building CXX object CMakeFiles/onnxruntime_session.dir/build/source/onnxruntime/core/session/interop_api.cc.o1271[ 39%] Building CXX object CMakeFiles/onnxruntime_session.dir/build/source/onnxruntime/core/session/lora_adapters.cc.o1272[ 39%] Building CXX object CMakeFiles/onnxruntime_session.dir/build/source/onnxruntime/core/session/model_compilation_options.cc.o1273[ 39%] Building CXX object CMakeFiles/onnxruntime_session.dir/build/source/onnxruntime/core/session/model_editor_c_api.cc.o1274[ 39%] Building CXX object CMakeFiles/onnxruntime_session.dir/build/source/onnxruntime/core/session/model_package/model_package_context.cc.o1275[ 39%] Building CXX object CMakeFiles/onnxruntime_optimizer.dir/build/source/onnxruntime/core/optimizer/conv_mul_fusion.cc.o1276[ 39%] Building CXX object CMakeFiles/onnxruntime_optimizer.dir/build/source/onnxruntime/core/optimizer/div_mul_fusion.cc.o1277[ 39%] Building CXX object _deps/onnx-build/CMakeFiles/onnx.dir/onnx/defs/quantization/defs.cc.o1278[ 39%] Building CXX object _deps/onnx-build/CMakeFiles/onnx.dir/onnx/defs/quantization/old.cc.o1279[ 39%] Building CXX object CMakeFiles/onnxruntime_graph.dir/build/source/onnxruntime/core/graph/data_propagation/unsqueeze_op_data_propagation.cc.o1280/build/source/onnxruntime/core/providers/openvino/openvino_execution_provider.cc: At global scope:1281/build/source/onnxruntime/core/providers/openvino/openvino_execution_provider.cc:31:33: warning: 'std::vector<std::__cxx11::basic_string<char> > onnxruntime::openvino_ep::parseDevices(const std::string&, const std::vector<std::__cxx11::basic_string<char> >&)' defined but not used [-Wunused-function]1282 31 | static std::vector<std::string> parseDevices(const std::string& device_string,1283 | ^~~~~~~~~~~~1284[ 39%] Building CXX object CMakeFiles/onnxruntime_providers_openvino.dir/build/source/onnxruntime/core/providers/openvino/openvino_parser_utils.cc.o1285[ 39%] Building CXX object CMakeFiles/onnxruntime_providers_openvino.dir/build/source/onnxruntime/core/providers/openvino/openvino_provider_dllmain.cc.o1286[ 40%] Linking CXX shared library libonnxruntime_runtime_path_test_shared_library.so1287[ 40%] Building CXX object CMakeFiles/onnxruntime_optimizer.dir/build/source/onnxruntime/core/optimizer/double_qdq_pairs_remover.cc.o1288[ 40%] Building CXX object CMakeFiles/onnxruntime_providers_openvino.dir/build/source/onnxruntime/core/providers/openvino/openvino_provider_factory.cc.o1289[ 41%] Building CXX object CMakeFiles/onnxruntime_providers_openvino.dir/build/source/onnxruntime/core/providers/openvino/ov_allocator.cc.o1290[ 41%] Building CXX object CMakeFiles/onnxruntime_mlas_test.dir/build/source/onnxruntime/test/mlas/unittest/test_activation.cpp.o1291[ 42%] Building CXX object _deps/onnx-build/CMakeFiles/onnx.dir/onnx/defs/reduction/defs.cc.o1292[ 42%] Building CXX object _deps/onnx-build/CMakeFiles/onnx.dir/onnx/defs/reduction/old.cc.o1293[ 42%] Building CXX object CMakeFiles/onnxruntime_framework.dir/build/source/onnxruntime/core/framework/ep_context_utils.cc.o1294[ 42%] Building CXX object CMakeFiles/onnxruntime_mlas_test.dir/build/source/onnxruntime/test/mlas/unittest/test_blkq8.cpp.o1295[ 42%] Building CXX object CMakeFiles/onnxruntime_providers_openvino.dir/build/source/onnxruntime/core/providers/openvino/ov_bin_manager.cc.o1296[ 42%] Building CXX object _deps/onnx-build/CMakeFiles/onnx.dir/onnx/defs/reduction/utils.cc.o1297[ 42%] Building CXX object CMakeFiles/onnxruntime_providers_openvino.dir/build/source/onnxruntime/core/providers/openvino/ov_factory.cc.o1298[ 43%] Building CXX object CMakeFiles/onnxruntime_session.dir/build/source/onnxruntime/core/session/model_package/model_package_descriptor_parser.cc.o1299[ 43%] Building CXX object CMakeFiles/onnxruntime_session.dir/build/source/onnxruntime/core/session/onnxruntime_c_api.cc.o1300[ 43%] Building CXX object CMakeFiles/onnxruntime_optimizer.dir/build/source/onnxruntime/core/optimizer/dq_matmulnbits_fusion.cc.o1301[ 43%] Building CXX object CMakeFiles/onnxruntime_optimizer.dir/build/source/onnxruntime/core/optimizer/dropout_elimination.cc.o1302[ 43%] Building CXX object CMakeFiles/onnxruntime_graph.dir/build/source/onnxruntime/core/graph/ep_api_types.cc.o1303[ 43%] Building CXX object CMakeFiles/onnxruntime_graph.dir/build/source/onnxruntime/core/graph/function.cc.o1304/nix/store/54yzskzwmapls2awvih149wyzci717gw-onnx-src/onnx/defs/reduction/defs.cc: In function 'std::function<void(onnx::OpSchema&)> onnx::ArgReduceDocGenerator(const char*)':1305/nix/store/54yzskzwmapls2awvih149wyzci717gw-onnx-src/onnx/defs/reduction/defs.cc:95:73: warning: unused parameter 'name' [-Wunused-parameter]1306 95 | static std::function<void(OpSchema&)> ArgReduceDocGenerator(const char* name) {1307 | ~~~~~~~~~~~~^~~~1308/nix/store/54yzskzwmapls2awvih149wyzci717gw-onnx-src/onnx/defs/reduction/old.cc: In function 'std::function<void(onnx::OpSchema&)> onnx::ReduceDocGenerator_opset12(const char*, bool)':1309/nix/store/54yzskzwmapls2awvih149wyzci717gw-onnx-src/onnx/defs/reduction/old.cc:28:17: warning: unused parameter 'name' [-Wunused-parameter]1310 28 | const char* name,1311 | ~~~~~~~~~~~~^~~~1312/nix/store/54yzskzwmapls2awvih149wyzci717gw-onnx-src/onnx/defs/reduction/old.cc: In function 'std::function<void(onnx::OpSchema&)> onnx::ArgReduceDocGenerator_opset12(const char*)':1313/nix/store/54yzskzwmapls2awvih149wyzci717gw-onnx-src/onnx/defs/reduction/old.cc:123:81: warning: unused parameter 'name' [-Wunused-parameter]1314 123 | static std::function<void(OpSchema&)> ArgReduceDocGenerator_opset12(const char* name) {1315 | ~~~~~~~~~~~~^~~~1316/nix/store/54yzskzwmapls2awvih149wyzci717gw-onnx-src/onnx/defs/reduction/old.cc: In function 'std::function<void(onnx::OpSchema&)> onnx::ReduceDocGenerator_opset1(const char*, const char*, int)':1317/nix/store/54yzskzwmapls2awvih149wyzci717gw-onnx-src/onnx/defs/reduction/old.cc:204:39: warning: unused parameter 'name' [-Wunused-parameter]1318 204 | ReduceDocGenerator_opset1(const char* name, const char* empty_value, int opset = 1) {1319 | ~~~~~~~~~~~~^~~~1320/nix/store/54yzskzwmapls2awvih149wyzci717gw-onnx-src/onnx/defs/reduction/old.cc: In function 'std::function<void(onnx::OpSchema&)> onnx::ArgReduceDocGenerator_opset1(const char*)':1321/nix/store/54yzskzwmapls2awvih149wyzci717gw-onnx-src/onnx/defs/reduction/old.cc:305:80: warning: unused parameter 'name' [-Wunused-parameter]1322 305 | static std::function<void(OpSchema&)> ArgReduceDocGenerator_opset1(const char* name) {1323 | ~~~~~~~~~~~~^~~~1324[ 43%] Building CXX object CMakeFiles/onnxruntime_mlas_test.dir/build/source/onnxruntime/test/mlas/unittest/test_blockq4.cpp.o1325[ 43%] Built target onnxruntime_runtime_path_test_shared_library1326[ 43%] Building CXX object CMakeFiles/onnxruntime_session.dir/build/source/onnxruntime/core/session/ort_env.cc.o1327[ 43%] Building CXX object CMakeFiles/onnxruntime_framework.dir/build/source/onnxruntime/core/framework/error_code.cc.o1328[ 43%] Building CXX object CMakeFiles/onnxruntime_framework.dir/build/source/onnxruntime/core/framework/ex_lib_loader.cc.o1329[ 43%] Building CXX object CMakeFiles/onnxruntime_providers_openvino.dir/build/source/onnxruntime/core/providers/openvino/ov_interface.cc.o1330[ 43%] Building CXX object _deps/onnx-build/CMakeFiles/onnx.dir/onnx/defs/rnn/defs.cc.o1331[ 43%] Building CXX object CMakeFiles/onnxruntime_mlas_test.dir/build/source/onnxruntime/test/mlas/unittest/test_cast_fp16.cpp.o1332[ 43%] Building CXX object CMakeFiles/onnxruntime_optimizer.dir/build/source/onnxruntime/core/optimizer/dynamic_quantize_matmul_fusion.cc.o1333[ 43%] Building CXX object CMakeFiles/onnxruntime_optimizer.dir/build/source/onnxruntime/core/optimizer/embed_layer_norm_fusion.cc.o1334[ 43%] Building CXX object CMakeFiles/onnxruntime_optimizer.dir/build/source/onnxruntime/core/optimizer/expand_elimination.cc.o1335[ 43%] Building CXX object CMakeFiles/onnxruntime_optimizer.dir/build/source/onnxruntime/core/optimizer/fast_gelu_fusion.cc.o1336[ 44%] Building CXX object CMakeFiles/onnxruntime_optimizer.dir/build/source/onnxruntime/core/optimizer/free_dim_override_transformer.cc.o1337[ 44%] Building CXX object CMakeFiles/onnxruntime_mlas_test.dir/build/source/onnxruntime/test/mlas/unittest/test_conv2d.cpp.o1338[ 44%] Building CXX object CMakeFiles/onnxruntime_framework.dir/build/source/onnxruntime/core/framework/execution_frame.cc.o1339[ 44%] Building CXX object CMakeFiles/onnxruntime_framework.dir/build/source/onnxruntime/core/framework/execution_provider.cc.o1340[ 45%] Building CXX object CMakeFiles/onnxruntime_framework.dir/build/source/onnxruntime/core/framework/execution_steps.cc.o1341[ 45%] Building CXX object CMakeFiles/onnxruntime_framework.dir/build/source/onnxruntime/core/framework/external_data_loader.cc.o1342/build/source/onnxruntime/core/session/onnxruntime_c_api.cc: In function 'OrtStatus* OrtApis::OpAttr_GetType(const OrtOpAttr*, OrtOpAttrType*)':1343/build/source/onnxruntime/core/session/onnxruntime_c_api.cc:3552:14: warning: unused variable 'attr' [-Wunused-variable]1344 3552 | const auto attr = attribute->attr_proto;1345 | ^~~~1346[ 45%] Building CXX object CMakeFiles/onnxruntime_session.dir/build/source/onnxruntime/core/session/plugin_ep/ep_api.cc.o1347[ 45%] Building CXX object CMakeFiles/onnxruntime_session.dir/build/source/onnxruntime/core/session/plugin_ep/ep_control_flow_kernel_impls.cc.o1348[ 45%] Building CXX object CMakeFiles/onnxruntime_graph.dir/build/source/onnxruntime/core/graph/function_utils.cc.o1349[ 45%] Building CXX object CMakeFiles/onnxruntime_graph.dir/build/source/onnxruntime/core/graph/graph.cc.o1350[ 45%] Building CXX object CMakeFiles/onnxruntime_providers_openvino.dir/build/source/onnxruntime/core/providers/openvino/ov_protobuf_utils.cpp.o1351[ 45%] Building CXX object _deps/onnx-build/CMakeFiles/onnx.dir/onnx/defs/rnn/old.cc.o1352[ 45%] Building CXX object _deps/onnx-build/CMakeFiles/onnx.dir/onnx/defs/schema.cc.o1353[ 45%] Building CXX object CMakeFiles/onnxruntime_graph.dir/build/source/onnxruntime/core/graph/graph_flatbuffers_utils.cc.o1354[ 45%] Building CXX object CMakeFiles/onnxruntime_graph.dir/build/source/onnxruntime/core/graph/graph_proto_serializer.cc.o1355[ 45%] Building CXX object CMakeFiles/onnxruntime_mlas_test.dir/build/source/onnxruntime/test/mlas/unittest/test_conv2d_nchwc.cpp.o1356[ 45%] Building CXX object CMakeFiles/onnxruntime_graph.dir/build/source/onnxruntime/core/graph/graph_utils.cc.o1357[ 45%] Building CXX object CMakeFiles/onnxruntime_graph.dir/build/source/onnxruntime/core/graph/graph_viewer.cc.o1358[ 45%] Building CXX object CMakeFiles/onnxruntime_graph.dir/build/source/onnxruntime/core/graph/model.cc.o1359/nix/store/54yzskzwmapls2awvih149wyzci717gw-onnx-src/onnx/defs/schema.cc: In member function 'onnx::OpSchema& onnx::OpSchema::Input(int, std::string, const std::string&, std::string, FormalParameterOption, bool, int, DifferentiationCategory)':1360/nix/store/54yzskzwmapls2awvih149wyzci717gw-onnx-src/onnx/defs/schema.cc:600:24: warning: unused parameter 'description' [-Wunused-parameter]1361 600 | const std::string& description,1362 | ~~~~~~~~~~~~~~~~~~~^~~~~~~~~~~1363/nix/store/54yzskzwmapls2awvih149wyzci717gw-onnx-src/onnx/defs/schema.cc: In member function 'onnx::OpSchema& onnx::OpSchema::Input(int, const char*, const char*, const char*, FormalParameterOption, bool, int, DifferentiationCategory)':1364/nix/store/54yzskzwmapls2awvih149wyzci717gw-onnx-src/onnx/defs/schema.cc:625:17: warning: unused parameter 'description' [-Wunused-parameter]1365 625 | const char* description,1366 | ~~~~~~~~~~~~^~~~~~~~~~~1367/nix/store/54yzskzwmapls2awvih149wyzci717gw-onnx-src/onnx/defs/schema.cc: In member function 'onnx::OpSchema& onnx::OpSchema::Output(int, std::string, const std::string&, std::string, FormalParameterOption, bool, int, DifferentiationCategory)':1368/nix/store/54yzskzwmapls2awvih149wyzci717gw-onnx-src/onnx/defs/schema.cc:657:24: warning: unused parameter 'description' [-Wunused-parameter]1369 657 | const std::string& description,1370 | ~~~~~~~~~~~~~~~~~~~^~~~~~~~~~~1371/nix/store/54yzskzwmapls2awvih149wyzci717gw-onnx-src/onnx/defs/schema.cc: In member function 'onnx::OpSchema& onnx::OpSchema::Output(int, const char*, const char*, const char*, FormalParameterOption, bool, int, DifferentiationCategory)':1372/nix/store/54yzskzwmapls2awvih149wyzci717gw-onnx-src/onnx/defs/schema.cc:682:17: warning: unused parameter 'description' [-Wunused-parameter]1373 682 | const char* description,1374 | ~~~~~~~~~~~~^~~~~~~~~~~1375[ 45%] Building CXX object CMakeFiles/onnxruntime_graph.dir/build/source/onnxruntime/core/graph/model_helpers.cc.o1376[ 45%] Building CXX object CMakeFiles/onnxruntime_optimizer.dir/build/source/onnxruntime/core/optimizer/fuse_initializers_transformer.cc.o1377[ 45%] Building CXX object CMakeFiles/onnxruntime_mlas_test.dir/build/source/onnxruntime/test/mlas/unittest/test_dequantizelinear.cpp.o1378[ 45%] Building CXX object _deps/onnx-build/CMakeFiles/onnx.dir/onnx/defs/sequence/defs.cc.o1379[ 45%] Building CXX object CMakeFiles/onnxruntime_providers_openvino.dir/build/source/onnxruntime/core/providers/openvino/ov_shared_context.cc.o1380[ 45%] Building CXX object CMakeFiles/onnxruntime_session.dir/build/source/onnxruntime/core/session/plugin_ep/ep_event_profiling.cc.o1381[ 45%] Building CXX object CMakeFiles/onnxruntime_framework.dir/build/source/onnxruntime/core/framework/external_data_loader_manager.cc.o1382[ 45%] Building CXX object _deps/onnx-build/CMakeFiles/onnx.dir/onnx/defs/sequence/old.cc.o1383[ 45%] Building CXX object CMakeFiles/onnxruntime_mlas_test.dir/build/source/onnxruntime/test/mlas/unittest/test_dynamic_qgemm.cpp.o1384[ 45%] Building CXX object CMakeFiles/onnxruntime_optimizer.dir/build/source/onnxruntime/core/optimizer/gather_fusion.cc.o1385[ 45%] Building CXX object CMakeFiles/onnxruntime_graph.dir/build/source/onnxruntime/core/graph/node_attr_utils.cc.o1386[ 45%] Building CXX object _deps/onnx-build/CMakeFiles/onnx.dir/onnx/defs/sequence/utils.cc.o1387[ 45%] Building CXX object CMakeFiles/onnxruntime_providers_openvino.dir/build/source/onnxruntime/core/providers/openvino/ov_stateful_patch_utils.cc.o1388[ 45%] Building CXX object CMakeFiles/onnxruntime_providers_openvino.dir/build/source/onnxruntime/core/providers/openvino/ov_tracing.cc.o1389[ 46%] Building CXX object CMakeFiles/onnxruntime_graph.dir/build/source/onnxruntime/core/graph/op.cc.o1390[ 46%] Building CXX object CMakeFiles/onnxruntime_providers_openvino.dir/build/source/onnxruntime/core/providers/openvino/ov_versions/capability.cc.o1391[ 46%] Building CXX object CMakeFiles/onnxruntime_providers_openvino.dir/build/source/onnxruntime/core/providers/openvino/ov_versions/data_ops.cc.o1392[ 46%] Building CXX object CMakeFiles/onnxruntime_graph.dir/build/source/onnxruntime/core/graph/op_identifier_utils.cc.o1393[ 46%] Building CXX object CMakeFiles/onnxruntime_graph.dir/build/source/onnxruntime/core/graph/runtime_optimization_record_container.cc.o1394[ 46%] Building CXX object CMakeFiles/onnxruntime_framework.dir/build/source/onnxruntime/core/framework/fallback_cpu_capability.cc.o1395[ 46%] Building CXX object CMakeFiles/onnxruntime_mlas_test.dir/build/source/onnxruntime/test/mlas/unittest/test_eltwise.cpp.o1396[ 46%] Building CXX object CMakeFiles/onnxruntime_mlas_test.dir/build/source/onnxruntime/test/mlas/unittest/test_fgemm.cpp.o1397[ 46%] Building CXX object CMakeFiles/onnxruntime_mlas_test.dir/build/source/onnxruntime/test/mlas/unittest/test_fp16_activation.cpp.o1398[ 46%] Building CXX object CMakeFiles/onnxruntime_mlas_test.dir/build/source/onnxruntime/test/mlas/unittest/test_halfgemm.cpp.o1399[ 46%] Building CXX object CMakeFiles/onnxruntime_framework.dir/build/source/onnxruntime/core/framework/feeds_fetches_manager.cc.o1400[ 46%] Built target onnxruntime_mlas_q4dq1401[ 46%] Building CXX object CMakeFiles/onnxruntime_framework.dir/build/source/onnxruntime/core/framework/func_kernel.cc.o1402[ 46%] Building CXX object CMakeFiles/onnxruntime_graph.dir/build/source/onnxruntime/core/graph/schema_registry.cc.o1403[ 47%] Building CXX object CMakeFiles/onnxruntime_mlas_test.dir/build/source/onnxruntime/test/mlas/unittest/test_hgemm_neon.cpp.o1404[ 47%] Building CXX object CMakeFiles/onnxruntime_framework.dir/build/source/onnxruntime/core/framework/fuse_nodes_funcs.cc.o1405[ 47%] Building CXX object CMakeFiles/onnxruntime_session.dir/build/source/onnxruntime/core/session/plugin_ep/ep_factory_cpu.cc.o1406[ 47%] Building CXX object CMakeFiles/onnxruntime_session.dir/build/source/onnxruntime/core/session/plugin_ep/ep_factory_dml.cc.o1407[ 47%] Building CXX object CMakeFiles/onnxruntime_optimizer.dir/build/source/onnxruntime/core/optimizer/gelu_approximation.cc.o1408[ 47%] Building CXX object CMakeFiles/onnxruntime_session.dir/build/source/onnxruntime/core/session/plugin_ep/ep_factory_internal.cc.o1409[ 47%] Building CXX object CMakeFiles/onnxruntime_session.dir/build/source/onnxruntime/core/session/plugin_ep/ep_factory_internal_impl.cc.o1410[ 47%] Building CXX object _deps/onnx-build/CMakeFiles/onnx.dir/onnx/defs/shape_inference.cc.o1411[ 47%] Building CXX object CMakeFiles/onnxruntime_session.dir/build/source/onnxruntime/core/session/plugin_ep/ep_factory_provider_bridge.cc.o1412[ 47%] Building CXX object CMakeFiles/onnxruntime_session.dir/build/source/onnxruntime/core/session/plugin_ep/ep_factory_webgpu.cc.o1413[ 47%] Building CXX object CMakeFiles/onnxruntime_mlas_test.dir/build/source/onnxruntime/test/mlas/unittest/test_hqnbitgemm_neon.cpp.o1414[ 47%] Building CXX object CMakeFiles/onnxruntime_mlas_test.dir/build/source/onnxruntime/test/mlas/unittest/test_layernorm.cpp.o1415[ 47%] Building CXX object _deps/onnx-build/CMakeFiles/onnx.dir/onnx/defs/tensor/defs.cc.o1416[ 47%] Building CXX object CMakeFiles/onnxruntime_session.dir/build/source/onnxruntime/core/session/plugin_ep/ep_kernel_registration.cc.o1417[ 47%] Building CXX object _deps/onnx-build/CMakeFiles/onnx.dir/onnx/defs/tensor/old.cc.o1418[ 47%] Building CXX object _deps/onnx-build/CMakeFiles/onnx.dir/onnx/defs/tensor/utils.cc.o1419[ 47%] Building CXX object CMakeFiles/onnxruntime_session.dir/build/source/onnxruntime/core/session/plugin_ep/ep_library_internal.cc.o1420[ 47%] Building CXX object CMakeFiles/onnxruntime_session.dir/build/source/onnxruntime/core/session/plugin_ep/ep_library_plugin.cc.o1421[ 47%] Building CXX object CMakeFiles/onnxruntime_session.dir/build/source/onnxruntime/core/session/plugin_ep/ep_library_provider_bridge.cc.o1422[ 47%] Building CXX object CMakeFiles/onnxruntime_mlas_test.dir/build/source/onnxruntime/test/mlas/unittest/test_main.cpp.o1423[ 47%] Building CXX object CMakeFiles/onnxruntime_mlas_test.dir/build/source/onnxruntime/test/mlas/unittest/test_minmax.cpp.o1424[ 48%] Building CXX object CMakeFiles/onnxruntime_session.dir/build/source/onnxruntime/core/session/plugin_ep/ep_plugin_provider_interfaces.cc.o1425[ 48%] Building CXX object CMakeFiles/onnxruntime_session.dir/build/source/onnxruntime/core/session/provider_bridge_ort.cc.o1426[ 48%] Building CXX object CMakeFiles/onnxruntime_session.dir/build/source/onnxruntime/core/session/provider_policy_context.cc.o1427[ 48%] Building CXX object CMakeFiles/onnxruntime_session.dir/build/source/onnxruntime/core/session/provider_registration.cc.o1428[ 48%] Building CXX object CMakeFiles/onnxruntime_providers_openvino.dir/build/source/onnxruntime/core/providers/openvino/ov_versions/utils.cc.o1429[ 48%] Building CXX object CMakeFiles/onnxruntime_providers_openvino.dir/build/source/onnxruntime/core/providers/openvino/qdq_transformations/qdq_scales_fix.cc.o1430[ 48%] Building CXX object CMakeFiles/onnxruntime_providers_openvino.dir/build/source/onnxruntime/core/providers/openvino/qdq_transformations/qdq_stripping.cc.o1431[ 48%] Building CXX object CMakeFiles/onnxruntime_providers_openvino.dir/build/source/onnxruntime/core/providers/shared_library/provider_bridge_provider.cc.o1432[ 48%] Building CXX object CMakeFiles/onnxruntime_providers_openvino.dir/build/source/onnxruntime/core/providers/shared_library/provider_ort_api_init.cc.o1433[ 48%] Building CXX object CMakeFiles/onnxruntime_mlas_test.dir/build/source/onnxruntime/test/mlas/unittest/test_pool2d.cpp.o1434[ 48%] Building CXX object CMakeFiles/onnxruntime_session.dir/build/source/onnxruntime/core/session/standalone_op_invoker.cc.o1435[ 48%] Building CXX object CMakeFiles/onnxruntime_session.dir/build/source/onnxruntime/core/session/utils.cc.o1436[ 48%] Building CXX object CMakeFiles/onnxruntime_mlas_test.dir/build/source/onnxruntime/test/mlas/unittest/test_pool2d_nchwc.cpp.o1437[ 48%] Building CXX object CMakeFiles/onnxruntime_optimizer.dir/build/source/onnxruntime/core/optimizer/gelu_fusion.cc.o1438[ 48%] Building CXX object CMakeFiles/onnxruntime_optimizer.dir/build/source/onnxruntime/core/optimizer/gemm_activation_fusion.cc.o1439[ 48%] Building CXX object CMakeFiles/onnxruntime_framework.dir/build/source/onnxruntime/core/framework/graph_partitioner.cc.o1440[ 48%] Building CXX object CMakeFiles/onnxruntime_framework.dir/build/source/onnxruntime/core/framework/kernel_def_builder.cc.o1441[ 48%] Building CXX object CMakeFiles/onnxruntime_framework.dir/build/source/onnxruntime/core/framework/kernel_registry.cc.o1442[ 48%] Building CXX object CMakeFiles/onnxruntime_mlas_test.dir/build/source/onnxruntime/test/mlas/unittest/test_pool3d.cpp.o1443[ 48%] Building CXX object CMakeFiles/onnxruntime_optimizer.dir/build/source/onnxruntime/core/optimizer/gemm_sum_fusion.cc.o1444[ 48%] Building CXX object CMakeFiles/onnxruntime_optimizer.dir/build/source/onnxruntime/core/optimizer/gemm_transpose_fusion.cc.o1445[ 48%] Building CXX object CMakeFiles/onnxruntime_optimizer.dir/build/source/onnxruntime/core/optimizer/graph_optimizer_registry.cc.o1446[ 48%] Linking CXX static library libonnxruntime_graph.a1447[ 48%] Building CXX object CMakeFiles/onnxruntime_optimizer.dir/build/source/onnxruntime/core/optimizer/graph_transformer.cc.o1448[ 48%] Building CXX object CMakeFiles/onnxruntime_optimizer.dir/build/source/onnxruntime/core/optimizer/graph_transformer_mgr.cc.o1449[ 48%] Building CXX object CMakeFiles/onnxruntime_optimizer.dir/build/source/onnxruntime/core/optimizer/graph_transformer_utils.cc.o1450[ 48%] Built target onnxruntime_graph1451[ 48%] Building CXX object _deps/onnx-build/CMakeFiles/onnx.dir/onnx/defs/tensor_proto_util.cc.o1452[ 48%] Building CXX object _deps/onnx-build/CMakeFiles/onnx.dir/onnx/defs/tensor_util.cc.o1453[ 50%] Building CXX object _deps/onnx-build/CMakeFiles/onnx.dir/onnx/defs/text/defs.cc.o1454[ 50%] Building CXX object _deps/onnx-build/CMakeFiles/onnx.dir/onnx/defs/traditionalml/defs.cc.o1455[ 50%] Building CXX object CMakeFiles/onnxruntime_mlas_test.dir/build/source/onnxruntime/test/mlas/unittest/test_q4gemm.cpp.o1456[ 50%] Building CXX object _deps/onnx-build/CMakeFiles/onnx.dir/onnx/defs/traditionalml/old.cc.o1457[ 50%] Building CXX object CMakeFiles/onnxruntime_mlas_test.dir/build/source/onnxruntime/test/mlas/unittest/test_q4qdq.cpp.o1458[ 50%] Building CXX object _deps/onnx-build/CMakeFiles/onnx.dir/onnx/defs/training/defs.cc.o1459/build/source/onnxruntime/core/framework/graph_partitioner.cc: In function 'onnxruntime::common::Status onnxruntime::CreateEpContextModel(const ExecutionProviders&, const Graph&, const epctx::ModelGenOptions&, const logging::Logger&)':1460/build/source/onnxruntime/core/framework/graph_partitioner.cc:1133:33: warning: ignoring return value of 'bool google::protobuf::MessageLite::SerializeToArray(void*, int) const', declared with attribute 'nodiscard' [-Wunused-result]1461 1133 | model_proto.SerializeToArray(buffer.get(), static_cast<int>(buffer_size));1462 | ~~~~~~~~~~~~~~~~~~~~~~~~~~~~^~~~~~~~~~~~~~~~~~~~~~~~~~~~~~~~~~~~~~~~~~~~~1463In file included from /nix/store/9pgz5bq44kvmf7zsf85yblghr1pjmfnc-protobuf-36.2-dev/include/google/protobuf/generated_message_tctable_decl.h:23,1464 from /build/source/build/_deps/onnx-build/onnx/onnx-ml.pb.h:24,1465 from /nix/store/54yzskzwmapls2awvih149wyzci717gw-onnx-src/onnx/onnx_pb.h:51,1466 from /nix/store/54yzskzwmapls2awvih149wyzci717gw-onnx-src/onnx/defs/data_type_utils.h:13,1467 from /nix/store/54yzskzwmapls2awvih149wyzci717gw-onnx-src/onnx/defs/schema.h:24,1468 from /build/source/include/onnxruntime/core/graph/onnx_protobuf.h:22,1469 from /build/source/include/onnxruntime/core/framework/data_types.h:21,1470 from /build/source/include/onnxruntime/core/framework/ort_value.h:11,1471 from /build/source/include/onnxruntime/core/graph/graph.h:30,1472 from /build/source/onnxruntime/core/framework/graph_partitioner.h:7,1473 from /build/source/onnxruntime/core/framework/graph_partitioner.cc:4:1474/nix/store/9pgz5bq44kvmf7zsf85yblghr1pjmfnc-protobuf-36.2-dev/include/google/protobuf/message_lite.h:621:44: note: declared here1475 621 | PROTOBUF_FUTURE_ADD_EARLY_NODISCARD bool SerializeToArray(void* data,1476 | ^~~~~~~~~~~~~~~~1477[ 50%] Linking CXX shared module libonnxruntime_providers_openvino.so1478/build/source/onnxruntime/core/framework/graph_partitioner.cc:1146:35: warning: ignoring return value of 'bool google::protobuf::MessageLite::SerializeToOstream(std::ostream*) const', declared with attribute 'nodiscard' [-Wunused-result]1479 1146 | model_proto.SerializeToOstream(&out_stream);1480 | ~~~~~~~~~~~~~~~~~~~~~~~~~~~~~~^~~~~~~~~~~~~1481/nix/store/9pgz5bq44kvmf7zsf85yblghr1pjmfnc-protobuf-36.2-dev/include/google/protobuf/message_lite.h:647:44: note: declared here1482 647 | PROTOBUF_FUTURE_ADD_EARLY_NODISCARD bool SerializeToOstream(1483 | ^~~~~~~~~~~~~~~~~~1484[ 50%] Building CXX object CMakeFiles/onnxruntime_mlas_test.dir/build/source/onnxruntime/test/mlas/unittest/test_q8q4gemm.cpp.o1485[ 50%] Building CXX object CMakeFiles/onnxruntime_mlas_test.dir/build/source/onnxruntime/test/mlas/unittest/test_qgemm.cpp.o1486/build/source/build/_deps/onnx-build/onnx/onnx-ml.pb.h:2431:46: warning: type 'struct TensorProto' violates the C++ One Definition Rule [-Wodr]1487 2431 | class PROTOBUF_FUTURE_ADD_EARLY_WARN_UNUSED TensorProto final : public ::google::protobuf::MessageLite1488 | ^1489/build/source/onnxruntime/core/providers/shared_library/provider_wrappedtypes.h:242:8: note: a type with different bases is defined in another translation unit1490 242 | struct TensorProto final {1491 | ^1492[ 50%] Building CXX object _deps/onnx-build/CMakeFiles/onnx.dir/onnx/inliner/inliner.cc.o1493[ 50%] Building CXX object _deps/onnx-build/CMakeFiles/onnx.dir/onnx/shape_inference/implementation.cc.o1494[ 50%] Building CXX object CMakeFiles/onnxruntime_mlas_test.dir/build/source/onnxruntime/test/mlas/unittest/test_qkv_quant.cpp.o1495[ 50%] Building CXX object CMakeFiles/onnxruntime_mlas_test.dir/build/source/onnxruntime/test/mlas/unittest/test_qlinear_binaryop.cpp.o1496[ 50%] Building CXX object CMakeFiles/onnxruntime_optimizer.dir/build/source/onnxruntime/core/optimizer/group_query_attention_fusion.cc.o1497[ 50%] Building CXX object CMakeFiles/onnxruntime_mlas_test.dir/build/source/onnxruntime/test/mlas/unittest/test_qlinear_gavgpool.cpp.o1498[ 50%] Building CXX object CMakeFiles/onnxruntime_mlas_test.dir/build/source/onnxruntime/test/mlas/unittest/test_quantizelinear.cpp.o1499[ 51%] Building CXX object CMakeFiles/onnxruntime_mlas_test.dir/build/source/onnxruntime/test/mlas/unittest/test_reorder_output.cpp.o1500[ 51%] Building CXX object _deps/onnx-build/CMakeFiles/onnx.dir/onnx/version_converter/convert.cc.o1501[ 51%] Building CXX object _deps/onnx-build/CMakeFiles/onnx.dir/onnx/version_converter/helper.cc.o1502[ 51%] Building CXX object _deps/onnx-build/CMakeFiles/onnx.dir/onnx/onnx-ml.pb.cc.o1503[ 51%] Building CXX object CMakeFiles/onnxruntime_mlas_test.dir/build/source/onnxruntime/test/mlas/unittest/test_rope.cpp.o1504[ 51%] Building CXX object CMakeFiles/onnxruntime_mlas_test.dir/build/source/onnxruntime/test/mlas/unittest/test_rope_neon_fp16.cpp.o1505[ 51%] Building CXX object CMakeFiles/onnxruntime_mlas_test.dir/build/source/onnxruntime/test/mlas/unittest/test_sbgemm.cpp.o1506[ 51%] Building CXX object CMakeFiles/onnxruntime_framework.dir/build/source/onnxruntime/core/framework/kernel_registry_manager.cc.o1507[ 51%] Building CXX object CMakeFiles/onnxruntime_framework.dir/build/source/onnxruntime/core/framework/kernel_type_str_resolver.cc.o1508[ 51%] Building CXX object _deps/onnx-build/CMakeFiles/onnx.dir/onnx/onnx-operators-ml.pb.cc.o1509[ 51%] Building CXX object _deps/onnx-build/CMakeFiles/onnx.dir/onnx/onnx-data.pb.cc.o1510[ 51%] Building CXX object CMakeFiles/onnxruntime_mlas_test.dir/build/source/onnxruntime/test/mlas/unittest/test_scaleoutput.cpp.o1511/nix/store/54yzskzwmapls2awvih149wyzci717gw-onnx-src/onnx/shape_inference/implementation.cc: In function 'void onnx::shape_inference::InferShapes(const std::string&, const std::string&, const onnx::ISchemaRegistry*, const onnx::ShapeInferenceOptions&, DataValueMap*)':1512/nix/store/54yzskzwmapls2awvih149wyzci717gw-onnx-src/onnx/shape_inference/implementation.cc:850:28: warning: ignoring return value of 'bool google::protobuf::MessageLite::SerializeToString(std::string*) const', declared with attribute 'nodiscard' [-Wunused-result]1513 850 | model.SerializeToString(&model_string);1514 | ~~~~~~~~~~~~~~~~~~~~~~~^~~~~~~~~~~~~~~1515In file included from /nix/store/9pgz5bq44kvmf7zsf85yblghr1pjmfnc-protobuf-36.2-dev/include/google/protobuf/generated_message_tctable_decl.h:23,1516 from /build/source/build/_deps/onnx-build/onnx/onnx-ml.pb.h:24,1517 from /nix/store/54yzskzwmapls2awvih149wyzci717gw-onnx-src/onnx/onnx_pb.h:51,1518 from /nix/store/54yzskzwmapls2awvih149wyzci717gw-onnx-src/onnx/defs/data_type_utils.h:13,1519 from /nix/store/54yzskzwmapls2awvih149wyzci717gw-onnx-src/onnx/defs/schema.h:24,1520 from /nix/store/54yzskzwmapls2awvih149wyzci717gw-onnx-src/onnx/shape_inference/implementation.h:14,1521 from /nix/store/54yzskzwmapls2awvih149wyzci717gw-onnx-src/onnx/shape_inference/implementation.cc:5:1522/nix/store/9pgz5bq44kvmf7zsf85yblghr1pjmfnc-protobuf-36.2-dev/include/google/protobuf/message_lite.h:608:44: note: declared here1523 608 | PROTOBUF_FUTURE_ADD_EARLY_NODISCARD bool SerializeToString(1524 | ^~~~~~~~~~~~~~~~~1525[ 51%] Building CXX object CMakeFiles/onnxruntime_optimizer.dir/build/source/onnxruntime/core/optimizer/identical_children_consolidation.cc.o1526[ 51%] Building CXX object CMakeFiles/onnxruntime_optimizer.dir/build/source/onnxruntime/core/optimizer/identity_elimination.cc.o1527[ 51%] Building CXX object CMakeFiles/onnxruntime_optimizer.dir/build/source/onnxruntime/core/optimizer/initializer.cc.o1528[ 52%] Building CXX object CMakeFiles/onnxruntime_optimizer.dir/build/source/onnxruntime/core/optimizer/insert_cast_transformer.cc.o1529[ 52%] Building CXX object CMakeFiles/onnxruntime_optimizer.dir/build/source/onnxruntime/core/optimizer/isinf_reducesum_fusion.cc.o1530[ 52%] Building CXX object CMakeFiles/onnxruntime_mlas_test.dir/build/source/onnxruntime/test/mlas/unittest/test_softcap.cpp.o1531[ 52%] Building CXX object CMakeFiles/onnxruntime_mlas_test.dir/build/source/onnxruntime/test/mlas/unittest/test_softmax.cpp.o1532[ 52%] Building CXX object CMakeFiles/onnxruntime_mlas_test.dir/build/source/onnxruntime/test/mlas/unittest/test_sq8bitgemm.cpp.o1533[ 52%] Building CXX object CMakeFiles/onnxruntime_mlas_test.dir/build/source/onnxruntime/test/mlas/unittest/test_sqlutgemm.cpp.o1534[ 52%] Building CXX object CMakeFiles/onnxruntime_mlas_test.dir/build/source/onnxruntime/test/mlas/unittest/test_sqnbitgemm.cpp.o1535[ 52%] Building CXX object CMakeFiles/onnxruntime_mlas_test.dir/build/source/onnxruntime/test/mlas/unittest/test_sqnbitgemm_neon_fp16.cpp.o1536[ 52%] Linking CXX static library libonnxruntime_session.a1537[ 52%] Building CXX object CMakeFiles/onnxruntime_mlas_test.dir/build/source/onnxruntime/test/mlas/unittest/test_symm_qgemm.cpp.o1538[ 52%] Building CXX object CMakeFiles/onnxruntime_optimizer.dir/build/source/onnxruntime/core/optimizer/label_encoder_fusion.cc.o1539[ 52%] Built target onnxruntime_session1540[ 52%] Building CXX object CMakeFiles/onnxruntime_mlas_test.dir/build/source/onnxruntime/test/mlas/unittest/test_transcendental_avx512.cpp.o1541[ 52%] Building CXX object CMakeFiles/onnxruntime_mlas_test.dir/build/source/onnxruntime/test/mlas/unittest/test_transpose.cpp.o1542[ 52%] Building CXX object CMakeFiles/onnxruntime_framework.dir/build/source/onnxruntime/core/framework/kernel_type_str_resolver_utils.cc.o1543[ 52%] Building CXX object CMakeFiles/onnxruntime_optimizer.dir/build/source/onnxruntime/core/optimizer/layer_norm_fusion.cc.o1544[ 52%] Building CXX object CMakeFiles/onnxruntime_optimizer.dir/build/source/onnxruntime/core/optimizer/layout_transformation/layout_transformation.cc.o1545[ 52%] Building CXX object CMakeFiles/onnxruntime_optimizer.dir/build/source/onnxruntime/core/optimizer/matmul_activation_fusion.cc.o1546[ 52%] Building CXX object CMakeFiles/onnxruntime_optimizer.dir/build/source/onnxruntime/core/optimizer/matmul_add_fusion.cc.o1547[ 52%] Building CXX object CMakeFiles/onnxruntime_optimizer.dir/build/source/onnxruntime/core/optimizer/matmul_bn_fusion.cc.o1548[ 52%] Building CXX object CMakeFiles/onnxruntime_optimizer.dir/build/source/onnxruntime/core/optimizer/matmul_integer_to_float.cc.o1549[ 52%] Building CXX object CMakeFiles/onnxruntime_optimizer.dir/build/source/onnxruntime/core/optimizer/matmul_nbits_fusion.cc.o1550[ 52%] Building CXX object CMakeFiles/onnxruntime_framework.dir/build/source/onnxruntime/core/framework/layering_annotations.cc.o1551[ 52%] Building CXX object CMakeFiles/onnxruntime_framework.dir/build/source/onnxruntime/core/framework/library_handles.cc.o1552[ 53%] Building CXX object CMakeFiles/onnxruntime_framework.dir/build/source/onnxruntime/core/framework/memcpy.cc.o1553[ 53%] Building CXX object CMakeFiles/onnxruntime_framework.dir/build/source/onnxruntime/core/framework/memory_info.cc.o1554[ 53%] Building CXX object CMakeFiles/onnxruntime_framework.dir/build/source/onnxruntime/core/framework/mldata_type_utils.cc.o1555[ 53%] Building CXX object CMakeFiles/onnxruntime_optimizer.dir/build/source/onnxruntime/core/optimizer/matmul_nbits_mlp_fusion.cc.o1556[ 53%] Building CXX object CMakeFiles/onnxruntime_optimizer.dir/build/source/onnxruntime/core/optimizer/matmul_nbits_qkv_fusion.cc.o1557[ 53%] Building CXX object CMakeFiles/onnxruntime_optimizer.dir/build/source/onnxruntime/core/optimizer/matmul_scale_fusion.cc.o1558[ 53%] Building CXX object CMakeFiles/onnxruntime_framework.dir/build/source/onnxruntime/core/framework/model_metadef_id_generator.cc.o1559[ 53%] Building CXX object CMakeFiles/onnxruntime_framework.dir/build/source/onnxruntime/core/framework/murmurhash3.cc.o1560[ 53%] Building CXX object CMakeFiles/onnxruntime_framework.dir/build/source/onnxruntime/core/framework/node_index_info.cc.o1561[ 53%] Building CXX object CMakeFiles/onnxruntime_optimizer.dir/build/source/onnxruntime/core/optimizer/matmul_transpose_fusion.cc.o1562[ 53%] Building CXX object CMakeFiles/onnxruntime_optimizer.dir/build/source/onnxruntime/core/optimizer/nchwc_transformer.cc.o1563[ 53%] Linking CXX static library libonnx.a1564[ 53%] Building CXX object CMakeFiles/onnxruntime_optimizer.dir/build/source/onnxruntime/core/optimizer/nhwc_transformer.cc.o1565[ 53%] Building CXX object CMakeFiles/onnxruntime_framework.dir/build/source/onnxruntime/core/framework/node_unit.cc.o1566[ 53%] Building CXX object CMakeFiles/onnxruntime_framework.dir/build/source/onnxruntime/core/framework/onnxruntime_map_type_info.cc.o1567[ 53%] Building CXX object CMakeFiles/onnxruntime_framework.dir/build/source/onnxruntime/core/framework/onnxruntime_optional_type_info.cc.o1568[ 53%] Built target onnx1569[ 53%] Building CXX object CMakeFiles/onnxruntime_framework.dir/build/source/onnxruntime/core/framework/onnxruntime_sequence_type_info.cc.o1570[ 53%] Building CXX object CMakeFiles/onnxruntime_framework.dir/build/source/onnxruntime/core/framework/onnxruntime_typeinfo.cc.o1571[ 53%] Building CXX object CMakeFiles/onnxruntime_framework.dir/build/source/onnxruntime/core/framework/op_kernel.cc.o1572[ 53%] Building CXX object CMakeFiles/onnxruntime_framework.dir/build/source/onnxruntime/core/framework/op_kernel_info.cc.o1573[ 53%] Building CXX object CMakeFiles/onnxruntime_framework.dir/build/source/onnxruntime/core/framework/op_node_proto_helper.cc.o1574[ 53%] Building CXX object CMakeFiles/onnxruntime_framework.dir/build/source/onnxruntime/core/framework/ort_value_pattern_planner.cc.o1575[ 53%] Building CXX object CMakeFiles/onnxruntime_framework.dir/build/source/onnxruntime/core/framework/ort_value_tensor_slicer.cc.o1576[ 54%] Building CXX object CMakeFiles/onnxruntime_optimizer.dir/build/source/onnxruntime/core/optimizer/noop_elimination.cc.o1577[ 54%] Building CXX object CMakeFiles/onnxruntime_providers.dir/build/source/onnxruntime/core/providers/execution_provider_factory.cc.o1578[ 54%] Building CXX object CMakeFiles/onnxruntime_optimizer.dir/build/source/onnxruntime/core/optimizer/not_where_fusion.cc.o1579[ 55%] Building CXX object CMakeFiles/onnxruntime_framework.dir/build/source/onnxruntime/core/framework/partial_graph_execution_state.cc.o1580[ 55%] Building CXX object CMakeFiles/onnxruntime_optimizer.dir/build/source/onnxruntime/core/optimizer/optimizer_execution_frame.cc.o1581[ 55%] Building CXX object CMakeFiles/onnxruntime_providers.dir/build/source/onnxruntime/core/providers/get_execution_providers.cc.o1582[ 55%] Building CXX object CMakeFiles/onnxruntime_providers.dir/build/source/onnxruntime/core/providers/partitioning_utils.cc.o1583[ 55%] Building CXX object CMakeFiles/onnxruntime_providers.dir/build/source/onnxruntime/core/providers/utils.cc.o1584[ 55%] Built target onnxruntime_providers_openvino1585[ 55%] Building CXX object CMakeFiles/onnxruntime_optimizer.dir/build/source/onnxruntime/core/optimizer/pad_fusion.cc.o1586[ 55%] Building CXX object CMakeFiles/onnxruntime_optimizer.dir/build/source/onnxruntime/core/optimizer/pre_shape_node_elimination.cc.o1587[ 55%] Building CXX object CMakeFiles/onnxruntime_optimizer.dir/build/source/onnxruntime/core/optimizer/propagate_cast_ops.cc.o1588[ 55%] Building CXX object CMakeFiles/onnxruntime_optimizer.dir/build/source/onnxruntime/core/optimizer/qdq_transformer/avx2_weight_s8_to_u8.cc.o1589[ 55%] Building CXX object CMakeFiles/onnxruntime_optimizer.dir/build/source/onnxruntime/core/optimizer/qdq_transformer/clip_quantizelinear.cc.o1590[ 55%] Building CXX object CMakeFiles/onnxruntime_optimizer.dir/build/source/onnxruntime/core/optimizer/qdq_transformer/constant_folding_dq_node.cc.o1591[ 55%] Building CXX object CMakeFiles/onnxruntime_optimizer.dir/build/source/onnxruntime/core/optimizer/qdq_transformer/ensure_unique_dq_for_node_unit.cc.o1592[ 55%] Building CXX object CMakeFiles/onnxruntime_optimizer.dir/build/source/onnxruntime/core/optimizer/qdq_transformer/qdq_final_cleanup.cc.o1593[ 55%] Building CXX object CMakeFiles/onnxruntime_providers.dir/build/source/onnxruntime/core/providers/cpu/activation/activations.cc.o1594[ 55%] Building CXX object CMakeFiles/onnxruntime_optimizer.dir/build/source/onnxruntime/core/optimizer/qdq_transformer/qdq_propagation.cc.o1595[ 55%] Building CXX object CMakeFiles/onnxruntime_providers.dir/build/source/onnxruntime/core/providers/cpu/controlflow/if.cc.o1596[ 55%] Building CXX object CMakeFiles/onnxruntime_providers.dir/build/source/onnxruntime/core/providers/cpu/controlflow/loop.cc.o1597[ 55%] Linking CXX executable onnxruntime_mlas_test1598[ 55%] Building CXX object CMakeFiles/onnxruntime_providers.dir/build/source/onnxruntime/core/providers/cpu/controlflow/scan_8.cc.o1599[ 55%] Building CXX object CMakeFiles/onnxruntime_optimizer.dir/build/source/onnxruntime/core/optimizer/qdq_transformer/qdq_s8_to_u8.cc.o1600[ 55%] Building CXX object CMakeFiles/onnxruntime_providers.dir/build/source/onnxruntime/core/providers/cpu/controlflow/scan_9.cc.o1601[ 55%] Building CXX object CMakeFiles/onnxruntime_providers.dir/build/source/onnxruntime/core/providers/cpu/controlflow/scan_utils.cc.o1602[ 55%] Building CXX object CMakeFiles/onnxruntime_providers.dir/build/source/onnxruntime/core/providers/cpu/controlflow/utils.cc.o1603[ 55%] Building CXX object CMakeFiles/onnxruntime_framework.dir/build/source/onnxruntime/core/framework/plugin_data_transfer.cc.o1604[ 55%] Building CXX object CMakeFiles/onnxruntime_optimizer.dir/build/source/onnxruntime/core/optimizer/qdq_transformer/qdq_util.cc.o1605[ 55%] Building CXX object CMakeFiles/onnxruntime_framework.dir/build/source/onnxruntime/core/framework/plugin_ep_stream.cc.o1606[ 55%] Building CXX object CMakeFiles/onnxruntime_providers.dir/build/source/onnxruntime/core/providers/cpu/cpu_execution_provider.cc.o1607[ 55%] Building CXX object CMakeFiles/onnxruntime_providers.dir/build/source/onnxruntime/core/providers/cpu/cpu_provider_factory.cc.o1608[ 55%] Building CXX object CMakeFiles/onnxruntime_providers.dir/build/source/onnxruntime/core/providers/cpu/cpu_provider_shared.cc.o1609[ 55%] Building CXX object CMakeFiles/onnxruntime_optimizer.dir/build/source/onnxruntime/core/optimizer/qdq_transformer/relu_quantizelinear.cc.o1610[ 55%] Building CXX object CMakeFiles/onnxruntime_providers.dir/build/source/onnxruntime/core/providers/cpu/fp16/fp16_conv.cc.o1611[ 56%] Building CXX object CMakeFiles/onnxruntime_providers.dir/build/source/onnxruntime/core/providers/cpu/fp16/fp16_pool.cc.o1612[ 56%] Building CXX object CMakeFiles/onnxruntime_optimizer.dir/build/source/onnxruntime/core/optimizer/qdq_transformer/s8_to_u8.cc.o1613[ 56%] Building CXX object CMakeFiles/onnxruntime_framework.dir/build/source/onnxruntime/core/framework/prepacked_weights.cc.o1614[ 56%] Building CXX object CMakeFiles/onnxruntime_providers.dir/build/source/onnxruntime/core/providers/cpu/generator/constant_of_shape.cc.o1615[ 56%] Building CXX object CMakeFiles/onnxruntime_providers.dir/build/source/onnxruntime/core/providers/cpu/generator/random.cc.o1616[ 57%] Building CXX object CMakeFiles/onnxruntime_optimizer.dir/build/source/onnxruntime/core/optimizer/qdq_transformer/selectors_actions/qdq_actions.cc.o1617[ 57%] Building CXX object CMakeFiles/onnxruntime_optimizer.dir/build/source/onnxruntime/core/optimizer/qdq_transformer/selectors_actions/qdq_selector_action_transformer.cc.o1618[ 57%] Building CXX object CMakeFiles/onnxruntime_framework.dir/build/source/onnxruntime/core/framework/prepacked_weights_container.cc.o1619[ 57%] Building CXX object CMakeFiles/onnxruntime_providers.dir/build/source/onnxruntime/core/providers/cpu/generator/range.cc.o1620[ 57%] Building CXX object CMakeFiles/onnxruntime_framework.dir/build/source/onnxruntime/core/framework/random_generator.cc.o1621[ 57%] Building CXX object CMakeFiles/onnxruntime_providers.dir/build/source/onnxruntime/core/providers/cpu/llm/attention.cc.o1622[ 57%] Building CXX object CMakeFiles/onnxruntime_optimizer.dir/build/source/onnxruntime/core/optimizer/qdq_transformer/selectors_actions/qdq_selectors.cc.o1623[ 57%] Building CXX object CMakeFiles/onnxruntime_providers.dir/build/source/onnxruntime/core/providers/cpu/llm/rotary_embedding.cc.o1624[ 57%] Building CXX object CMakeFiles/onnxruntime_providers.dir/build/source/onnxruntime/core/providers/cpu/llm/tensorscatter.cc.o1625[ 57%] Building CXX object CMakeFiles/onnxruntime_framework.dir/build/source/onnxruntime/core/framework/random_seed.cc.o1626[ 57%] Building CXX object CMakeFiles/onnxruntime_framework.dir/build/source/onnxruntime/core/framework/resource_accountant.cc.o1627[ 57%] Building CXX object CMakeFiles/onnxruntime_framework.dir/build/source/onnxruntime/core/framework/run_options.cc.o1628[ 57%] Building CXX object CMakeFiles/onnxruntime_framework.dir/build/source/onnxruntime/core/framework/sequential_executor.cc.o1629[ 57%] Building CXX object CMakeFiles/onnxruntime_framework.dir/build/source/onnxruntime/core/framework/session_options.cc.o1630[ 57%] Building CXX object CMakeFiles/onnxruntime_optimizer.dir/build/source/onnxruntime/core/optimizer/qdq_transformer/selectors_actions/shared/utils.cc.o1631[ 57%] Building CXX object CMakeFiles/onnxruntime_providers.dir/build/source/onnxruntime/core/providers/cpu/math/clip.cc.o1632In file included from /nix/store/2rq4fv67zqcgx3rm8a3q5yq3g2z8hrcp-eigen-3.4.1/include/eigen3/unsupported/Eigen/CXX11/Tensor:63,1633 from /build/source/include/onnxruntime/core/common/eigen_common_wrapper.h:70,1634 from /build/source/onnxruntime/core/providers/cpu/generator/random.cc:28:1635/nix/store/2rq4fv67zqcgx3rm8a3q5yq3g2z8hrcp-eigen-3.4.1/include/eigen3/unsupported/Eigen/CXX11/src/Tensor/TensorDeviceThreadPool.h: In lambda function:1636/nix/store/2rq4fv67zqcgx3rm8a3q5yq3g2z8hrcp-eigen-3.4.1/include/eigen3/unsupported/Eigen/CXX11/src/Tensor/TensorDeviceThreadPool.h:210:19: warning: implicit capture of 'this' via '[=]' is deprecated in C++20 [-Wdeprecated]1637 210 | handleRange = [=, &handleRange, &barrier, &f](Index firstIdx,1638 | ^1639/nix/store/2rq4fv67zqcgx3rm8a3q5yq3g2z8hrcp-eigen-3.4.1/include/eigen3/unsupported/Eigen/CXX11/src/Tensor/TensorDeviceThreadPool.h:210:19: note: add explicit 'this' or '*this' capture1640In file included from /nix/store/2rq4fv67zqcgx3rm8a3q5yq3g2z8hrcp-eigen-3.4.1/include/eigen3/unsupported/Eigen/CXX11/Tensor:91:1641/nix/store/2rq4fv67zqcgx3rm8a3q5yq3g2z8hrcp-eigen-3.4.1/include/eigen3/unsupported/Eigen/CXX11/src/Tensor/TensorContractionThreadPool.h: In lambda function:1642/nix/store/2rq4fv67zqcgx3rm8a3q5yq3g2z8hrcp-eigen-3.4.1/include/eigen3/unsupported/Eigen/CXX11/src/Tensor/TensorContractionThreadPool.h:1009:13: warning: implicit capture of 'this' via '[=]' is deprecated in C++20 [-Wdeprecated]1643 1009 | [=]() { kernel(m, n, k, use_thread_local); });1644 | ^1645/nix/store/2rq4fv67zqcgx3rm8a3q5yq3g2z8hrcp-eigen-3.4.1/include/eigen3/unsupported/Eigen/CXX11/src/Tensor/TensorContractionThreadPool.h:1009:13: note: add explicit 'this' or '*this' capture1646/nix/store/2rq4fv67zqcgx3rm8a3q5yq3g2z8hrcp-eigen-3.4.1/include/eigen3/unsupported/Eigen/CXX11/src/Tensor/TensorContractionThreadPool.h: In lambda function:1647/nix/store/2rq4fv67zqcgx3rm8a3q5yq3g2z8hrcp-eigen-3.4.1/include/eigen3/unsupported/Eigen/CXX11/src/Tensor/TensorContractionThreadPool.h:1063:15: warning: implicit capture of 'this' via '[=]' is deprecated in C++20 [-Wdeprecated]1648 1063 | [=]() { enqueue_packing_helper(mid, end, k, rhs); });1649 | ^1650/nix/store/2rq4fv67zqcgx3rm8a3q5yq3g2z8hrcp-eigen-3.4.1/include/eigen3/unsupported/Eigen/CXX11/src/Tensor/TensorContractionThreadPool.h:1063:15: note: add explicit 'this' or '*this' capture1651/nix/store/2rq4fv67zqcgx3rm8a3q5yq3g2z8hrcp-eigen-3.4.1/include/eigen3/unsupported/Eigen/CXX11/src/Tensor/TensorContractionThreadPool.h: In lambda function:1652/nix/store/2rq4fv67zqcgx3rm8a3q5yq3g2z8hrcp-eigen-3.4.1/include/eigen3/unsupported/Eigen/CXX11/src/Tensor/TensorContractionThreadPool.h:1082:15: warning: implicit capture of 'this' via '[=]' is deprecated in C++20 [-Wdeprecated]1653 1082 | [=]() { enqueue_packing_helper(start, end, k, rhs); });1654 | ^1655/nix/store/2rq4fv67zqcgx3rm8a3q5yq3g2z8hrcp-eigen-3.4.1/include/eigen3/unsupported/Eigen/CXX11/src/Tensor/TensorContractionThreadPool.h:1082:15: note: add explicit 'this' or '*this' capture1656[ 57%] Building CXX object CMakeFiles/onnxruntime_providers.dir/build/source/onnxruntime/core/providers/cpu/math/cumprod.cc.o1657[ 57%] Building CXX object CMakeFiles/onnxruntime_providers.dir/build/source/onnxruntime/core/providers/cpu/math/cumsum.cc.o1658[ 57%] Building CXX object CMakeFiles/onnxruntime_optimizer.dir/build/source/onnxruntime/core/optimizer/qdq_transformer/weight_bias_quantization.cc.o1659[ 57%] Building CXX object CMakeFiles/onnxruntime_providers.dir/build/source/onnxruntime/core/providers/cpu/math/det.cc.o1660[ 57%] Building CXX object CMakeFiles/onnxruntime_providers.dir/build/source/onnxruntime/core/providers/cpu/math/einsum.cc.o1661[ 57%] Building CXX object CMakeFiles/onnxruntime_providers.dir/build/source/onnxruntime/core/providers/cpu/math/einsum_utils/einsum_auxiliary_ops.cc.o1662[ 57%] Building CXX object CMakeFiles/onnxruntime_providers.dir/build/source/onnxruntime/core/providers/cpu/math/einsum_utils/einsum_compute_preprocessor.cc.o1663[ 57%] Building CXX object CMakeFiles/onnxruntime_optimizer.dir/build/source/onnxruntime/core/optimizer/qdq_transformer/where_dummy_dq.cc.o1664[ 57%] Building CXX object CMakeFiles/onnxruntime_optimizer.dir/build/source/onnxruntime/core/optimizer/quick_gelu_fusion.cc.o1665[ 57%] Building CXX object CMakeFiles/onnxruntime_providers.dir/build/source/onnxruntime/core/providers/cpu/math/einsum_utils/einsum_typed_compute_processor.cc.o1666[ 57%] Building CXX object CMakeFiles/onnxruntime_optimizer.dir/build/source/onnxruntime/core/optimizer/relu_clip_fusion.cc.o1667[ 57%] Building CXX object CMakeFiles/onnxruntime_providers.dir/build/source/onnxruntime/core/providers/cpu/math/element_wise_ops.cc.o1668[ 57%] Building CXX object CMakeFiles/onnxruntime_optimizer.dir/build/source/onnxruntime/core/optimizer/reshape_fusion.cc.o1669[ 57%] Building CXX object CMakeFiles/onnxruntime_optimizer.dir/build/source/onnxruntime/core/optimizer/rule_based_graph_transformer.cc.o1670[ 57%] Building CXX object CMakeFiles/onnxruntime_optimizer.dir/build/source/onnxruntime/core/optimizer/selection_and_optimization_func.cc.o1671[ 57%] Building CXX object CMakeFiles/onnxruntime_optimizer.dir/build/source/onnxruntime/core/optimizer/selectors_actions/actions.cc.o1672[ 57%] Building CXX object CMakeFiles/onnxruntime_optimizer.dir/build/source/onnxruntime/core/optimizer/selectors_actions/helpers.cc.o1673[ 57%] Building CXX object CMakeFiles/onnxruntime_optimizer.dir/build/source/onnxruntime/core/optimizer/selectors_actions/selector_action_transformer.cc.o1674[ 57%] Building CXX object CMakeFiles/onnxruntime_optimizer.dir/build/source/onnxruntime/core/optimizer/skip_layer_norm_fusion.cc.o1675[ 57%] Building CXX object CMakeFiles/onnxruntime_optimizer.dir/build/source/onnxruntime/core/optimizer/slice_concat_to_space_to_depth_fusion.cc.o1676[ 58%] Building CXX object CMakeFiles/onnxruntime_providers.dir/build/source/onnxruntime/core/providers/cpu/math/gemm.cc.o1677[ 58%] Building CXX object CMakeFiles/onnxruntime_framework.dir/build/source/onnxruntime/core/framework/session_state.cc.o1678[ 58%] Building CXX object CMakeFiles/onnxruntime_providers.dir/build/source/onnxruntime/core/providers/cpu/math/hardmax.cc.o1679[ 58%] Building CXX object CMakeFiles/onnxruntime_framework.dir/build/source/onnxruntime/core/framework/session_state_utils.cc.o1680[ 58%] Building CXX object CMakeFiles/onnxruntime_framework.dir/build/source/onnxruntime/core/framework/simple_tensor_allocator.cc.o1681[ 58%] Building CXX object CMakeFiles/onnxruntime_framework.dir/build/source/onnxruntime/core/framework/sparse_tensor.cc.o1682[ 58%] Building CXX object CMakeFiles/onnxruntime_framework.dir/build/source/onnxruntime/core/framework/sparse_utils.cc.o1683[ 58%] Building CXX object CMakeFiles/onnxruntime_providers.dir/build/source/onnxruntime/core/providers/cpu/math/matmul.cc.o1684[ 59%] Building CXX object CMakeFiles/onnxruntime_framework.dir/build/source/onnxruntime/core/framework/stream_execution_context.cc.o1685[ 60%] Building CXX object CMakeFiles/onnxruntime_optimizer.dir/build/source/onnxruntime/core/optimizer/slice_elimination.cc.o1686[ 60%] Building CXX object CMakeFiles/onnxruntime_providers.dir/build/source/onnxruntime/core/providers/cpu/math/round.cc.o1687[ 60%] Building CXX object CMakeFiles/onnxruntime_providers.dir/build/source/onnxruntime/core/providers/cpu/math/sign.cc.o1688[ 60%] Building CXX object CMakeFiles/onnxruntime_framework.dir/build/source/onnxruntime/core/framework/stream_handles.cc.o1689[ 60%] Building CXX object CMakeFiles/onnxruntime_framework.dir/build/source/onnxruntime/core/framework/tensor.cc.o1690[ 60%] Building CXX object CMakeFiles/onnxruntime_framework.dir/build/source/onnxruntime/core/framework/tensor_allocator.cc.o1691[ 60%] Building CXX object CMakeFiles/onnxruntime_framework.dir/build/source/onnxruntime/core/framework/tensor_external_data_info.cc.o1692[ 60%] Building CXX object CMakeFiles/onnxruntime_framework.dir/build/source/onnxruntime/core/framework/tensor_shape.cc.o1693[ 60%] Building CXX object CMakeFiles/onnxruntime_framework.dir/build/source/onnxruntime/core/framework/tensor_type_and_shape.cc.o1694[ 60%] Building CXX object CMakeFiles/onnxruntime_providers.dir/build/source/onnxruntime/core/providers/cpu/math/softmax.cc.o1695[ 60%] Building CXX object CMakeFiles/onnxruntime_optimizer.dir/build/source/onnxruntime/core/optimizer/stft_decomposition.cc.o1696[ 60%] Building CXX object CMakeFiles/onnxruntime_providers.dir/build/source/onnxruntime/core/providers/cpu/math/softmax_shared.cc.o1697make[2]: *** [CMakeFiles/onnxruntime_optimizer.dir/build.make:1423: CMakeFiles/onnxruntime_optimizer.dir/build/source/onnxruntime/core/optimizer/transformer_memcpy.cc.o] Aborted (core dumped)1698make[2]: *** Waiting for unfinished jobs....1699/build/source/onnxruntime/core/providers/cpu/math/gemm.cc:475:1: fatal error: error writing to /build/ccOWuaUm.s: No space left on device1700 475 | } // namespace onnxruntime1701 | ^1702compilation terminated.1703make[2]: *** [CMakeFiles/onnxruntime_providers.dir/build.make:513: CMakeFiles/onnxruntime_providers.dir/build/source/onnxruntime/core/providers/cpu/math/gemm.cc.o] Error 11704lto1: fatal error: error writing to /build/ccvGBvH4.s: No space left on device1705compilation terminated.1706make[3]: *** [/build/cc3FFYQR.mk:90: /build/ccLYOF8a.ltrans44.ltrans.o] Error 11707make[3]: *** Waiting for unfinished jobs....1708lto1: fatal error: error writing to /build/cczb4rgL.s: No space left on device1709compilation terminated.1710make[3]: *** [/build/cc3FFYQR.mk:88: /build/ccLYOF8a.ltrans43.ltrans.o] Error 11711lto1: fatal error: error writing to /build/cc52qYzt.s: No space left on device1712compilation terminated.1713make[3]: *** [/build/cc3FFYQR.mk:92: /build/ccLYOF8a.ltrans45.ltrans.o] Error 11714make[2]: *** [CMakeFiles/onnxruntime_framework.dir/build.make:1073: CMakeFiles/onnxruntime_framework.dir/build/source/onnxruntime/core/framework/tensor_allocator.cc.o] Error 11715make[2]: *** [CMakeFiles/onnxruntime_providers.dir/build.make:569: CMakeFiles/onnxruntime_providers.dir/build/source/onnxruntime/core/providers/cpu/math/sign.cc.o] Error 11716/build/source/onnxruntime/core/optimizer/stft_decomposition.cc:416:1: fatal error: error writing to /build/ccgGMdZG.s: No space left on device1717 416 | } // namespace onnxruntime1718 | ^1719compilation terminated.1720make[2]: *** [CMakeFiles/onnxruntime_optimizer.dir/build.make:1409: CMakeFiles/onnxruntime_optimizer.dir/build/source/onnxruntime/core/optimizer/stft_decomposition.cc.o] Error 11721make[1]: *** [CMakeFiles/Makefile2:1625: CMakeFiles/onnxruntime_optimizer.dir/all] Error 21722make[1]: *** Waiting for unfinished jobs....1723lto-wrapper: fatal error: make returned 2 exit status1724compilation terminated.1725/nix/store/y6ri2r743ckh5kk160r461czl9n2f2wf-binutils-2.46/bin/ld.bfd: error: lto-wrapper failed1726collect2: error: ld returned 1 exit status1727make[2]: *** [CMakeFiles/onnxruntime_mlas_test.dir/build.make:827: onnxruntime_mlas_test] Error 11728make[1]: *** [CMakeFiles/Makefile2:3153: CMakeFiles/onnxruntime_mlas_test.dir/all] Error 21729make[1]: *** [CMakeFiles/Makefile2:1378: CMakeFiles/onnxruntime_framework.dir/all] Error 21730make[1]: *** [CMakeFiles/Makefile2:1445: CMakeFiles/onnxruntime_providers.dir/all] Error 21731make: *** [Makefile:146: all] Error 2