setup
checks.aarch64-darwin.package-queue
· build #48
· raw
1this derivation will be built:2 /nix/store/7kd676hfgnyq63sqjfnk68jwiidjd1sj-queue-0.1.0.drv3error: build of '/nix/store/7kd676hfgnyq63sqjfnk68jwiidjd1sj-queue-0.1.0.drv' on 'ssh-ng://customer@mac02' failed: Cannot build '/nix/store/7kd676hfgnyq63sqjfnk68jwiidjd1sj-queue-0.1.0.drv'.4 Reason: builder failed with exit code 101.5 Output paths:6 /nix/store/24xdjaycw8bjsgxsrwd6rzkk2ys84lyq-queue-0.1.07 Last 25 log lines:8 > test task_ids_are_not_reused ... FAILED9 >10 > failures:11 >12 > ---- old_delivered_tasks_are_cleaned stdout ----13 >14 > thread 'old_delivered_tasks_are_cleaned' (126981378) panicked at tests/ids.rs:50:9:15 > queue run failed: queue: pueue daemon did not come up within 5s16 >17 > note: run with `RUST_BACKTRACE=1` environment variable to display a backtrace18 >19 > ---- task_ids_are_not_reused stdout ----20 >21 > thread 'task_ids_are_not_reused' (126981379) panicked at tests/ids.rs:50:9:22 > queue run failed: queue: pueue daemon did not come up within 5s23 >24 >25 >26 > failures:27 > old_delivered_tasks_are_cleaned28 > task_ids_are_not_reused29 >30 > test result: FAILED. 0 passed; 2 failed; 0 ignored; 0 measured; 0 filtered out; finished in 10.89s31 >32 > error: test failed, to rerun pass `--test ids`33 For full logs, run:34 nix log /nix/store/7kd676hfgnyq63sqjfnk68jwiidjd1sj-queue-0.1.0.drv35error: Cannot build '/nix/store/7kd676hfgnyq63sqjfnk68jwiidjd1sj-queue-0.1.0.drv'.36 Reason: builder failed with exit code 1.37 Output paths:38 /nix/store/24xdjaycw8bjsgxsrwd6rzkk2ys84lyq-queue-0.1.0