nixbot

builds

Mic92/nix-grpc-store build #135 failed

branch farm/hook · PR #53 · commit 279fbdce27 · · took 1m 10s · eval 14s

eval warnings 1 kind · 4 occurrences
  • warn getExe: Package "niks3-1.10.1" does not have the meta.mainProgram attribute. We'll assume that the main program has the same name for now, but this behavior is deprecated, because it leads to surprising errors when the assumption does not hold. If the package has a main program, please set `meta.mainProgram` in its definition to make this warning go away. Otherwise, if the package does not have a main program, or if you don't control its definition, use getExe' to specify the name to the progra… ×4

2 failed
failed attributes
status attribute duration
failed checks.aarch64-linux.clang-tidy 59s
nix-grpc-store-clang-tidy-0.1.0: 14 | builder.AddChannelArgument(GRPC_ARG_KEEPALIVE_PERMIT_WITHOUT_CALLS, 1); | ^ .. …
nix-grpc-store-clang-tidy-0.1.0:
   14 |     builder.AddChannelArgument(GRPC_ARG_KEEPALIVE_PERMIT_WITHOUT_CALLS, 1);
      |                                ^
../src/nix-grpc-daemon.cc:1289:32: error: no header providing "GRPC_ARG_HTTP2_MIN_RECV_PING_INTERVAL_WITHOUT_DATA_MS" is directly included [misc-include-cleaner,-warnings-as-errors]
 1289 |     builder.AddChannelArgument(GRPC_ARG_HTTP2_MIN_RECV_PING_INTERVAL_WITHOUT_DATA_MS, minPingIntervalMs);
      |                                ^
FAILED: [code=1] meson-internal__clang-tidy 
/nix/store/4nhp26ss88i238s986fx3jcqcw4si9ly-meson-1.10.2/bin/meson --internal clangtidy /build/source /build/source/build --color always
ninja: build stopped: subcommand failed.
failed checks.x86_64-linux.clang-tidy 34s
nix-grpc-store-clang-tidy-0.1.0: 14 | builder.AddChannelArgument(GRPC_ARG_KEEPALIVE_PERMIT_WITHOUT_CALLS, 1); | ^ .. …
nix-grpc-store-clang-tidy-0.1.0:
   14 |     builder.AddChannelArgument(GRPC_ARG_KEEPALIVE_PERMIT_WITHOUT_CALLS, 1);
      |                                ^
../src/nix-grpc-daemon.cc:1289:32: error: no header providing "GRPC_ARG_HTTP2_MIN_RECV_PING_INTERVAL_WITHOUT_DATA_MS" is directly included [misc-include-cleaner,-warnings-as-errors]
 1289 |     builder.AddChannelArgument(GRPC_ARG_HTTP2_MIN_RECV_PING_INTERVAL_WITHOUT_DATA_MS, minPingIntervalMs);
      |                                ^
FAILED: [code=1] meson-internal__clang-tidy 
/nix/store/azf6s3lpx8f53si93y8135mpyykjj72b-meson-1.10.2/bin/meson --internal clangtidy /build/source /build/source/build --color always
ninja: build stopped: subcommand failed.
18 cancelled ⚠ 2
cancelled attributes
status attribute duration
cancelled checks.aarch64-linux.farm
  • getExe: Package "niks3-1.10.1" does not have the meta.mainProgram attribute. We'll assume that the main program has the same name for now, but this behavior is deprecated, because it leads to surprising errors when the assumption does not hold. If the package has a main program, please set `meta.mainProgram` in its definition to make this warning go away. Otherwise, if the package does not have a main program, or if you don't control its definition, use getExe' to specify the name to the program, such as lib.getExe' foo "bar".
  • getExe: Package "niks3-1.10.1" does not have the meta.mainProgram attribute. We'll assume that the main program has the same name for now, but this behavior is deprecated, because it leads to surprising errors when the assumption does not hold. If the package has a main program, please set `meta.mainProgram` in its definition to make this warning go away. Otherwise, if the package does not have a main program, or if you don't control its definition, use getExe' to specify the name to the program, such as lib.getExe' foo "bar".
cancelled checks.x86_64-linux.farm
  • getExe: Package "niks3-1.10.1" does not have the meta.mainProgram attribute. We'll assume that the main program has the same name for now, but this behavior is deprecated, because it leads to surprising errors when the assumption does not hold. If the package has a main program, please set `meta.mainProgram` in its definition to make this warning go away. Otherwise, if the package does not have a main program, or if you don't control its definition, use getExe' to specify the name to the program, such as lib.getExe' foo "bar".
  • getExe: Package "niks3-1.10.1" does not have the meta.mainProgram attribute. We'll assume that the main program has the same name for now, but this behavior is deprecated, because it leads to surprising errors when the assumption does not hold. If the package has a main program, please set `meta.mainProgram` in its definition to make this warning go away. Otherwise, if the package does not have a main program, or if you don't control its definition, use getExe' to specify the name to the program, such as lib.getExe' foo "bar".
26s
cancelled checks.aarch64-darwin.clang-tidy 1m 4s
cancelled checks.aarch64-darwin.exit-stress 1m 4s
cancelled checks.aarch64-darwin.plugin-dispatcher
cancelled checks.aarch64-darwin.plugin-nix_2_31 1m 4s
cancelled checks.aarch64-darwin.plugin-nix_2_34 1m 4s
cancelled checks.aarch64-darwin.plugin-nix_2_35 1m 4s
cancelled checks.aarch64-linux.acme-vm
cancelled checks.aarch64-linux.exit-stress 1m 4s
cancelled checks.aarch64-linux.plugin-dispatcher
cancelled checks.aarch64-linux.plugin-nix_2_31 1m 4s
cancelled checks.aarch64-linux.plugin-nix_2_34 1m 4s
cancelled checks.aarch64-linux.plugin-nix_2_35 1m 4s
cancelled checks.aarch64-linux.vm
cancelled checks.x86_64-linux.acme-vm 26s
cancelled checks.x86_64-linux.exit-stress 1m 4s
cancelled checks.x86_64-linux.vm 26s
8 succeeded
succeeded attributes
status attribute duration
loading…
3 already built
skipped attributes
status attribute duration
loading…