nixbot

builds

Mic92/nix-grpc-store build #136 failed

branch farm/hook · PR #53 · commit e02360d5c2 · · took 1m 58s · eval 13s

eval warnings 1 kind · 4 occurrences
  • warn getExe: Package "niks3-1.10.1" does not have the meta.mainProgram attribute. We'll assume that the main program has the same name for now, but this behavior is deprecated, because it leads to surprising errors when the assumption does not hold. If the package has a main program, please set `meta.mainProgram` in its definition to make this warning go away. Otherwise, if the package does not have a main program, or if you don't control its definition, use getExe' to specify the name to the progra… ×4

5 failed ⚠ 2
failed attributes
status attribute duration
failed checks.aarch64-linux.farm
  • getExe: Package "niks3-1.10.1" does not have the meta.mainProgram attribute. We'll assume that the main program has the same name for now, but this behavior is deprecated, because it leads to surprising errors when the assumption does not hold. If the package has a main program, please set `meta.mainProgram` in its definition to make this warning go away. Otherwise, if the package does not have a main program, or if you don't control its definition, use getExe' to specify the name to the program, such as lib.getExe' foo "bar".
  • getExe: Package "niks3-1.10.1" does not have the meta.mainProgram attribute. We'll assume that the main program has the same name for now, but this behavior is deprecated, because it leads to surprising errors when the assumption does not hold. If the package has a main program, please set `meta.mainProgram` in its definition to make this warning go away. Otherwise, if the package does not have a main program, or if you don't control its definition, use getExe' to specify the name to the program, such as lib.getExe' foo "bar".
1m 40s
vm-test-run-nix-grpc-farm: worker1 # qemu-system-aarch64: terminating on signal 15 from pid 39 (/nix/store/lfh101cfjj8p8npcari9hk0lbqi33yvh-python3-3.14.7/bin/p …
vm-test-run-nix-grpc-farm:
worker1 # qemu-system-aarch64: terminating on signal 15 from pid 39 (/nix/store/lfh101cfjj8p8npcari9hk0lbqi33yvh-python3-3.14.7/bin/python3.14)
kill QemuMachine (pid 54)
worker2 # qemu-system-aarch64: terminating on signal 15 from pid 39 (/nix/store/lfh101cfjj8p8npcari9hk0lbqi33yvh-python3-3.14.7/bin/python3.14)
(finished: cleanup, in 1.11 seconds)
additionally exposed symbols:
    cache, client, lb, worker1, worker2,
    vlan1,
    start_all, test_script, machines, machines_qemu, machines_nspawn, vlans, driver, log, os, create_machine, subtest, run_tests, join_all, retry, serial_stdout_off, serial_stdout_on, polling_condition, BaseMachine, QemuMachine, NspawnMachine, t, debug, dump_machine_ssh
failed checks.x86_64-linux.farm
  • getExe: Package "niks3-1.10.1" does not have the meta.mainProgram attribute. We'll assume that the main program has the same name for now, but this behavior is deprecated, because it leads to surprising errors when the assumption does not hold. If the package has a main program, please set `meta.mainProgram` in its definition to make this warning go away. Otherwise, if the package does not have a main program, or if you don't control its definition, use getExe' to specify the name to the program, such as lib.getExe' foo "bar".
  • getExe: Package "niks3-1.10.1" does not have the meta.mainProgram attribute. We'll assume that the main program has the same name for now, but this behavior is deprecated, because it leads to surprising errors when the assumption does not hold. If the package has a main program, please set `meta.mainProgram` in its definition to make this warning go away. Otherwise, if the package does not have a main program, or if you don't control its definition, use getExe' to specify the name to the program, such as lib.getExe' foo "bar".
0s
vm-test-run-nix-grpc-farm: tribuchet: building on jamie tribuchet worker error: build cancelled
vm-test-run-nix-grpc-farm:
tribuchet: building on jamie
tribuchet worker error: build cancelled
failed checks.aarch64-darwin.clang-tidy 1m 26s
nix-grpc-store-clang-tidy-0.1.0: 14 | builder.AddChannelArgument(GRPC_ARG_KEEPALIVE_PERMIT_WITHOUT_CALLS, 1); | ^ .. …
nix-grpc-store-clang-tidy-0.1.0:
   14 |     builder.AddChannelArgument(GRPC_ARG_KEEPALIVE_PERMIT_WITHOUT_CALLS, 1);
      |                                ^
../src/nix-grpc-daemon.cc:1289:32: error: no header providing "GRPC_ARG_HTTP2_MIN_RECV_PING_INTERVAL_WITHOUT_DATA_MS" is directly included [misc-include-cleaner,-warnings-as-errors]
 1289 |     builder.AddChannelArgument(GRPC_ARG_HTTP2_MIN_RECV_PING_INTERVAL_WITHOUT_DATA_MS, minPingIntervalMs);
      |                                ^
FAILED: [code=1] meson-internal__clang-tidy 
/nix/store/735yy09gy9j1wzwrsd1v1xrgf6izyr5d-meson-1.10.2/bin/meson --internal clangtidy /nix/var/nix/builds/nix-23664-3936447213/source /nix/var/nix/builds/nix-23664-3936447213/source/build --color always
ninja: build stopped: subcommand failed.
failed checks.aarch64-linux.clang-tidy 1m 9s
nix-grpc-store-clang-tidy-0.1.0: 14 | builder.AddChannelArgument(GRPC_ARG_KEEPALIVE_PERMIT_WITHOUT_CALLS, 1); | ^ .. …
nix-grpc-store-clang-tidy-0.1.0:
   14 |     builder.AddChannelArgument(GRPC_ARG_KEEPALIVE_PERMIT_WITHOUT_CALLS, 1);
      |                                ^
../src/nix-grpc-daemon.cc:1289:32: error: no header providing "GRPC_ARG_HTTP2_MIN_RECV_PING_INTERVAL_WITHOUT_DATA_MS" is directly included [misc-include-cleaner,-warnings-as-errors]
 1289 |     builder.AddChannelArgument(GRPC_ARG_HTTP2_MIN_RECV_PING_INTERVAL_WITHOUT_DATA_MS, minPingIntervalMs);
      |                                ^
FAILED: [code=1] meson-internal__clang-tidy 
/nix/store/4nhp26ss88i238s986fx3jcqcw4si9ly-meson-1.10.2/bin/meson --internal clangtidy /build/source /build/source/build --color always
ninja: build stopped: subcommand failed.
failed checks.x86_64-linux.clang-tidy 53s
nix-grpc-store-clang-tidy-0.1.0: 14 | builder.AddChannelArgument(GRPC_ARG_KEEPALIVE_PERMIT_WITHOUT_CALLS, 1); | ^ .. …
nix-grpc-store-clang-tidy-0.1.0:
   14 |     builder.AddChannelArgument(GRPC_ARG_KEEPALIVE_PERMIT_WITHOUT_CALLS, 1);
      |                                ^
../src/nix-grpc-daemon.cc:1289:32: error: no header providing "GRPC_ARG_HTTP2_MIN_RECV_PING_INTERVAL_WITHOUT_DATA_MS" is directly included [misc-include-cleaner,-warnings-as-errors]
 1289 |     builder.AddChannelArgument(GRPC_ARG_HTTP2_MIN_RECV_PING_INTERVAL_WITHOUT_DATA_MS, minPingIntervalMs);
      |                                ^
FAILED: [code=1] meson-internal__clang-tidy 
/nix/store/azf6s3lpx8f53si93y8135mpyykjj72b-meson-1.10.2/bin/meson --internal clangtidy /build/source /build/source/build --color always
ninja: build stopped: subcommand failed.
15 succeeded
succeeded attributes
status attribute duration
loading…
11 already built
skipped attributes
status attribute duration
loading…