nixbot

builds

Mic92/nix-grpc-store build #152 failed

branch farm/hook · PR #53 · commit 0f36757ac4 · · took 4m 47s · eval 19s

eval warnings 1 kind · 4 occurrences
  • warn getExe: Package "niks3-1.10.1" does not have the meta.mainProgram attribute. We'll assume that the main program has the same name for now, but this behavior is deprecated, because it leads to surprising errors when the assumption does not hold. If the package has a main program, please set `meta.mainProgram` in its definition to make this warning go away. Otherwise, if the package does not have a main program, or if you don't control its definition, use getExe' to specify the name to the progra… ×4

3 failed
failed attributes
status attribute duration
failed checks.aarch64-darwin.clang-tidy 59s
nix-grpc-store-clang-tidy-0.1.0: >>> /nix/store/d8f8g6pnqn4rn18ma7341afkdk0hbj07-clang-tools-22.1.8/bin/clang-tidy --use-color -quiet -p /nix/var/nix/builds/nix …
nix-grpc-store-clang-tidy-0.1.0:
>>> /nix/store/d8f8g6pnqn4rn18ma7341afkdk0hbj07-clang-tools-22.1.8/bin/clang-tidy --use-color -quiet -p /nix/var/nix/builds/nix-23742-1301203827/source/build /nix/var/nix/builds/nix-23742-1301203827/source/src/grpc-store.cc
Errors encountered while running clang-tidy
../src/grpc-store.cc:246:63: error: 5 is a magic number; consider replacing it with a named constant [cppcoreguidelines-avoid-magic-numbers,readability-magic-numbers,-warnings-as-errors]
  246 |         std::this_thread::sleep_for(std::chrono::milliseconds(5));
      |                                                               ^
FAILED: [code=1] meson-internal__clang-tidy 
/nix/store/735yy09gy9j1wzwrsd1v1xrgf6izyr5d-meson-1.10.2/bin/meson --internal clangtidy /nix/var/nix/builds/nix-23742-1301203827/source /nix/var/nix/builds/nix-23742-1301203827/source/build --color always
ninja: build stopped: subcommand failed.
failed checks.aarch64-linux.clang-tidy 1m 16s
nix-grpc-store-clang-tidy-0.1.0: >>> /nix/store/c33s2mld9r03fv11v9ad7dh5m9g8s1xp-clang-tools-22.1.8/bin/clang-tidy --use-color -quiet -p /build/source/build /bu …
nix-grpc-store-clang-tidy-0.1.0:
>>> /nix/store/c33s2mld9r03fv11v9ad7dh5m9g8s1xp-clang-tools-22.1.8/bin/clang-tidy --use-color -quiet -p /build/source/build /build/source/src/grpc-store.cc
Errors encountered while running clang-tidy
../src/grpc-store.cc:246:63: error: 5 is a magic number; consider replacing it with a named constant [cppcoreguidelines-avoid-magic-numbers,readability-magic-numbers,-warnings-as-errors]
  246 |         std::this_thread::sleep_for(std::chrono::milliseconds(5));
      |                                                               ^
FAILED: [code=1] meson-internal__clang-tidy 
/nix/store/4nhp26ss88i238s986fx3jcqcw4si9ly-meson-1.10.2/bin/meson --internal clangtidy /build/source /build/source/build --color always
ninja: build stopped: subcommand failed.
failed checks.x86_64-linux.clang-tidy 54s
nix-grpc-store-clang-tidy-0.1.0: >>> /nix/store/ck7w6mnxgy91d7kl1l3c531904k2nhk1-clang-tools-22.1.8/bin/clang-tidy --use-color -quiet -p /build/source/build /bu …
nix-grpc-store-clang-tidy-0.1.0:
>>> /nix/store/ck7w6mnxgy91d7kl1l3c531904k2nhk1-clang-tools-22.1.8/bin/clang-tidy --use-color -quiet -p /build/source/build /build/source/src/grpc-store.cc
Errors encountered while running clang-tidy
../src/grpc-store.cc:246:63: error: 5 is a magic number; consider replacing it with a named constant [cppcoreguidelines-avoid-magic-numbers,readability-magic-numbers,-warnings-as-errors]
  246 |         std::this_thread::sleep_for(std::chrono::milliseconds(5));
      |                                                               ^
FAILED: [code=1] meson-internal__clang-tidy 
/nix/store/azf6s3lpx8f53si93y8135mpyykjj72b-meson-1.10.2/bin/meson --internal clangtidy /build/source /build/source/build --color always
ninja: build stopped: subcommand failed.
24 succeeded ⚠ 2
succeeded attributes
status attribute duration
succeeded checks.aarch64-linux.farm
  • getExe: Package "niks3-1.10.1" does not have the meta.mainProgram attribute. We'll assume that the main program has the same name for now, but this behavior is deprecated, because it leads to surprising errors when the assumption does not hold. If the package has a main program, please set `meta.mainProgram` in its definition to make this warning go away. Otherwise, if the package does not have a main program, or if you don't control its definition, use getExe' to specify the name to the program, such as lib.getExe' foo "bar".
  • getExe: Package "niks3-1.10.1" does not have the meta.mainProgram attribute. We'll assume that the main program has the same name for now, but this behavior is deprecated, because it leads to surprising errors when the assumption does not hold. If the package has a main program, please set `meta.mainProgram` in its definition to make this warning go away. Otherwise, if the package does not have a main program, or if you don't control its definition, use getExe' to specify the name to the program, such as lib.getExe' foo "bar".
2m 38s
succeeded checks.x86_64-linux.farm
  • getExe: Package "niks3-1.10.1" does not have the meta.mainProgram attribute. We'll assume that the main program has the same name for now, but this behavior is deprecated, because it leads to surprising errors when the assumption does not hold. If the package has a main program, please set `meta.mainProgram` in its definition to make this warning go away. Otherwise, if the package does not have a main program, or if you don't control its definition, use getExe' to specify the name to the program, such as lib.getExe' foo "bar".
  • getExe: Package "niks3-1.10.1" does not have the meta.mainProgram attribute. We'll assume that the main program has the same name for now, but this behavior is deprecated, because it leads to surprising errors when the assumption does not hold. If the package has a main program, please set `meta.mainProgram` in its definition to make this warning go away. Otherwise, if the package does not have a main program, or if you don't control its definition, use getExe' to specify the name to the program, such as lib.getExe' foo "bar".
2m 11s
succeeded checks.aarch64-darwin.exit-stress 1m 55s
succeeded checks.aarch64-darwin.plugin-dispatcher 5s
succeeded checks.aarch64-darwin.plugin-nix_2_31 1m 17s
succeeded checks.aarch64-darwin.plugin-nix_2_34 1m 15s
succeeded checks.aarch64-darwin.plugin-nix_2_35 1m 16s
succeeded checks.aarch64-linux.acme-vm 46s
succeeded checks.aarch64-linux.exit-stress 2m 44s
succeeded checks.aarch64-linux.fuzz 43s
succeeded checks.aarch64-linux.plugin-dispatcher 1s
succeeded checks.aarch64-linux.plugin-nix_2_31 1m 57s
succeeded checks.aarch64-linux.plugin-nix_2_34 1m 57s
succeeded checks.aarch64-linux.plugin-nix_2_35 1m 58s
succeeded checks.aarch64-linux.sanitize-smoke 1m 32s
succeeded checks.aarch64-linux.vm 1m 50s
succeeded checks.x86_64-linux.acme-vm 47s
succeeded checks.x86_64-linux.exit-stress 1m 57s
succeeded checks.x86_64-linux.fuzz 31s
succeeded checks.x86_64-linux.plugin-dispatcher 1s
succeeded checks.x86_64-linux.plugin-nix_2_31 1m 14s
succeeded checks.x86_64-linux.plugin-nix_2_34 1m 14s
succeeded checks.x86_64-linux.sanitize-smoke 1m 15s
succeeded checks.x86_64-linux.vm 1m 35s
4 already built
skipped attributes
status attribute duration
loading…