nixbot

builds

Mic92/nix-grpc-store build #153 failed

branch farm/hook · PR #53 · commit 8d158d9808 · · took 4m 46s · eval 18s

eval warnings 1 kind · 4 occurrences
  • warn getExe: Package "niks3-1.10.1" does not have the meta.mainProgram attribute. We'll assume that the main program has the same name for now, but this behavior is deprecated, because it leads to surprising errors when the assumption does not hold. If the package has a main program, please set `meta.mainProgram` in its definition to make this warning go away. Otherwise, if the package does not have a main program, or if you don't control its definition, use getExe' to specify the name to the progra… ×4

3 failed
failed attributes
status attribute duration
failed checks.aarch64-darwin.clang-tidy 59s
nix-grpc-store-clang-tidy-0.1.0: 247 | std::this_thread::sleep_for(5ms); | ^ ../src/grpc-store.cc:247:38: er …
nix-grpc-store-clang-tidy-0.1.0:
  247 |         std::this_thread::sleep_for(5ms);
      |                                     ^
../src/grpc-store.cc:247:38: error: no header providing "std::operator""ms" is directly included [misc-include-cleaner,-warnings-as-errors]
  247 |         std::this_thread::sleep_for(5ms);
      |                                      ^
FAILED: [code=1] meson-internal__clang-tidy 
/nix/store/735yy09gy9j1wzwrsd1v1xrgf6izyr5d-meson-1.10.2/bin/meson --internal clangtidy /nix/var/nix/builds/nix-30252-869293163/source /nix/var/nix/builds/nix-30252-869293163/source/build --color always
ninja: build stopped: subcommand failed.
failed checks.aarch64-linux.clang-tidy 1m 15s
nix-grpc-store-clang-tidy-0.1.0: 13 | auto deadline = std::chrono::steady_clock::now() + 2s; | …
nix-grpc-store-clang-tidy-0.1.0:
   13 |       auto deadline = std::chrono::steady_clock::now() + 2s;
      |                                                           ^
../src/grpc-store.cc:247:38: error: no header providing "std::operator""ms" is directly included [misc-include-cleaner,-warnings-as-errors]
  247 |         std::this_thread::sleep_for(5ms);
      |                                      ^
FAILED: [code=1] meson-internal__clang-tidy 
/nix/store/4nhp26ss88i238s986fx3jcqcw4si9ly-meson-1.10.2/bin/meson --internal clangtidy /build/source /build/source/build --color always
ninja: build stopped: subcommand failed.
failed checks.x86_64-linux.clang-tidy 55s
nix-grpc-store-clang-tidy-0.1.0: 13 | auto deadline = std::chrono::steady_clock::now() + 2s; | …
nix-grpc-store-clang-tidy-0.1.0:
   13 |       auto deadline = std::chrono::steady_clock::now() + 2s;
      |                                                           ^
../src/grpc-store.cc:247:38: error: no header providing "std::operator""ms" is directly included [misc-include-cleaner,-warnings-as-errors]
  247 |         std::this_thread::sleep_for(5ms);
      |                                      ^
FAILED: [code=1] meson-internal__clang-tidy 
/nix/store/azf6s3lpx8f53si93y8135mpyykjj72b-meson-1.10.2/bin/meson --internal clangtidy /build/source /build/source/build --color always
ninja: build stopped: subcommand failed.
25 succeeded ⚠ 2
succeeded attributes
status attribute duration
succeeded checks.aarch64-linux.farm
  • getExe: Package "niks3-1.10.1" does not have the meta.mainProgram attribute. We'll assume that the main program has the same name for now, but this behavior is deprecated, because it leads to surprising errors when the assumption does not hold. If the package has a main program, please set `meta.mainProgram` in its definition to make this warning go away. Otherwise, if the package does not have a main program, or if you don't control its definition, use getExe' to specify the name to the program, such as lib.getExe' foo "bar".
  • getExe: Package "niks3-1.10.1" does not have the meta.mainProgram attribute. We'll assume that the main program has the same name for now, but this behavior is deprecated, because it leads to surprising errors when the assumption does not hold. If the package has a main program, please set `meta.mainProgram` in its definition to make this warning go away. Otherwise, if the package does not have a main program, or if you don't control its definition, use getExe' to specify the name to the program, such as lib.getExe' foo "bar".
2m 38s
succeeded checks.x86_64-linux.farm
  • getExe: Package "niks3-1.10.1" does not have the meta.mainProgram attribute. We'll assume that the main program has the same name for now, but this behavior is deprecated, because it leads to surprising errors when the assumption does not hold. If the package has a main program, please set `meta.mainProgram` in its definition to make this warning go away. Otherwise, if the package does not have a main program, or if you don't control its definition, use getExe' to specify the name to the program, such as lib.getExe' foo "bar".
  • getExe: Package "niks3-1.10.1" does not have the meta.mainProgram attribute. We'll assume that the main program has the same name for now, but this behavior is deprecated, because it leads to surprising errors when the assumption does not hold. If the package has a main program, please set `meta.mainProgram` in its definition to make this warning go away. Otherwise, if the package does not have a main program, or if you don't control its definition, use getExe' to specify the name to the program, such as lib.getExe' foo "bar".
2m 16s
succeeded checks.aarch64-darwin.exit-stress 1m 57s
succeeded checks.aarch64-darwin.plugin-dispatcher 0s
succeeded checks.aarch64-darwin.plugin-nix_2_31 1m 13s
succeeded checks.aarch64-darwin.plugin-nix_2_34 1m 16s
succeeded checks.aarch64-darwin.plugin-nix_2_35 1m 16s
succeeded checks.aarch64-linux.acme-vm 46s
succeeded checks.aarch64-linux.exit-stress 2m 44s
succeeded checks.aarch64-linux.fuzz 42s
succeeded checks.aarch64-linux.plugin-dispatcher 1s
succeeded checks.aarch64-linux.plugin-nix_2_31 1m 58s
succeeded checks.aarch64-linux.plugin-nix_2_34 1m 57s
succeeded checks.aarch64-linux.plugin-nix_2_35 1m 58s
succeeded checks.aarch64-linux.sanitize-smoke 1m 31s
succeeded checks.aarch64-linux.vm 1m 48s
succeeded checks.x86_64-linux.acme-vm 46s
succeeded checks.x86_64-linux.exit-stress 1m 56s
succeeded checks.x86_64-linux.fuzz 31s
succeeded checks.x86_64-linux.plugin-dispatcher 1s
succeeded checks.x86_64-linux.plugin-nix_2_31 1m 13s
succeeded checks.x86_64-linux.plugin-nix_2_34 1m 12s
succeeded checks.x86_64-linux.plugin-nix_2_35 1m 13s
succeeded checks.x86_64-linux.sanitize-smoke 1m 17s
succeeded checks.x86_64-linux.vm 1m 34s
3 already built
skipped attributes
status attribute duration
loading…