nixbot

builds

Mic92/nix-grpc-store build #160 failed

branch main · PR #56 · commit b563afdde7 · · took 6m 46s · eval 19s

6 failed
failed attributes
status attribute duration
failed checks.aarch64-darwin.clang-tidy 2m 37s
nix-grpc-store-clang-tidy-0.1.0: 45 | || info.st_mtim.tv_nsec != cur->mtime.tv_nsec) { | ~~~~ ^ ../src/daemon/token-file.hh: …
nix-grpc-store-clang-tidy-0.1.0:
   45 |             || info.st_mtim.tv_nsec != cur->mtime.tv_nsec) {
      |                ~~~~ ^
../src/daemon/token-file.hh:50:62: error: no member named 'st_mtim' in 'stat' [clang-diagnostic-error]
   50 |             *cur = {.token = std::move(token), .mtime = info.st_mtim, .ino = info.st_ino};
      |                                                         ~~~~ ^
FAILED: [code=1] meson-internal__clang-tidy 
/nix/store/735yy09gy9j1wzwrsd1v1xrgf6izyr5d-meson-1.10.2/bin/meson --internal clangtidy /nix/var/nix/builds/nix-26841-30986046/source /nix/var/nix/builds/nix-26841-30986046/source/build --color always
ninja: build stopped: subcommand failed.
failed checks.aarch64-darwin.exit-stress 54s
nix-grpc-store-0.1.0: | ~~~~ ^ ../src/daemon/token-file.hh:50:62: error: no member named 'st_mtim' in 'stat' 50 | *cur = {.t …
nix-grpc-store-0.1.0:
      |                ~~~~ ^
../src/daemon/token-file.hh:50:62: error: no member named 'st_mtim' in 'stat'
   50 |             *cur = {.token = std::move(token), .mtime = info.st_mtim, .ino = info.st_ino};
      |                                                         ~~~~ ^
3 errors generated.
[6/26] Compiling C++ object oidc-test.p/tests_oidc-test.cc.o
[7/26] Generating nix_remote_proto with a custom command
ninja: build stopped: subcommand failed.
dependency failed checks.aarch64-darwin.plugin-dispatcher
failed checks.aarch64-darwin.plugin-nix_2_31 54s
nix-grpc-store-0.1.0: | ~~~~ ^ ../src/daemon/token-file.hh:50:62: error: no member named 'st_mtim' in 'stat' 50 | *cur = {.t …
nix-grpc-store-0.1.0:
      |                ~~~~ ^
../src/daemon/token-file.hh:50:62: error: no member named 'st_mtim' in 'stat'
   50 |             *cur = {.token = std::move(token), .mtime = info.st_mtim, .ino = info.st_ino};
      |                                                         ~~~~ ^
3 errors generated.
[6/26] Compiling C++ object oidc-test.p/tests_oidc-test.cc.o
[7/26] Generating nix_remote_proto with a custom command
ninja: build stopped: subcommand failed.
failed checks.aarch64-darwin.plugin-nix_2_34 54s
nix-grpc-store-0.1.0: | ~~~~ ^ ../src/daemon/token-file.hh:50:62: error: no member named 'st_mtim' in 'stat' 50 | *cur = {.t …
nix-grpc-store-0.1.0:
      |                ~~~~ ^
../src/daemon/token-file.hh:50:62: error: no member named 'st_mtim' in 'stat'
   50 |             *cur = {.token = std::move(token), .mtime = info.st_mtim, .ino = info.st_ino};
      |                                                         ~~~~ ^
3 errors generated.
[6/26] Compiling C++ object oidc-test.p/tests_oidc-test.cc.o
[7/26] Generating nix_remote_proto with a custom command
ninja: build stopped: subcommand failed.
failed checks.aarch64-darwin.plugin-nix_2_35 54s
nix-grpc-store-0.1.0: | ~~~~ ^ ../src/daemon/token-file.hh:50:62: error: no member named 'st_mtim' in 'stat' 50 | *cur = {.t …
nix-grpc-store-0.1.0:
      |                ~~~~ ^
../src/daemon/token-file.hh:50:62: error: no member named 'st_mtim' in 'stat'
   50 |             *cur = {.token = std::move(token), .mtime = info.st_mtim, .ino = info.st_ino};
      |                                                         ~~~~ ^
3 errors generated.
[6/26] Compiling C++ object oidc-test.p/tests_oidc-test.cc.o
[7/26] Generating nix_remote_proto with a custom command
ninja: build stopped: subcommand failed.
22 succeeded
succeeded attributes
status attribute duration
loading…
3 already built
skipped attributes
status attribute duration
loading…