nixbot

builds

Mic92/nix-grpc-store build #161 failed

branch maiao.I90db74e9a5e2f97b6282d61f6110c0f22499e810 · PR #57 · commit 09ae6e579a · · took 2m 24s · eval 16s

4 failed
failed attributes
status attribute duration
failed checks.aarch64-darwin.exit-stress 2m 3s
nix-grpc-store-0.1.0: ../src/daemon/token-file.hh:50:62: error: no member named 'st_mtim' in 'stat' 50 | *cur = {.token = std::move(token), .mtim …
nix-grpc-store-0.1.0:
../src/daemon/token-file.hh:50:62: error: no member named 'st_mtim' in 'stat'
   50 |             *cur = {.token = std::move(token), .mtime = info.st_mtim, .ino = info.st_ino};
      |                                                         ~~~~ ^
3 errors generated.
[7/26] Precompiling header ../pch/client_pch.hh
[8/26] Precompiling header ../pch/daemon_pch.hh
[9/26] Compiling C++ object oidc-test.p/tests_oidc-test.cc.o
ninja: build stopped: subcommand failed.
dependency failed checks.aarch64-darwin.plugin-dispatcher
failed checks.aarch64-darwin.plugin-nix_2_34 35s
nix-grpc-store-0.1.0: | ~~~~ ^ ../src/daemon/token-file.hh:50:62: error: no member named 'st_mtim' in 'stat' 50 | *cur = {.t …
nix-grpc-store-0.1.0:
      |                ~~~~ ^
../src/daemon/token-file.hh:50:62: error: no member named 'st_mtim' in 'stat'
   50 |             *cur = {.token = std::move(token), .mtime = info.st_mtim, .ino = info.st_ino};
      |                                                         ~~~~ ^
3 errors generated.
[6/26] Compiling C++ object oidc-test.p/tests_oidc-test.cc.o
[7/26] Generating nix_remote_proto with a custom command
ninja: build stopped: subcommand failed.
failed checks.aarch64-darwin.plugin-nix_2_35 35s
nix-grpc-store-0.1.0: | ~~~~ ^ ../src/daemon/token-file.hh:50:62: error: no member named 'st_mtim' in 'stat' 50 | *cur = {.t …
nix-grpc-store-0.1.0:
      |                ~~~~ ^
../src/daemon/token-file.hh:50:62: error: no member named 'st_mtim' in 'stat'
   50 |             *cur = {.token = std::move(token), .mtime = info.st_mtim, .ino = info.st_ino};
      |                                                         ~~~~ ^
3 errors generated.
[6/26] Compiling C++ object oidc-test.p/tests_oidc-test.cc.o
[7/26] Generating nix_remote_proto with a custom command
ninja: build stopped: subcommand failed.
14 cancelled
cancelled attributes
status attribute duration
loading…
10 succeeded
succeeded attributes
status attribute duration
loading…
3 already built
skipped attributes
status attribute duration
loading…