nixbot

builds

Mic92/nix-grpc-store build #193 failed

branch maiao.I740d5a2446d5eb33d39c7c97e292d44e7d4e4c4e · PR #70 · commit 0c0a90e473 · · took 6m 49s · eval 19s

10 failed
failed attributes
status attribute duration
failed checks.aarch64-darwin.clang-tidy 6m 42s
nix-grpc-store-clang-tidy-0.1.0: 363 | #define printMsg(level, args...) printMsgUsing(logger, level, args) | ^ /nix/sto …
nix-grpc-store-clang-tidy-0.1.0:
  363 | #define printMsg(level, args...) printMsgUsing(logger, level, args)
      |                                  ^
/nix/store/77if9j7m3xkg4r6b1l9pnji871yyhif3-nix-util-2.36.0pre20260914_920f6956-dev/include/nix/util/logging.hh:359:9: note: expanded from macro 'printMsgUsing'
  359 |         if (__lvl <= nix::verbosity) {             \
      |         ^
FAILED: [code=1] meson-internal__clang-tidy 
/nix/store/735yy09gy9j1wzwrsd1v1xrgf6izyr5d-meson-1.10.2/bin/meson --internal clangtidy /nix/var/nix/builds/nix-65669-602803120/source /nix/var/nix/builds/nix-65669-602803120/source/build --color always
ninja: build stopped: subcommand failed.
failed checks.aarch64-darwin.exit-stress 2m 16s
nix-grpc-store-0.1.0: 414 | cfg.clients, 415 | cfg.inflight, 416 | presentCalls.load(), 417 | total, | ^~~ …
nix-grpc-store-0.1.0:
  414 |         cfg.clients,
  415 |         cfg.inflight,
  416 |         presentCalls.load(),
  417 |         total,
      |         ^~~~~
4 warnings generated.
[14/36] Compiling C++ object oidc-test.p/tests_oidc-test.cc.o
ninja: build stopped: subcommand failed.
dependency failed checks.aarch64-darwin.plugin-dispatcher
failed checks.aarch64-darwin.plugin-nix_2_31 4m 52s
nix-grpc-store-0.1.0: 414 | cfg.clients, 415 | cfg.inflight, 416 | presentCalls.load(), 417 | total, | ^~~ …
nix-grpc-store-0.1.0:
  414 |         cfg.clients,
  415 |         cfg.inflight,
  416 |         presentCalls.load(),
  417 |         total,
      |         ^~~~~
4 warnings generated.
[13/36] Compiling C++ object oidc-test.p/tests_oidc-test.cc.o
ninja: build stopped: subcommand failed.
failed checks.aarch64-darwin.plugin-nix_2_34 3m 34s
nix-grpc-store-0.1.0: 414 | cfg.clients, 415 | cfg.inflight, 416 | presentCalls.load(), 417 | total, | ^~~ …
nix-grpc-store-0.1.0:
  414 |         cfg.clients,
  415 |         cfg.inflight,
  416 |         presentCalls.load(),
  417 |         total,
      |         ^~~~~
4 warnings generated.
[15/36] Compiling C++ object oidc-test.p/tests_oidc-test.cc.o
ninja: build stopped: subcommand failed.
failed checks.aarch64-darwin.plugin-nix_2_35 4m 57s
nix-grpc-store-0.1.0: 414 | cfg.clients, 415 | cfg.inflight, 416 | presentCalls.load(), 417 | total, | ^~~ …
nix-grpc-store-0.1.0:
  414 |         cfg.clients,
  415 |         cfg.inflight,
  416 |         presentCalls.load(),
  417 |         total,
      |         ^~~~~
4 warnings generated.
[13/36] Compiling C++ object oidc-test.p/tests_oidc-test.cc.o
ninja: build stopped: subcommand failed.
failed checks.aarch64-linux.clang-tidy 1m 48s
nix-grpc-store-clang-tidy-0.1.0: 414 | if (restarting) { | ^ ../src/daemon/coordinator.cc:418:11: note: +1, nesting level increased to 2 …
nix-grpc-store-clang-tidy-0.1.0:
  414 |         if (restarting) {
      |         ^
../src/daemon/coordinator.cc:418:11: note: +1, nesting level increased to 2
  418 |         } else {
      |           ^
FAILED: [code=1] meson-internal__clang-tidy 
/nix/store/4nhp26ss88i238s986fx3jcqcw4si9ly-meson-1.10.2/bin/meson --internal clangtidy /build/source /build/source/build --color always
ninja: build stopped: subcommand failed.
failed checks.aarch64-linux.sanitize-smoke 1m 43s
nix-grpc-store-sanitize-smoke: tribuchet: building on eliza error: could not dynamically open plugin file "/nix/store/1n8s4da2p1k32jxal7cswha1ynfx5jr9-nix-grpc- …
nix-grpc-store-sanitize-smoke:
tribuchet: building on eliza
error: could not dynamically open plugin file "/nix/store/1n8s4da2p1k32jxal7cswha1ynfx5jr9-nix-grpc-store-asan-0.1.0/lib/nix/nix-grpc-store-versions/2.36.0/nix-grpc-store.so": /nix/store/1n8s4da2p1k32jxal7cswha1ynfx5jr9-nix-grpc-store-asan-0.1.0/lib/nix/nix-grpc-store-versions/2.36.0/nix-grpc-store.so: undefined symbol: __ubsan_handle_type_mismatch_v1
=== nixd.log ===
warning: you don't have Internet access; disabling some network-dependent features
=== daemon.log ===
ts=2026-09-19T21:21:07Z level=info event=roles builder=1 scheduler=1 scheduler_addr="" advertise=127.0.0.1:50051 niks3="" max_jobs=1
ts=2026-09-19T21:21:07Z level=info event=startup listen=127.0.0.1:50051 proxy_socket=/build/daemon.sock
ts=2026-09-19T21:21:07Z level=info event=worker_hello addr=127.0.0.1:50051 system=aarch64-linux max_jobs=1 running=0
failed checks.x86_64-linux.clang-tidy 59s
nix-grpc-store-clang-tidy-0.1.0: 414 | if (restarting) { | ^ ../src/daemon/coordinator.cc:418:11: note: +1, nesting level increased to 2 …
nix-grpc-store-clang-tidy-0.1.0:
  414 |         if (restarting) {
      |         ^
../src/daemon/coordinator.cc:418:11: note: +1, nesting level increased to 2
  418 |         } else {
      |           ^
FAILED: [code=1] meson-internal__clang-tidy 
/nix/store/azf6s3lpx8f53si93y8135mpyykjj72b-meson-1.10.2/bin/meson --internal clangtidy /build/source /build/source/build --color always
ninja: build stopped: subcommand failed.
failed checks.x86_64-linux.sanitize-smoke 59s
nix-grpc-store-sanitize-smoke: tribuchet: building on jamie error: could not dynamically open plugin file "/nix/store/c2bm07q1w7qxzj5al17c9xj8f9hza1zr-nix-grpc- …
nix-grpc-store-sanitize-smoke:
tribuchet: building on jamie
error: could not dynamically open plugin file "/nix/store/c2bm07q1w7qxzj5al17c9xj8f9hza1zr-nix-grpc-store-asan-0.1.0/lib/nix/nix-grpc-store-versions/2.36.0/nix-grpc-store.so": /nix/store/c2bm07q1w7qxzj5al17c9xj8f9hza1zr-nix-grpc-store-asan-0.1.0/lib/nix/nix-grpc-store-versions/2.36.0/nix-grpc-store.so: undefined symbol: __ubsan_handle_type_mismatch_v1
=== nixd.log ===
warning: you don't have Internet access; disabling some network-dependent features
=== daemon.log ===
ts=2026-09-19T21:20:30Z level=info event=roles builder=1 scheduler=1 scheduler_addr="" advertise=127.0.0.1:50051 niks3="" max_jobs=1
ts=2026-09-19T21:20:31Z level=info event=startup listen=127.0.0.1:50051 proxy_socket=/build/daemon.sock
ts=2026-09-19T21:20:31Z level=info event=worker_hello addr=127.0.0.1:50051 system=x86_64-linux max_jobs=1 running=0
21 succeeded
succeeded attributes
status attribute duration
loading…
3 already built
skipped attributes
status attribute duration
loading…