nixbot

builds

Mic92/nix-grpc-store build #194 failed

branch maiao.I0e59782184a4609c7782035c4abd0b3570d0cc7f · PR #71 · commit 92f721c3ee · · took 10m 6s · eval 19s

12 failed
failed attributes
status attribute duration
failed checks.aarch64-darwin.clang-tidy 9m 56s
nix-grpc-store-clang-tidy-0.1.0: 245 | for (auto & [_, shs] : shards) { | ^ ../src/daemon/dispatcher.cc:251:22: error: variable nam …
nix-grpc-store-clang-tidy-0.1.0:
  245 |     for (auto & [_, shs] : shards) {
      |                  ^
../src/daemon/dispatcher.cc:251:22: error: variable name '_' is too short, expected at least 3 characters [readability-identifier-length,-warnings-as-errors]
  251 |         for (auto & [_, send] : shs.workers) {
      |                      ^
FAILED: [code=1] meson-internal__clang-tidy 
/nix/store/735yy09gy9j1wzwrsd1v1xrgf6izyr5d-meson-1.10.2/bin/meson --internal clangtidy /nix/var/nix/builds/nix-82418-3369177444/source /nix/var/nix/builds/nix-82418-3369177444/source/build --color always
ninja: build stopped: subcommand failed.
failed checks.aarch64-darwin.exit-stress 6m 13s
nix-grpc-store-0.1.0: 414 | cfg.clients, 415 | cfg.inflight, 416 | presentCalls.load(), 417 | total, | ^~~ …
nix-grpc-store-0.1.0:
  414 |         cfg.clients,
  415 |         cfg.inflight,
  416 |         presentCalls.load(),
  417 |         total,
      |         ^~~~~
4 warnings generated.
[15/40] Compiling C++ object oidc-test.p/tests_oidc-test.cc.o
ninja: build stopped: subcommand failed.
dependency failed checks.aarch64-darwin.plugin-dispatcher
failed checks.aarch64-darwin.plugin-nix_2_31 6m 15s
nix-grpc-store-0.1.0: 414 | cfg.clients, 415 | cfg.inflight, 416 | presentCalls.load(), 417 | total, | ^~~ …
nix-grpc-store-0.1.0:
  414 |         cfg.clients,
  415 |         cfg.inflight,
  416 |         presentCalls.load(),
  417 |         total,
      |         ^~~~~
4 warnings generated.
[14/40] Compiling C++ object oidc-test.p/tests_oidc-test.cc.o
ninja: build stopped: subcommand failed.
failed checks.aarch64-darwin.plugin-nix_2_34 1m 55s
nix-grpc-store-0.1.0: 414 | cfg.clients, 415 | cfg.inflight, 416 | presentCalls.load(), 417 | total, | ^~~ …
nix-grpc-store-0.1.0:
  414 |         cfg.clients,
  415 |         cfg.inflight,
  416 |         presentCalls.load(),
  417 |         total,
      |         ^~~~~
4 warnings generated.
[16/40] Compiling C++ object oidc-test.p/tests_oidc-test.cc.o
ninja: build stopped: subcommand failed.
failed checks.aarch64-darwin.plugin-nix_2_35 1m 52s
nix-grpc-store-0.1.0: 414 | cfg.clients, 415 | cfg.inflight, 416 | presentCalls.load(), 417 | total, | ^~~ …
nix-grpc-store-0.1.0:
  414 |         cfg.clients,
  415 |         cfg.inflight,
  416 |         presentCalls.load(),
  417 |         total,
      |         ^~~~~
4 warnings generated.
[16/40] Compiling C++ object oidc-test.p/tests_oidc-test.cc.o
ninja: build stopped: subcommand failed.
failed checks.aarch64-linux.clang-tidy 1m 42s
nix-grpc-store-clang-tidy-0.1.0: 289 | dispatcher->restarting(); | ^~~~~~~~~~ ../src/daemon/coordinator.cc:302:59: error: 200 is a magic …
nix-grpc-store-clang-tidy-0.1.0:
  289 |         dispatcher->restarting();
      |         ^~~~~~~~~~
../src/daemon/coordinator.cc:302:59: error: 200 is a magic number; consider replacing it with a named constant [cppcoreguidelines-avoid-magic-numbers,readability-magic-numbers,-warnings-as-errors]
  302 |     std::this_thread::sleep_for(std::chrono::milliseconds(200));
      |                                                           ^
FAILED: [code=1] meson-internal__clang-tidy 
/nix/store/4nhp26ss88i238s986fx3jcqcw4si9ly-meson-1.10.2/bin/meson --internal clangtidy /build/source /build/source/build --color always
ninja: build stopped: subcommand failed.
failed checks.aarch64-linux.helm 4s
nix-grpc-farm-helm-check: } - ], - "priority": 0 + ] } ] }, envoy config from the cha …
nix-grpc-farm-helm-check:
               }
-            ],
-            "priority": 0
+            ]
           }
         ]
       },
envoy config from the chart drifted from nixos/lb.nix
failed checks.aarch64-linux.sanitize-smoke 1m 40s
nix-grpc-store-sanitize-smoke: tribuchet: building on eliza error: could not dynamically open plugin file "/nix/store/ny7wmddry6i0d5r62ngqx68zjnln1i5r-nix-grpc- …
nix-grpc-store-sanitize-smoke:
tribuchet: building on eliza
error: could not dynamically open plugin file "/nix/store/ny7wmddry6i0d5r62ngqx68zjnln1i5r-nix-grpc-store-asan-0.1.0/lib/nix/nix-grpc-store-versions/2.36.0/nix-grpc-store.so": /nix/store/ny7wmddry6i0d5r62ngqx68zjnln1i5r-nix-grpc-store-asan-0.1.0/lib/nix/nix-grpc-store-versions/2.36.0/nix-grpc-store.so: undefined symbol: __ubsan_handle_type_mismatch_v1
=== nixd.log ===
warning: you don't have Internet access; disabling some network-dependent features
=== daemon.log ===
ts=2026-09-19T21:21:26Z level=info event=roles builder=1 scheduler=1 scheduler_addr="" advertise=127.0.0.1:50051 niks3="" max_jobs=1
ts=2026-09-19T21:21:26Z level=info event=startup listen=127.0.0.1:50051 proxy_socket=/build/daemon.sock
ts=2026-09-19T21:21:26Z level=info event=worker_hello addr=127.0.0.1:50051 system=aarch64-linux max_jobs=1 running=0
failed checks.x86_64-linux.clang-tidy 56s
nix-grpc-store-clang-tidy-0.1.0: 363 | #define printMsg(level, args...) printMsgUsing(logger, level, args) | ^ /nix/sto …
nix-grpc-store-clang-tidy-0.1.0:
  363 | #define printMsg(level, args...) printMsgUsing(logger, level, args)
      |                                  ^
/nix/store/rfyqqgmjkpsx5wpncfrqwza6mql14rsn-nix-util-2.36.0pre20260914_920f6956-dev/include/nix/util/logging.hh:359:9: note: expanded from macro 'printMsgUsing'
  359 |         if (__lvl <= nix::verbosity) {             \
      |         ^
FAILED: [code=1] meson-internal__clang-tidy 
/nix/store/azf6s3lpx8f53si93y8135mpyykjj72b-meson-1.10.2/bin/meson --internal clangtidy /build/source /build/source/build --color always
ninja: build stopped: subcommand failed.
failed checks.x86_64-linux.helm 4s
nix-grpc-farm-helm-check: } - ], - "priority": 0 + ] } ] }, envoy config from the cha …
nix-grpc-farm-helm-check:
               }
-            ],
-            "priority": 0
+            ]
           }
         ]
       },
envoy config from the chart drifted from nixos/lb.nix
failed checks.x86_64-linux.sanitize-smoke 16s
nix-grpc-store-sanitize-smoke: tribuchet: building on jamie error: could not dynamically open plugin file "/nix/store/lnwmqy45qz92xkj410x5xsal303dwcbq-nix-grpc- …
nix-grpc-store-sanitize-smoke:
tribuchet: building on jamie
error: could not dynamically open plugin file "/nix/store/lnwmqy45qz92xkj410x5xsal303dwcbq-nix-grpc-store-asan-0.1.0/lib/nix/nix-grpc-store-versions/2.36.0/nix-grpc-store.so": /nix/store/lnwmqy45qz92xkj410x5xsal303dwcbq-nix-grpc-store-asan-0.1.0/lib/nix/nix-grpc-store-versions/2.36.0/nix-grpc-store.so: undefined symbol: __ubsan_handle_type_mismatch_v1
=== nixd.log ===
warning: you don't have Internet access; disabling some network-dependent features
=== daemon.log ===
ts=2026-09-19T21:20:05Z level=info event=roles builder=1 scheduler=1 scheduler_addr="" advertise=127.0.0.1:50051 niks3="" max_jobs=1
ts=2026-09-19T21:20:05Z level=info event=startup listen=127.0.0.1:50051 proxy_socket=/build/daemon.sock
ts=2026-09-19T21:20:05Z level=info event=worker_hello addr=127.0.0.1:50051 system=x86_64-linux max_jobs=1 running=0
16 succeeded
succeeded attributes
status attribute duration
loading…
6 already built
skipped attributes
status attribute duration
loading…