nixbot

builds

Mic92/nix-grpc-store build #195 failed

branch maiao.I6090760d0cb0defc1e3652c914cac6cf0bd3baf8 · PR #72 · commit b7f06430d4 · · took 8m 26s · eval 14s

12 failed
failed attributes
status attribute duration
failed checks.aarch64-darwin.clang-tidy 6m 40s
nix-grpc-store-clang-tidy-0.1.0: 245 | for (auto & [_, shs] : shards) { | ^ ../src/daemon/dispatcher.cc:251:22: error: variable nam …
nix-grpc-store-clang-tidy-0.1.0:
  245 |     for (auto & [_, shs] : shards) {
      |                  ^
../src/daemon/dispatcher.cc:251:22: error: variable name '_' is too short, expected at least 3 characters [readability-identifier-length,-warnings-as-errors]
  251 |         for (auto & [_, send] : shs.workers) {
      |                      ^
FAILED: [code=1] meson-internal__clang-tidy 
/nix/store/735yy09gy9j1wzwrsd1v1xrgf6izyr5d-meson-1.10.2/bin/meson --internal clangtidy /nix/var/nix/builds/nix-66163-2622737841/source /nix/var/nix/builds/nix-66163-2622737841/source/build --color always
ninja: build stopped: subcommand failed.
failed checks.aarch64-darwin.exit-stress 7m 47s
nix-grpc-store-0.1.0: 414 | cfg.clients, 415 | cfg.inflight, 416 | presentCalls.load(), 417 | total, | ^~~ …
nix-grpc-store-0.1.0:
  414 |         cfg.clients,
  415 |         cfg.inflight,
  416 |         presentCalls.load(),
  417 |         total,
      |         ^~~~~
4 warnings generated.
[17/40] Compiling C++ object oidc-test.p/tests_oidc-test.cc.o
ninja: build stopped: subcommand failed.
dependency failed checks.aarch64-darwin.plugin-dispatcher
failed checks.aarch64-darwin.plugin-nix_2_31 3m 49s
nix-grpc-store-0.1.0: 414 | cfg.clients, 415 | cfg.inflight, 416 | presentCalls.load(), 417 | total, | ^~~ …
nix-grpc-store-0.1.0:
  414 |         cfg.clients,
  415 |         cfg.inflight,
  416 |         presentCalls.load(),
  417 |         total,
      |         ^~~~~
4 warnings generated.
[14/40] Compiling C++ object oidc-test.p/tests_oidc-test.cc.o
ninja: build stopped: subcommand failed.
failed checks.aarch64-darwin.plugin-nix_2_34 5m 37s
nix-grpc-store-0.1.0: 414 | cfg.clients, 415 | cfg.inflight, 416 | presentCalls.load(), 417 | total, | ^~~ …
nix-grpc-store-0.1.0:
  414 |         cfg.clients,
  415 |         cfg.inflight,
  416 |         presentCalls.load(),
  417 |         total,
      |         ^~~~~
4 warnings generated.
[16/40] Compiling C++ object oidc-test.p/tests_oidc-test.cc.o
ninja: build stopped: subcommand failed.
failed checks.aarch64-darwin.plugin-nix_2_35 2m 43s
nix-grpc-store-0.1.0: 414 | cfg.clients, 415 | cfg.inflight, 416 | presentCalls.load(), 417 | total, | ^~~ …
nix-grpc-store-0.1.0:
  414 |         cfg.clients,
  415 |         cfg.inflight,
  416 |         presentCalls.load(),
  417 |         total,
      |         ^~~~~
4 warnings generated.
[14/40] Compiling C++ object oidc-test.p/tests_oidc-test.cc.o
ninja: build stopped: subcommand failed.
failed checks.aarch64-linux.clang-tidy 2m 44s
nix-grpc-store-clang-tidy-0.1.0: 289 | dispatcher->restarting(); | ^~~~~~~~~~ ../src/daemon/coordinator.cc:302:59: error: 200 is a magic …
nix-grpc-store-clang-tidy-0.1.0:
  289 |         dispatcher->restarting();
      |         ^~~~~~~~~~
../src/daemon/coordinator.cc:302:59: error: 200 is a magic number; consider replacing it with a named constant [cppcoreguidelines-avoid-magic-numbers,readability-magic-numbers,-warnings-as-errors]
  302 |     std::this_thread::sleep_for(std::chrono::milliseconds(200));
      |                                                           ^
FAILED: [code=1] meson-internal__clang-tidy 
/nix/store/4nhp26ss88i238s986fx3jcqcw4si9ly-meson-1.10.2/bin/meson --internal clangtidy /build/source /build/source/build --color always
ninja: build stopped: subcommand failed.
failed checks.aarch64-linux.farm 2m 9s
vm-test-run-nix-grpc-farm: worker1 # qemu-system-aarch64: terminating on signal 15 from pid 39 (/nix/store/lfh101cfjj8p8npcari9hk0lbqi33yvh-python3-3.14.7/bin/p …
vm-test-run-nix-grpc-farm:
worker1 # qemu-system-aarch64: terminating on signal 15 from pid 39 (/nix/store/lfh101cfjj8p8npcari9hk0lbqi33yvh-python3-3.14.7/bin/python3.14)
kill QemuMachine (pid 52)
worker2 # qemu-system-aarch64: terminating on signal 15 from pid 39 (/nix/store/lfh101cfjj8p8npcari9hk0lbqi33yvh-python3-3.14.7/bin/python3.14)
(finished: cleanup, in 0.94 seconds)
additionally exposed symbols:
    client, lb, worker1, worker2,
    vlan1,
    start_all, test_script, machines, machines_qemu, machines_nspawn, vlans, driver, log, os, create_machine, subtest, run_tests, join_all, retry, serial_stdout_off, serial_stdout_on, polling_condition, BaseMachine, QemuMachine, NspawnMachine, t, debug, dump_machine_ssh
failed checks.aarch64-linux.sanitize-smoke 1m 46s
nix-grpc-store-sanitize-smoke: tribuchet: building on eliza error: could not dynamically open plugin file "/nix/store/ny7wmddry6i0d5r62ngqx68zjnln1i5r-nix-grpc- …
nix-grpc-store-sanitize-smoke:
tribuchet: building on eliza
error: could not dynamically open plugin file "/nix/store/ny7wmddry6i0d5r62ngqx68zjnln1i5r-nix-grpc-store-asan-0.1.0/lib/nix/nix-grpc-store-versions/2.36.0/nix-grpc-store.so": /nix/store/ny7wmddry6i0d5r62ngqx68zjnln1i5r-nix-grpc-store-asan-0.1.0/lib/nix/nix-grpc-store-versions/2.36.0/nix-grpc-store.so: undefined symbol: __ubsan_handle_type_mismatch_v1
=== nixd.log ===
warning: you don't have Internet access; disabling some network-dependent features
=== daemon.log ===
ts=2026-09-19T21:21:47Z level=info event=roles builder=1 scheduler=1 scheduler_addr="" advertise=127.0.0.1:50051 niks3="" max_jobs=1
ts=2026-09-19T21:21:47Z level=info event=startup listen=127.0.0.1:50051 proxy_socket=/build/daemon.sock
ts=2026-09-19T21:21:47Z level=info event=worker_hello addr=127.0.0.1:50051 system=aarch64-linux max_jobs=1 running=0
failed checks.x86_64-linux.clang-tidy 1m 33s
nix-grpc-store-clang-tidy-0.1.0: 289 | dispatcher->restarting(); | ^~~~~~~~~~ ../src/daemon/coordinator.cc:302:59: error: 200 is a magic …
nix-grpc-store-clang-tidy-0.1.0:
  289 |         dispatcher->restarting();
      |         ^~~~~~~~~~
../src/daemon/coordinator.cc:302:59: error: 200 is a magic number; consider replacing it with a named constant [cppcoreguidelines-avoid-magic-numbers,readability-magic-numbers,-warnings-as-errors]
  302 |     std::this_thread::sleep_for(std::chrono::milliseconds(200));
      |                                                           ^
FAILED: [code=1] meson-internal__clang-tidy 
/nix/store/azf6s3lpx8f53si93y8135mpyykjj72b-meson-1.10.2/bin/meson --internal clangtidy /build/source /build/source/build --color always
ninja: build stopped: subcommand failed.
failed checks.x86_64-linux.k3s 8m 13s
vm-test-run-nix-grpc-farm-k3s: cleanup kill QemuMachine (pid 45) machine # qemu-system-x86_64: terminating on signal 15 from pid 39 (/nix/store/b5bpi6zfajzzrwwp …
vm-test-run-nix-grpc-farm-k3s:
cleanup
kill QemuMachine (pid 45)
machine # qemu-system-x86_64: terminating on signal 15 from pid 39 (/nix/store/b5bpi6zfajzzrwwpgba2q6li3nnya4bs-python3-3.14.7/bin/python3.14)
(finished: cleanup, in 1.18 seconds)
additionally exposed symbols:
    machine,
    vlan1,
    start_all, test_script, machines, machines_qemu, machines_nspawn, vlans, driver, log, os, create_machine, subtest, run_tests, join_all, retry, serial_stdout_off, serial_stdout_on, polling_condition, BaseMachine, QemuMachine, NspawnMachine, t, debug, dump_machine_ssh
failed checks.x86_64-linux.sanitize-smoke 16s
nix-grpc-store-sanitize-smoke: tribuchet: building on jamie error: could not dynamically open plugin file "/nix/store/lnwmqy45qz92xkj410x5xsal303dwcbq-nix-grpc- …
nix-grpc-store-sanitize-smoke:
tribuchet: building on jamie
error: could not dynamically open plugin file "/nix/store/lnwmqy45qz92xkj410x5xsal303dwcbq-nix-grpc-store-asan-0.1.0/lib/nix/nix-grpc-store-versions/2.36.0/nix-grpc-store.so": /nix/store/lnwmqy45qz92xkj410x5xsal303dwcbq-nix-grpc-store-asan-0.1.0/lib/nix/nix-grpc-store-versions/2.36.0/nix-grpc-store.so: undefined symbol: __ubsan_handle_type_mismatch_v1
=== nixd.log ===
warning: you don't have Internet access; disabling some network-dependent features
=== daemon.log ===
ts=2026-09-19T21:20:23Z level=info event=roles builder=1 scheduler=1 scheduler_addr="" advertise=127.0.0.1:50051 niks3="" max_jobs=1
ts=2026-09-19T21:20:23Z level=info event=startup listen=127.0.0.1:50051 proxy_socket=/build/daemon.sock
ts=2026-09-19T21:20:23Z level=info event=worker_hello addr=127.0.0.1:50051 system=x86_64-linux max_jobs=1 running=0
15 succeeded
succeeded attributes
status attribute duration
loading…
7 already built
skipped attributes
status attribute duration
loading…