nixbot

builds

Mic92/nix-grpc-store build #485 failed

branch main · PR #107 · commit df35d03d25 · · took 1m 54s · eval 19s

32 failed
failed attributes
status attribute duration
failed checks.aarch64-darwin.clang-tidy 1m 32s
nix-grpc-store-clang-tidy-0.1.0-beta.1: Errors encountered while running clang-tidy Error while processing /nix/var/nix/builds/nix-9852-1566966991/source/src/da …
nix-grpc-store-clang-tidy-0.1.0-beta.1:
Errors encountered while running clang-tidy
Error while processing /nix/var/nix/builds/nix-9852-1566966991/source/src/daemon/main.cc.
../src/daemon/main.cc:156:25: error: unknown type name 'Fields' [clang-diagnostic-error]
  156 |         void done(const Fields & extra) const
      |                         ^
FAILED: [code=1] meson-internal__clang-tidy 
/nix/store/735yy09gy9j1wzwrsd1v1xrgf6izyr5d-meson-1.10.2/bin/meson --internal clangtidy /nix/var/nix/builds/nix-9852-1566966991/source /nix/var/nix/builds/nix-9852-1566966991/source/build --color always
ninja: build stopped: subcommand failed.
failed checks.aarch64-darwin.exit-stress 1m 17s
nix-grpc-store-0.1.0-beta.1: [30/38] Compiling C++ object nix-grpc-store.dylib.p/src_client_build.cc.o [31/38] Compiling C++ object nix-grpc-daemon.p/meson-gene …
nix-grpc-store-0.1.0-beta.1:
[30/38] Compiling C++ object nix-grpc-store.dylib.p/src_client_build.cc.o
[31/38] Compiling C++ object nix-grpc-daemon.p/meson-generated_.._nix_remote.grpc.pb.cc.o
[32/38] Compiling C++ object nix-grpc-daemon.p/src_daemon_elector.cc.o
[33/38] Compiling C++ object nix-grpc-daemon.p/src_daemon_backend.cc.o
[34/38] Compiling C++ object nix-grpc-daemon.p/src_daemon_options.cc.o
[35/38] Compiling C++ object nix-grpc-daemon.p/src_daemon_auth.cc.o
[36/38] Compiling C++ object nix-grpc-daemon.p/src_daemon_coordinator.cc.o
ninja: build stopped: subcommand failed.
dependency failed checks.aarch64-darwin.nix-with-plugin
dependency failed checks.aarch64-darwin.plugin-dispatcher
failed checks.aarch64-darwin.plugin-nix_2_31 1m 16s
nix-grpc-store-0.1.0-beta.1: 6 errors generated. [32/38] Compiling C++ object nix-grpc-daemon.p/meson-generated_.._nix_remote.grpc.pb.cc.o [33/38] Compiling C++ …
nix-grpc-store-0.1.0-beta.1:
6 errors generated.
[32/38] Compiling C++ object nix-grpc-daemon.p/meson-generated_.._nix_remote.grpc.pb.cc.o
[33/38] Compiling C++ object nix-grpc-daemon.p/src_daemon_elector.cc.o
[34/38] Compiling C++ object nix-grpc-daemon.p/src_daemon_backend.cc.o
[35/38] Compiling C++ object nix-grpc-daemon.p/src_daemon_options.cc.o
[36/38] Compiling C++ object nix-grpc-daemon.p/src_daemon_auth.cc.o
[37/38] Compiling C++ object nix-grpc-daemon.p/src_daemon_coordinator.cc.o
ninja: build stopped: subcommand failed.
failed checks.aarch64-darwin.plugin-nix_2_34 1m 16s
nix-grpc-store-0.1.0-beta.1: 6 errors generated. [32/38] Compiling C++ object nix-grpc-daemon.p/meson-generated_.._nix_remote.grpc.pb.cc.o [33/38] Compiling C++ …
nix-grpc-store-0.1.0-beta.1:
6 errors generated.
[32/38] Compiling C++ object nix-grpc-daemon.p/meson-generated_.._nix_remote.grpc.pb.cc.o
[33/38] Compiling C++ object nix-grpc-daemon.p/src_daemon_backend.cc.o
[34/38] Compiling C++ object nix-grpc-daemon.p/src_daemon_elector.cc.o
[35/38] Compiling C++ object nix-grpc-daemon.p/src_daemon_options.cc.o
[36/38] Compiling C++ object nix-grpc-daemon.p/src_daemon_auth.cc.o
[37/38] Compiling C++ object nix-grpc-daemon.p/src_daemon_coordinator.cc.o
ninja: build stopped: subcommand failed.
failed checks.aarch64-darwin.plugin-nix_2_35 1m 17s
nix-grpc-store-0.1.0-beta.1: [30/38] Compiling C++ object nix-grpc-store.dylib.p/src_client_build.cc.o [31/38] Compiling C++ object nix-grpc-daemon.p/meson-gene …
nix-grpc-store-0.1.0-beta.1:
[30/38] Compiling C++ object nix-grpc-store.dylib.p/src_client_build.cc.o
[31/38] Compiling C++ object nix-grpc-daemon.p/meson-generated_.._nix_remote.grpc.pb.cc.o
[32/38] Compiling C++ object nix-grpc-daemon.p/src_daemon_elector.cc.o
[33/38] Compiling C++ object nix-grpc-daemon.p/src_daemon_backend.cc.o
[34/38] Compiling C++ object nix-grpc-daemon.p/src_daemon_options.cc.o
[35/38] Compiling C++ object nix-grpc-daemon.p/src_daemon_auth.cc.o
[36/38] Compiling C++ object nix-grpc-daemon.p/src_daemon_coordinator.cc.o
ninja: build stopped: subcommand failed.
dependency failed checks.aarch64-linux.acme-vm
failed checks.aarch64-linux.clang-tidy 1m 29s
nix-grpc-store-clang-tidy-0.1.0-beta.1: Errors encountered while running clang-tidy Error while processing /build/source/src/daemon/main.cc. ../src/daemon/main. …
nix-grpc-store-clang-tidy-0.1.0-beta.1:
Errors encountered while running clang-tidy
Error while processing /build/source/src/daemon/main.cc.
../src/daemon/main.cc:156:25: error: unknown type name 'Fields' [clang-diagnostic-error]
  156 |         void done(const Fields & extra) const
      |                         ^
FAILED: [code=1] meson-internal__clang-tidy 
/nix/store/4nhp26ss88i238s986fx3jcqcw4si9ly-meson-1.10.2/bin/meson --internal clangtidy /build/source /build/source/build --color always
ninja: build stopped: subcommand failed.
failed checks.aarch64-linux.exit-stress 1m 46s
nix-grpc-store-0.1.0-beta.1: [30/38] Compiling C++ object nix-grpc-store.so.p/src_client_store.cc.o [31/38] Compiling C++ object nix-grpc-store.so.p/meson-gener …
nix-grpc-store-0.1.0-beta.1:
[30/38] Compiling C++ object nix-grpc-store.so.p/src_client_store.cc.o
[31/38] Compiling C++ object nix-grpc-store.so.p/meson-generated_.._nix_remote.grpc.pb.cc.o
[32/38] Compiling C++ object nix-grpc-store.so.p/src_client_transfer.cc.o
[33/38] Compiling C++ object nix-grpc-daemon.p/meson-generated_.._nix_remote.grpc.pb.cc.o
[34/38] Compiling C++ object nix-grpc-store.so.p/src_client_build.cc.o
[35/38] Compiling C++ object nix-grpc-daemon.p/src_daemon_auth.cc.o
[36/38] Compiling C++ object nix-grpc-daemon.p/src_daemon_coordinator.cc.o
ninja: build stopped: subcommand failed.
dependency failed checks.aarch64-linux.farm
failed checks.aarch64-linux.fuzz 1m 22s
nix-grpc-store-fuzzers-0.1.0-beta.1: [66/82] Compiling C++ object fuzz-xfcc.p/meson-generated_.._nix_remote.grpc.pb.cc.o [67/82] Linking target oidc-test [68/82 …
nix-grpc-store-fuzzers-0.1.0-beta.1:
[66/82] Compiling C++ object fuzz-xfcc.p/meson-generated_.._nix_remote.grpc.pb.cc.o
[67/82] Linking target oidc-test
[68/82] Linking target dispatcher-bench
[69/82] Linking target farm-client-test
[70/82] Linking target scheduler-test
[71/82] Linking target scheduler-grpc-bench
[72/82] Linking target fuzz-zstd-reader
ninja: build stopped: subcommand failed.
dependency failed checks.aarch64-linux.nix-with-plugin
dependency failed checks.aarch64-linux.plugin-dispatcher
failed checks.aarch64-linux.plugin-nix_2_31 1m 41s
nix-grpc-store-0.1.0-beta.1: [30/38] Compiling C++ object nix-grpc-store.so.p/src_client_store.cc.o [31/38] Compiling C++ object nix-grpc-store.so.p/src_client_ …
nix-grpc-store-0.1.0-beta.1:
[30/38] Compiling C++ object nix-grpc-store.so.p/src_client_store.cc.o
[31/38] Compiling C++ object nix-grpc-store.so.p/src_client_transfer.cc.o
[32/38] Compiling C++ object nix-grpc-store.so.p/meson-generated_.._nix_remote.grpc.pb.cc.o
[33/38] Compiling C++ object nix-grpc-daemon.p/meson-generated_.._nix_remote.grpc.pb.cc.o
[34/38] Compiling C++ object nix-grpc-store.so.p/src_client_build.cc.o
[35/38] Compiling C++ object nix-grpc-daemon.p/src_daemon_auth.cc.o
[36/38] Compiling C++ object nix-grpc-daemon.p/src_daemon_coordinator.cc.o
ninja: build stopped: subcommand failed.
failed checks.aarch64-linux.plugin-nix_2_34 1m 43s
nix-grpc-store-0.1.0-beta.1: [30/38] Compiling C++ object nix-grpc-store.so.p/src_client_store.cc.o [31/38] Compiling C++ object nix-grpc-store.so.p/meson-gener …
nix-grpc-store-0.1.0-beta.1:
[30/38] Compiling C++ object nix-grpc-store.so.p/src_client_store.cc.o
[31/38] Compiling C++ object nix-grpc-store.so.p/meson-generated_.._nix_remote.grpc.pb.cc.o
[32/38] Compiling C++ object nix-grpc-store.so.p/src_client_transfer.cc.o
[33/38] Compiling C++ object nix-grpc-daemon.p/meson-generated_.._nix_remote.grpc.pb.cc.o
[34/38] Compiling C++ object nix-grpc-store.so.p/src_client_build.cc.o
[35/38] Compiling C++ object nix-grpc-daemon.p/src_daemon_auth.cc.o
[36/38] Compiling C++ object nix-grpc-daemon.p/src_daemon_coordinator.cc.o
ninja: build stopped: subcommand failed.
failed checks.aarch64-linux.plugin-nix_2_35 1m 46s
nix-grpc-store-0.1.0-beta.1: [30/38] Compiling C++ object nix-grpc-store.so.p/src_client_store.cc.o [31/38] Compiling C++ object nix-grpc-store.so.p/meson-gener …
nix-grpc-store-0.1.0-beta.1:
[30/38] Compiling C++ object nix-grpc-store.so.p/src_client_store.cc.o
[31/38] Compiling C++ object nix-grpc-store.so.p/meson-generated_.._nix_remote.grpc.pb.cc.o
[32/38] Compiling C++ object nix-grpc-store.so.p/src_client_transfer.cc.o
[33/38] Compiling C++ object nix-grpc-daemon.p/meson-generated_.._nix_remote.grpc.pb.cc.o
[34/38] Compiling C++ object nix-grpc-store.so.p/src_client_build.cc.o
[35/38] Compiling C++ object nix-grpc-daemon.p/src_daemon_auth.cc.o
[36/38] Compiling C++ object nix-grpc-daemon.p/src_daemon_coordinator.cc.o
ninja: build stopped: subcommand failed.
failed checks.aarch64-linux.sanitize-smoke 1m 22s
nix-grpc-store-asan-0.1.0-beta.1: clang++: warning: argument unused during compilation: '-Wa,--compress-debug-sections' [-Wunused-command-line-argument] [34/38] …
nix-grpc-store-asan-0.1.0-beta.1:
clang++: warning: argument unused during compilation: '-Wa,--compress-debug-sections' [-Wunused-command-line-argument]
[34/38] Linking target dispatcher-bench
clang++: warning: argument unused during compilation: '-Wa,--compress-debug-sections' [-Wunused-command-line-argument]
[35/38] Linking target oidc-test
clang++: warning: argument unused during compilation: '-Wa,--compress-debug-sections' [-Wunused-command-line-argument]
[36/38] Linking target scheduler-grpc-bench
clang++: warning: argument unused during compilation: '-Wa,--compress-debug-sections' [-Wunused-command-line-argument]
ninja: build stopped: subcommand failed.
dependency failed checks.aarch64-linux.vm
dependency failed checks.x86_64-linux.acme-vm
failed checks.x86_64-linux.clang-tidy 41s
nix-grpc-store-clang-tidy-0.1.0-beta.1: Errors encountered while running clang-tidy Error while processing /build/source/src/daemon/main.cc. ../src/daemon/main. …
nix-grpc-store-clang-tidy-0.1.0-beta.1:
Errors encountered while running clang-tidy
Error while processing /build/source/src/daemon/main.cc.
../src/daemon/main.cc:156:25: error: unknown type name 'Fields' [clang-diagnostic-error]
  156 |         void done(const Fields & extra) const
      |                         ^
FAILED: [code=1] meson-internal__clang-tidy 
/nix/store/azf6s3lpx8f53si93y8135mpyykjj72b-meson-1.10.2/bin/meson --internal clangtidy /build/source /build/source/build --color always
ninja: build stopped: subcommand failed.
failed checks.x86_64-linux.exit-stress 50s
nix-grpc-store-0.1.0-beta.1: [30/38] Compiling C++ object nix-grpc-store.so.p/src_client_store.cc.o [31/38] Compiling C++ object nix-grpc-store.so.p/meson-gener …
nix-grpc-store-0.1.0-beta.1:
[30/38] Compiling C++ object nix-grpc-store.so.p/src_client_store.cc.o
[31/38] Compiling C++ object nix-grpc-store.so.p/meson-generated_.._nix_remote.grpc.pb.cc.o
[32/38] Compiling C++ object nix-grpc-store.so.p/src_client_transfer.cc.o
[33/38] Compiling C++ object nix-grpc-daemon.p/meson-generated_.._nix_remote.grpc.pb.cc.o
[34/38] Compiling C++ object nix-grpc-daemon.p/src_daemon_auth.cc.o
[35/38] Compiling C++ object nix-grpc-store.so.p/src_client_build.cc.o
[36/38] Compiling C++ object nix-grpc-daemon.p/src_daemon_coordinator.cc.o
ninja: build stopped: subcommand failed.
dependency failed checks.x86_64-linux.farm
failed checks.x86_64-linux.fuzz 29s
nix-grpc-store-fuzzers-0.1.0-beta.1: [73/82] Compiling C++ object nix-grpc-daemon.p/src_daemon_auth.cc.o [74/82] Compiling C++ object fuzz-gen-seeds.p/meson-gen …
nix-grpc-store-fuzzers-0.1.0-beta.1:
[73/82] Compiling C++ object nix-grpc-daemon.p/src_daemon_auth.cc.o
[74/82] Compiling C++ object fuzz-gen-seeds.p/meson-generated_.._nix_remote.pb.cc.o
[75/82] Linking target nix-grpc-store.so
[76/82] Compiling C++ object fuzz-gen-seeds.p/meson-generated_.._nix_remote.grpc.pb.cc.o
[77/82] Compiling C++ object fuzz-xfcc.p/meson-generated_.._nix_remote.grpc.pb.cc.o
[78/82] Compiling C++ object nix-grpc-daemon.p/src_daemon_coordinator.cc.o
[79/82] Compiling C++ object fuzz-gen-seeds.p/fuzz_gen-seeds.cc.o
ninja: build stopped: subcommand failed.
dependency failed checks.x86_64-linux.k3s
dependency failed checks.x86_64-linux.nix-with-plugin
dependency failed checks.x86_64-linux.plugin-dispatcher
failed checks.x86_64-linux.plugin-nix_2_31 47s
nix-grpc-store-0.1.0-beta.1: [30/38] Compiling C++ object nix-grpc-store.so.p/src_client_store.cc.o [31/38] Compiling C++ object nix-grpc-store.so.p/src_client_ …
nix-grpc-store-0.1.0-beta.1:
[30/38] Compiling C++ object nix-grpc-store.so.p/src_client_store.cc.o
[31/38] Compiling C++ object nix-grpc-store.so.p/src_client_transfer.cc.o
[32/38] Compiling C++ object nix-grpc-store.so.p/meson-generated_.._nix_remote.grpc.pb.cc.o
[33/38] Compiling C++ object nix-grpc-daemon.p/meson-generated_.._nix_remote.grpc.pb.cc.o
[34/38] Compiling C++ object nix-grpc-store.so.p/src_client_build.cc.o
[35/38] Compiling C++ object nix-grpc-daemon.p/src_daemon_auth.cc.o
[36/38] Compiling C++ object nix-grpc-daemon.p/src_daemon_coordinator.cc.o
ninja: build stopped: subcommand failed.
failed checks.x86_64-linux.plugin-nix_2_34 49s
nix-grpc-store-0.1.0-beta.1: [30/38] Compiling C++ object nix-grpc-store.so.p/src_client_store.cc.o [31/38] Compiling C++ object nix-grpc-store.so.p/meson-gener …
nix-grpc-store-0.1.0-beta.1:
[30/38] Compiling C++ object nix-grpc-store.so.p/src_client_store.cc.o
[31/38] Compiling C++ object nix-grpc-store.so.p/meson-generated_.._nix_remote.grpc.pb.cc.o
[32/38] Compiling C++ object nix-grpc-daemon.p/meson-generated_.._nix_remote.grpc.pb.cc.o
[33/38] Compiling C++ object nix-grpc-store.so.p/src_client_transfer.cc.o
[34/38] Compiling C++ object nix-grpc-daemon.p/src_daemon_auth.cc.o
[35/38] Compiling C++ object nix-grpc-store.so.p/src_client_build.cc.o
[36/38] Compiling C++ object nix-grpc-daemon.p/src_daemon_coordinator.cc.o
ninja: build stopped: subcommand failed.
failed checks.x86_64-linux.plugin-nix_2_35 47s
nix-grpc-store-0.1.0-beta.1: [30/38] Compiling C++ object nix-grpc-store.so.p/src_client_store.cc.o [31/38] Compiling C++ object nix-grpc-store.so.p/meson-gener …
nix-grpc-store-0.1.0-beta.1:
[30/38] Compiling C++ object nix-grpc-store.so.p/src_client_store.cc.o
[31/38] Compiling C++ object nix-grpc-store.so.p/meson-generated_.._nix_remote.grpc.pb.cc.o
[32/38] Compiling C++ object nix-grpc-store.so.p/src_client_transfer.cc.o
[33/38] Compiling C++ object nix-grpc-daemon.p/meson-generated_.._nix_remote.grpc.pb.cc.o
[34/38] Compiling C++ object nix-grpc-store.so.p/src_client_build.cc.o
[35/38] Compiling C++ object nix-grpc-daemon.p/src_daemon_auth.cc.o
[36/38] Compiling C++ object nix-grpc-daemon.p/src_daemon_coordinator.cc.o
ninja: build stopped: subcommand failed.
failed checks.x86_64-linux.sanitize-smoke 27s
nix-grpc-store-asan-0.1.0-beta.1: | ^ 1 error generated. [32/38] Compiling C++ object nix-grpc-store.so.p/src_client_store.cc.o [3 …
nix-grpc-store-asan-0.1.0-beta.1:
      |                         ^
1 error generated.
[32/38] Compiling C++ object nix-grpc-store.so.p/src_client_store.cc.o
[33/38] Compiling C++ object nix-grpc-store.so.p/src_client_transfer.cc.o
[34/38] Compiling C++ object nix-grpc-daemon.p/src_daemon_auth.cc.o
[35/38] Compiling C++ object nix-grpc-store.so.p/src_client_build.cc.o
[36/38] Compiling C++ object nix-grpc-daemon.p/src_daemon_coordinator.cc.o
ninja: build stopped: subcommand failed.
dependency failed checks.x86_64-linux.vm
5 already built
skipped attributes
status attribute duration
loading…