nixbot

builds

Mic92/nix-grpc-store build #486 failed

branch main · PR #108 · commit 7995aa8a5a · · took 7m 46s · eval 21s

4 failed
failed attributes
status attribute duration
failed checks.aarch64-darwin.clang-tidy 2m 3s
nix-grpc-store-clang-tidy-0.1.0-beta.1: 136 | auto ack(const std::string & status, const std::string & message, const std::string & path, std::set<std …
nix-grpc-store-clang-tidy-0.1.0-beta.1:
  136 |         auto ack(const std::string & status, const std::string & message, const std::string & path, std::set<std::string> sigs)
      |                                                                  ^~~~~~~
../src/daemon/push.hh:136:95: note: the last parameter in the range is 'path'
  136 |         auto ack(const std::string & status, const std::string & message, const std::string & path, std::set<std::string> sigs)
      |                                                                                               ^~~~
FAILED: [code=1] meson-internal__clang-tidy 
/nix/store/735yy09gy9j1wzwrsd1v1xrgf6izyr5d-meson-1.10.2/bin/meson --internal clangtidy /nix/var/nix/builds/nix-92767-28571255/source /nix/var/nix/builds/nix-92767-28571255/source/build --color always
ninja: build stopped: subcommand failed.
failed checks.aarch64-linux.clang-tidy 1m 35s
nix-grpc-store-clang-tidy-0.1.0-beta.1: 136 | auto ack(const std::string & status, const std::string & message, const std::string & path, std::set<std …
nix-grpc-store-clang-tidy-0.1.0-beta.1:
  136 |         auto ack(const std::string & status, const std::string & message, const std::string & path, std::set<std::string> sigs)
      |                                                                  ^~~~~~~
../src/daemon/push.hh:136:95: note: the last parameter in the range is 'path'
  136 |         auto ack(const std::string & status, const std::string & message, const std::string & path, std::set<std::string> sigs)
      |                                                                                               ^~~~
FAILED: [code=1] meson-internal__clang-tidy 
/nix/store/4nhp26ss88i238s986fx3jcqcw4si9ly-meson-1.10.2/bin/meson --internal clangtidy /build/source /build/source/build --color always
ninja: build stopped: subcommand failed.
failed checks.aarch64-linux.farm 1m 44s
vm-test-run-nix-grpc-farm: worker1 # qemu-system-aarch64: terminating on signal 15 from pid 39 (/nix/store/lfh101cfjj8p8npcari9hk0lbqi33yvh-python3-3.14.7/bin/p …
vm-test-run-nix-grpc-farm:
worker1 # qemu-system-aarch64: terminating on signal 15 from pid 39 (/nix/store/lfh101cfjj8p8npcari9hk0lbqi33yvh-python3-3.14.7/bin/python3.14)
kill QemuMachine (pid 52)
worker2 # qemu-system-aarch64: terminating on signal 15 from pid 39 (/nix/store/lfh101cfjj8p8npcari9hk0lbqi33yvh-python3-3.14.7/bin/python3.14)
(finished: cleanup, in 0.89 seconds)
additionally exposed symbols:
    client, lb, worker1, worker2,
    vlan1,
    start_all, test_script, machines, machines_qemu, machines_nspawn, vlans, driver, log, os, create_machine, subtest, run_tests, join_all, retry, serial_stdout_off, serial_stdout_on, polling_condition, BaseMachine, QemuMachine, NspawnMachine, t, debug, dump_machine_ssh
failed checks.x86_64-linux.clang-tidy 1m 3s
nix-grpc-store-clang-tidy-0.1.0-beta.1: 136 | auto ack(const std::string & status, const std::string & message, const std::string & path, std::set<std …
nix-grpc-store-clang-tidy-0.1.0-beta.1:
  136 |         auto ack(const std::string & status, const std::string & message, const std::string & path, std::set<std::string> sigs)
      |                                                                  ^~~~~~~
../src/daemon/push.hh:136:95: note: the last parameter in the range is 'path'
  136 |         auto ack(const std::string & status, const std::string & message, const std::string & path, std::set<std::string> sigs)
      |                                                                                               ^~~~
FAILED: [code=1] meson-internal__clang-tidy 
/nix/store/azf6s3lpx8f53si93y8135mpyykjj72b-meson-1.10.2/bin/meson --internal clangtidy /build/source /build/source/build --color always
ninja: build stopped: subcommand failed.
23 succeeded
succeeded attributes
status attribute duration
loading…
10 already built
skipped attributes
status attribute duration
loading…