nixbot

builds

Mic92/nix-grpc-store build #487 failed

branch main · PR #108 · commit 758fb29a9c · · took 8m 17s · eval 19s

3 failed
failed attributes
status attribute duration
failed checks.aarch64-darwin.clang-tidy 1m 39s
nix-grpc-store-clang-tidy-0.1.0-beta.1: 136 | auto ack(const std::string & status, const std::string & message, const std::string & path, std::set<std …
nix-grpc-store-clang-tidy-0.1.0-beta.1:
  136 |         auto ack(const std::string & status, const std::string & message, const std::string & path, std::set<std::string> sigs)
      |                                                                  ^~~~~~~
../src/daemon/push.hh:136:95: note: the last parameter in the range is 'path'
  136 |         auto ack(const std::string & status, const std::string & message, const std::string & path, std::set<std::string> sigs)
      |                                                                                               ^~~~
FAILED: [code=1] meson-internal__clang-tidy 
/nix/store/735yy09gy9j1wzwrsd1v1xrgf6izyr5d-meson-1.10.2/bin/meson --internal clangtidy /nix/var/nix/builds/nix-4645-1352799090/source /nix/var/nix/builds/nix-4645-1352799090/source/build --color always
ninja: build stopped: subcommand failed.
failed checks.aarch64-linux.clang-tidy 2m 17s
nix-grpc-store-clang-tidy-0.1.0-beta.1: 136 | auto ack(const std::string & status, const std::string & message, const std::string & path, std::set<std …
nix-grpc-store-clang-tidy-0.1.0-beta.1:
  136 |         auto ack(const std::string & status, const std::string & message, const std::string & path, std::set<std::string> sigs)
      |                                                                  ^~~~~~~
../src/daemon/push.hh:136:95: note: the last parameter in the range is 'path'
  136 |         auto ack(const std::string & status, const std::string & message, const std::string & path, std::set<std::string> sigs)
      |                                                                                               ^~~~
FAILED: [code=1] meson-internal__clang-tidy 
/nix/store/4nhp26ss88i238s986fx3jcqcw4si9ly-meson-1.10.2/bin/meson --internal clangtidy /build/source /build/source/build --color always
ninja: build stopped: subcommand failed.
failed checks.x86_64-linux.clang-tidy 52s
nix-grpc-store-clang-tidy-0.1.0-beta.1: 136 | auto ack(const std::string & status, const std::string & message, const std::string & path, std::set<std …
nix-grpc-store-clang-tidy-0.1.0-beta.1:
  136 |         auto ack(const std::string & status, const std::string & message, const std::string & path, std::set<std::string> sigs)
      |                                                                  ^~~~~~~
../src/daemon/push.hh:136:95: note: the last parameter in the range is 'path'
  136 |         auto ack(const std::string & status, const std::string & message, const std::string & path, std::set<std::string> sigs)
      |                                                                                               ^~~~
FAILED: [code=1] meson-internal__clang-tidy 
/nix/store/azf6s3lpx8f53si93y8135mpyykjj72b-meson-1.10.2/bin/meson --internal clangtidy /build/source /build/source/build --color always
ninja: build stopped: subcommand failed.
29 succeeded
succeeded attributes
status attribute duration
loading…
5 already built
skipped attributes
status attribute duration
loading…