nixbot

builds

Mic92/nix-grpc-store build #495 failed

branch main · PR #99 · commit 8891e87785 · · took 6m 36s · eval 21s

2 failed
failed attributes
status attribute duration
failed checks.aarch64-linux.clang-tidy 1m 3s
nix-grpc-store-clang-tidy-0.1.0-beta.1: 95 | return got != 0 ? static_cast<ssize_t>(got) : -1; | …
nix-grpc-store-clang-tidy-0.1.0-beta.1:
   95 |         return got != 0 ? static_cast<ssize_t>(got) : -1;
      |                                                       ^
../src/pump.hh:97:33: error: narrowing conversion from 'size_t' (aka 'unsigned long') to signed type 'int' is implementation-defined [bugprone-narrowing-conversions,cppcoreguidelines-narrowing-conversions,-warnings-as-errors]
   97 |     return static_cast<ssize_t>(got);
      |                                 ^
FAILED: [code=1] meson-internal__clang-tidy 
/nix/store/sc7hggvmvma7m8bbgmp8gsa1q1x37aq8-meson-1.10.2/bin/meson --internal clangtidy /build/source /build/source/build --color always
ninja: build stopped: subcommand failed.
failed checks.x86_64-linux.clang-tidy 37s
nix-grpc-store-clang-tidy-0.1.0-beta.1: 95 | return got != 0 ? static_cast<ssize_t>(got) : -1; | …
nix-grpc-store-clang-tidy-0.1.0-beta.1:
   95 |         return got != 0 ? static_cast<ssize_t>(got) : -1;
      |                                                       ^
../src/pump.hh:97:33: error: narrowing conversion from 'size_t' (aka 'unsigned long') to signed type 'int' is implementation-defined [bugprone-narrowing-conversions,cppcoreguidelines-narrowing-conversions,-warnings-as-errors]
   97 |     return static_cast<ssize_t>(got);
      |                                 ^
FAILED: [code=1] meson-internal__clang-tidy 
/nix/store/jaa89dphx07w3r26y7gh79a7b1mld5p4-meson-1.10.2/bin/meson --internal clangtidy /build/source /build/source/build --color always
ninja: build stopped: subcommand failed.
1 cancelled
cancelled attributes
status attribute duration
loading…
29 succeeded
succeeded attributes
status attribute duration
loading…
5 already built
skipped attributes
status attribute duration
loading…