nixbot

builds

Mic92/nix-grpc-store build #496 failed

branch main · PR #99 · commit 3d25f4ffa6 · · took 1m 8s · eval 19s

2 failed
failed attributes
status attribute duration
failed checks.aarch64-linux.clang-tidy 28s
nix-grpc-store-clang-tidy-0.1.0-beta.1: | const ../src/nix-compat.hh:296:23: error: variable 'srcs' is not initialized [cppcoreguidelines-init-var …
nix-grpc-store-clang-tidy-0.1.0-beta.1:
      |        const 
../src/nix-compat.hh:296:23: error: variable 'srcs' is not initialized [cppcoreguidelines-init-variables,-warnings-as-errors]
  296 |     nix::StorePathSet srcs;
      |                       ^   
      |                            = 0
FAILED: [code=1] meson-internal__clang-tidy 
/nix/store/sc7hggvmvma7m8bbgmp8gsa1q1x37aq8-meson-1.10.2/bin/meson --internal clangtidy /build/source /build/source/build --color always
ninja: build stopped: subcommand failed.
failed checks.x86_64-linux.clang-tidy 21s
nix-grpc-store-clang-tidy-0.1.0-beta.1: | const ../src/nix-compat.hh:296:23: error: variable 'srcs' is not initialized [cppcoreguidelines-init-var …
nix-grpc-store-clang-tidy-0.1.0-beta.1:
      |        const 
../src/nix-compat.hh:296:23: error: variable 'srcs' is not initialized [cppcoreguidelines-init-variables,-warnings-as-errors]
  296 |     nix::StorePathSet srcs;
      |                       ^   
      |                            = 0
FAILED: [code=1] meson-internal__clang-tidy 
/nix/store/jaa89dphx07w3r26y7gh79a7b1mld5p4-meson-1.10.2/bin/meson --internal clangtidy /build/source /build/source/build --color always
ninja: build stopped: subcommand failed.
26 cancelled
cancelled attributes
status attribute duration
loading…
4 succeeded
succeeded attributes
status attribute duration
loading…
5 already built
skipped attributes
status attribute duration
loading…